lucenenet-dev mailing list archives

Site index · List index
Message view « Date » · « Thread »
Top « Date » · « Thread »
From TeamCity at Codebetter ...@codebetter.com>
Subject [TeamCity, FAILED] Build Lucene.NET :: Lucene.NET Nightly [master] #641
Date Tue, 16 Aug 2016 09:49:25 GMT
Build Lucene.NET :: Lucene.NET Nightly [master] #641 failed (Tests failed: 518 (4 new), passed:
2374, ignored: 174; snapshot dependency failed: ... Lucene.NET Core).
Agent: JetBrains-dotnet-agent02
Build results: http://teamcity.codebetter.com/viewLog.html?buildId=225520&buildTypeId=LuceneNet_LuceneNetNightly

Failed Tests Summary:
Newly failed tests (4 tests, alphabetically ordered)
==================================================================
Lucene.Net.Tests.dll: Lucene.Net.Index.TestBagOfPositions.Test
Lucene.Net.Tests.dll: Lucene.Net.Index.TestSizeBoundedForceMerge.TestSingleNonMergeableSegment
Lucene.Net.Tests.dll: Lucene.Net.Util.TestOpenBitSet.BaseDocIdSetTestCase`1.TestAgainstBitSet
Lucene.Net.Tests.dll: Lucene.Net.Util.TestPagedBytes.TestDataInputOutput2

Other failed tests (514 tests, alphabetically ordered, only first 100 shown)
==================================================================
Lucene.Net.Tests.dll: Lucene.Net.Codecs.Lucene3x.TestImpersonation.Test
Lucene.Net.Tests.dll: Lucene.Net.Codecs.Lucene3x.TestLucene3xPostingsFormat.BaseIndexFileFormatTestCase.TestMergeStability
Lucene.Net.Tests.dll: Lucene.Net.Codecs.Lucene3x.TestLucene3xStoredFieldsFormat.BaseIndexFileFormatTestCase.TestMergeStability
Lucene.Net.Tests.dll: Lucene.Net.Codecs.Lucene3x.TestLucene3xStoredFieldsFormat.BaseStoredFieldsFormatTestCase.TestBigDocuments
Lucene.Net.Tests.dll: Lucene.Net.Codecs.Lucene3x.TestLucene3xStoredFieldsFormat.BaseStoredFieldsFormatTestCase.TestBinaryFieldOffsetLength
Lucene.Net.Tests.dll: Lucene.Net.Codecs.Lucene3x.TestLucene3xStoredFieldsFormat.BaseStoredFieldsFormatTestCase.TestBulkMergeWithDeletes
Lucene.Net.Tests.dll: Lucene.Net.Codecs.Lucene3x.TestLucene3xStoredFieldsFormat.BaseStoredFieldsFormatTestCase.TestConcurrentReads
Lucene.Net.Tests.dll: Lucene.Net.Codecs.Lucene3x.TestLucene3xStoredFieldsFormat.BaseStoredFieldsFormatTestCase.TestEmptyDocs
Lucene.Net.Tests.dll: Lucene.Net.Codecs.Lucene3x.TestLucene3xStoredFieldsFormat.BaseStoredFieldsFormatTestCase.TestIndexedBit
Lucene.Net.Tests.dll: Lucene.Net.Codecs.Lucene3x.TestLucene3xStoredFieldsFormat.BaseStoredFieldsFormatTestCase.TestReadSkip
Lucene.Net.Tests.dll: Lucene.Net.Codecs.Lucene3x.TestLucene3xStoredFieldsFormat.BaseStoredFieldsFormatTestCase.TestStoredFieldsOrder
Lucene.Net.Tests.dll: Lucene.Net.Codecs.Lucene3x.TestLucene3xTermVectorsFormat.BaseIndexFileFormatTestCase.TestMergeStability
Lucene.Net.Tests.dll: Lucene.Net.Codecs.Lucene3x.TestLucene3xTermVectorsFormat.BaseTermVectorsFormatTestCase.TestClone
Lucene.Net.Tests.dll: Lucene.Net.Codecs.Lucene3x.TestLucene3xTermVectorsFormat.BaseTermVectorsFormatTestCase.TestHighFreqs
Lucene.Net.Tests.dll: Lucene.Net.Codecs.Lucene3x.TestLucene3xTermVectorsFormat.BaseTermVectorsFormatTestCase.TestLotsOfFields
Lucene.Net.Tests.dll: Lucene.Net.Codecs.Lucene3x.TestLucene3xTermVectorsFormat.BaseTermVectorsFormatTestCase.TestMerge
Lucene.Net.Tests.dll: Lucene.Net.Codecs.Lucene3x.TestLucene3xTermVectorsFormat.BaseTermVectorsFormatTestCase.TestMixedOptions
Lucene.Net.Tests.dll: Lucene.Net.Codecs.Lucene3x.TestLucene3xTermVectorsFormat.BaseTermVectorsFormatTestCase.TestRandom
Lucene.Net.Tests.dll: Lucene.Net.Codecs.Lucene3x.TestLucene3xTermVectorsFormat.BaseTermVectorsFormatTestCase.TestRareVectors
Lucene.Net.Tests.dll: Lucene.Net.Codecs.Lucene3x.TestSurrogates.TestSurrogatesOrder
Lucene.Net.Tests.dll: Lucene.Net.Codecs.Lucene3x.TestTermInfosReaderIndex
Lucene.Net.Tests.dll: Lucene.Net.Codecs.Lucene40.TestLucene40DocValuesFormat.BaseDocValuesFormatTestCase.TestBinaryFixedLengthVsStoredFields
Lucene.Net.Tests.dll: Lucene.Net.Codecs.Lucene40.TestLucene40DocValuesFormat.BaseDocValuesFormatTestCase.TestBinaryVariableLengthVsStoredFields
Lucene.Net.Tests.dll: Lucene.Net.Codecs.Lucene40.TestLucene40DocValuesFormat.BaseDocValuesFormatTestCase.TestBooleanNumericsVsStoredFields
Lucene.Net.Tests.dll: Lucene.Net.Codecs.Lucene40.TestLucene40DocValuesFormat.BaseDocValuesFormatTestCase.TestByteNumericsVsStoredFields
Lucene.Net.Tests.dll: Lucene.Net.Codecs.Lucene40.TestLucene40DocValuesFormat.BaseDocValuesFormatTestCase.TestBytes
Lucene.Net.Tests.dll: Lucene.Net.Codecs.Lucene40.TestLucene40DocValuesFormat.BaseDocValuesFormatTestCase.TestBytesTwoDocumentsMerged
Lucene.Net.Tests.dll: Lucene.Net.Codecs.Lucene40.TestLucene40DocValuesFormat.BaseDocValuesFormatTestCase.TestDocValuesSimple
Lucene.Net.Tests.dll: Lucene.Net.Codecs.Lucene40.TestLucene40DocValuesFormat.BaseDocValuesFormatTestCase.TestGCDCompression
Lucene.Net.Tests.dll: Lucene.Net.Codecs.Lucene40.TestLucene40DocValuesFormat.BaseDocValuesFormatTestCase.TestHugeBinaryValueLimit
Lucene.Net.Tests.dll: Lucene.Net.Codecs.Lucene40.TestLucene40DocValuesFormat.BaseDocValuesFormatTestCase.TestIntNumericsVsStoredFields
Lucene.Net.Tests.dll: Lucene.Net.Codecs.Lucene40.TestLucene40DocValuesFormat.BaseDocValuesFormatTestCase.TestLongNumericsVsStoredFields
Lucene.Net.Tests.dll: Lucene.Net.Codecs.Lucene40.TestLucene40DocValuesFormat.BaseDocValuesFormatTestCase.TestOneFloat
Lucene.Net.Tests.dll: Lucene.Net.Codecs.Lucene40.TestLucene40DocValuesFormat.BaseDocValuesFormatTestCase.TestOneNumber
Lucene.Net.Tests.dll: Lucene.Net.Codecs.Lucene40.TestLucene40DocValuesFormat.BaseDocValuesFormatTestCase.TestRandomSortedBytes
Lucene.Net.Tests.dll: Lucene.Net.Codecs.Lucene40.TestLucene40DocValuesFormat.BaseDocValuesFormatTestCase.TestShortNumericsVsStoredFields
Lucene.Net.Tests.dll: Lucene.Net.Codecs.Lucene40.TestLucene40DocValuesFormat.BaseDocValuesFormatTestCase.TestSortedBytes
Lucene.Net.Tests.dll: Lucene.Net.Codecs.Lucene40.TestLucene40DocValuesFormat.BaseDocValuesFormatTestCase.TestSortedBytesTwoDocumentsMerged
Lucene.Net.Tests.dll: Lucene.Net.Codecs.Lucene40.TestLucene40DocValuesFormat.BaseDocValuesFormatTestCase.TestSortedFixedLengthVsFieldCache
Lucene.Net.Tests.dll: Lucene.Net.Codecs.Lucene40.TestLucene40DocValuesFormat.BaseDocValuesFormatTestCase.TestSortedFixedLengthVsStoredFields
Lucene.Net.Tests.dll: Lucene.Net.Codecs.Lucene40.TestLucene40DocValuesFormat.BaseDocValuesFormatTestCase.TestSortedMergeAwayAllValues
Lucene.Net.Tests.dll: Lucene.Net.Codecs.Lucene40.TestLucene40DocValuesFormat.BaseDocValuesFormatTestCase.TestSortedVariableLengthVsFieldCache
Lucene.Net.Tests.dll: Lucene.Net.Codecs.Lucene40.TestLucene40DocValuesFormat.BaseDocValuesFormatTestCase.TestSortedVariableLengthVsStoredFields
Lucene.Net.Tests.dll: Lucene.Net.Codecs.Lucene40.TestLucene40DocValuesFormat.BaseDocValuesFormatTestCase.TestThreads
Lucene.Net.Tests.dll: Lucene.Net.Codecs.Lucene40.TestLucene40DocValuesFormat.BaseDocValuesFormatTestCase.TestThreeFieldsMixed
Lucene.Net.Tests.dll: Lucene.Net.Codecs.Lucene40.TestLucene40DocValuesFormat.BaseDocValuesFormatTestCase.TestThreeFieldsMixed2
Lucene.Net.Tests.dll: Lucene.Net.Codecs.Lucene40.TestLucene40DocValuesFormat.BaseDocValuesFormatTestCase.TestTwoBinaryValues
Lucene.Net.Tests.dll: Lucene.Net.Codecs.Lucene40.TestLucene40DocValuesFormat.BaseDocValuesFormatTestCase.TestTwoDocumentsMerged
Lucene.Net.Tests.dll: Lucene.Net.Codecs.Lucene40.TestLucene40DocValuesFormat.BaseDocValuesFormatTestCase.TestTwoFieldsMixed
Lucene.Net.Tests.dll: Lucene.Net.Codecs.Lucene40.TestLucene40DocValuesFormat.BaseDocValuesFormatTestCase.TestTwoNumbers
Lucene.Net.Tests.dll: Lucene.Net.Codecs.Lucene40.TestLucene40PostingsFormat.BaseIndexFileFormatTestCase.TestMergeStability
Lucene.Net.Tests.dll: Lucene.Net.Codecs.Lucene40.TestLucene40PostingsFormat.BasePostingsFormatTestCase.TestDocsAndFreqs
Lucene.Net.Tests.dll: Lucene.Net.Codecs.Lucene40.TestLucene40PostingsFormat.BasePostingsFormatTestCase.TestDocsAndFreqsAndPositions
Lucene.Net.Tests.dll: Lucene.Net.Codecs.Lucene40.TestLucene40PostingsFormat.BasePostingsFormatTestCase.TestDocsAndFreqsAndPositionsAndOffsets
Lucene.Net.Tests.dll: Lucene.Net.Codecs.Lucene40.TestLucene40PostingsFormat.BasePostingsFormatTestCase.TestDocsAndFreqsAndPositionsAndOffsetsAndPayloads
Lucene.Net.Tests.dll: Lucene.Net.Codecs.Lucene40.TestLucene40PostingsFormat.BasePostingsFormatTestCase.TestDocsAndFreqsAndPositionsAndPayloads
Lucene.Net.Tests.dll: Lucene.Net.Codecs.Lucene40.TestLucene40PostingsFormat.BasePostingsFormatTestCase.TestDocsOnly
Lucene.Net.Tests.dll: Lucene.Net.Codecs.Lucene40.TestLucene40PostingsFormat.BasePostingsFormatTestCase.TestRandom
Lucene.Net.Tests.dll: Lucene.Net.Codecs.Lucene40.TestLucene40PostingsReader.TestPostings
Lucene.Net.Tests.dll: Lucene.Net.Codecs.Lucene40.TestLucene40StoredFieldsFormat.BaseStoredFieldsFormatTestCase.TestBigDocuments
Lucene.Net.Tests.dll: Lucene.Net.Codecs.Lucene40.TestLucene40StoredFieldsFormat.BaseStoredFieldsFormatTestCase.TestBulkMergeWithDeletes
Lucene.Net.Tests.dll: Lucene.Net.Codecs.Lucene40.TestLucene40StoredFieldsFormat.BaseStoredFieldsFormatTestCase.TestConcurrentReads
Lucene.Net.Tests.dll: Lucene.Net.Codecs.Lucene40.TestLucene40StoredFieldsFormat.BaseStoredFieldsFormatTestCase.TestIndexedBit
Lucene.Net.Tests.dll: Lucene.Net.Codecs.Lucene40.TestLucene40StoredFieldsFormat.BaseStoredFieldsFormatTestCase.TestReadSkip
Lucene.Net.Tests.dll: Lucene.Net.Codecs.Lucene40.TestLucene40StoredFieldsFormat.BaseStoredFieldsFormatTestCase.TestWriteReadMerge
Lucene.Net.Tests.dll: Lucene.Net.Codecs.Lucene40.TestLucene40TermVectorsFormat.BaseIndexFileFormatTestCase.TestMergeStability
Lucene.Net.Tests.dll: Lucene.Net.Codecs.Lucene40.TestLucene40TermVectorsFormat.BaseTermVectorsFormatTestCase.TestClone
Lucene.Net.Tests.dll: Lucene.Net.Codecs.Lucene40.TestLucene40TermVectorsFormat.BaseTermVectorsFormatTestCase.TestHighFreqs
Lucene.Net.Tests.dll: Lucene.Net.Codecs.Lucene40.TestLucene40TermVectorsFormat.BaseTermVectorsFormatTestCase.TestLotsOfFields
Lucene.Net.Tests.dll: Lucene.Net.Codecs.Lucene40.TestLucene40TermVectorsFormat.BaseTermVectorsFormatTestCase.TestMerge
Lucene.Net.Tests.dll: Lucene.Net.Codecs.Lucene40.TestLucene40TermVectorsFormat.BaseTermVectorsFormatTestCase.TestMixedOptions
Lucene.Net.Tests.dll: Lucene.Net.Codecs.Lucene40.TestLucene40TermVectorsFormat.BaseTermVectorsFormatTestCase.TestRandom
Lucene.Net.Tests.dll: Lucene.Net.Codecs.Lucene40.TestLucene40TermVectorsFormat.BaseTermVectorsFormatTestCase.TestRareVectors
Lucene.Net.Tests.dll: Lucene.Net.Codecs.Lucene41.TestBlockPostingsFormat3.Test
Lucene.Net.Tests.dll: Lucene.Net.Codecs.Perfield.TestPerFieldPostingsFormat2.TestChangeCodecAndMerge
Lucene.Net.Tests.dll: Lucene.Net.Codecs.Perfield.TestPerFieldPostingsFormat2.TestMergeUnusedPerFieldCodec
Lucene.Net.Tests.dll: Lucene.Net.Codecs.Perfield.TestPerFieldPostingsFormat2.TestSameCodecDifferentInstance
Lucene.Net.Tests.dll: Lucene.Net.Codecs.Perfield.TestPerFieldPostingsFormat2.TestSameCodecDifferentParams
Lucene.Net.Tests.dll: Lucene.Net.Document.TestDocument.TestFieldSetValue
Lucene.Net.Tests.dll: Lucene.Net.Index.TestAddIndexes.TestAddIndexesWithClose
Lucene.Net.Tests.dll: Lucene.Net.Index.TestAddIndexes.TestAddIndexesWithCloseNoWait
Lucene.Net.Tests.dll: Lucene.Net.Index.TestAddIndexes.TestAddIndexesWithRollback
Lucene.Net.Tests.dll: Lucene.Net.Index.TestAddIndexes.TestAddIndexesWithThreads
Lucene.Net.Tests.dll: Lucene.Net.Index.TestAddIndexes.TestAddSelf
Lucene.Net.Tests.dll: Lucene.Net.Index.TestAddIndexes.TestExistingDeletes
Lucene.Net.Tests.dll: Lucene.Net.Index.TestAddIndexes.TestFieldNamesChanged
Lucene.Net.Tests.dll: Lucene.Net.Index.TestAddIndexes.TestHangOnClose
Lucene.Net.Tests.dll: Lucene.Net.Index.TestAddIndexes.TestMergeAfterCopy
Lucene.Net.Tests.dll: Lucene.Net.Index.TestAddIndexes.TestMoreMerges
Lucene.Net.Tests.dll: Lucene.Net.Index.TestAddIndexes.TestNoCopySegments
Lucene.Net.Tests.dll: Lucene.Net.Index.TestAddIndexes.TestNoMergeAfterCopy
Lucene.Net.Tests.dll: Lucene.Net.Index.TestAddIndexes.TestNoTailSegments
Lucene.Net.Tests.dll: Lucene.Net.Index.TestAddIndexes.TestSimpleCase
Lucene.Net.Tests.dll: Lucene.Net.Index.TestAddIndexes.TestWithPendingDeletes
Lucene.Net.Tests.dll: Lucene.Net.Index.TestAddIndexes.TestWithPendingDeletes2
Lucene.Net.Tests.dll: Lucene.Net.Index.TestAddIndexes.TestWithPendingDeletes3



Newly failed tests details (only first 3 failures shown here)
==================================================================
Lucene.Net.Tests.dll: Lucene.Net.Index.TestBagOfPositions.Test (new) =================
Test(s) failed. Test exceeded Timeout value of 20000ms

------- Stderr: -------
Unhandled exception in remote appdomain: Lucene.Net.Index.MergePolicy+MergeException: Specified
argument was out of the range of valid values.
Parameter name: toIndex
   at Lucene.Net.Index.ConcurrentMergeScheduler.HandleMergeException(Exception exc) in z:\Builds\work\bcdbe6b8cc677a49\src\Lucene.Net.Core\Index\ConcurrentMergeScheduler.cs:line
718
   at Lucene.Net.Index.ConcurrentMergeScheduler.MergeThread.Run() in z:\Builds\work\bcdbe6b8cc677a49\src\Lucene.Net.Core\Index\ConcurrentMergeScheduler.cs:line
682
   at System.Threading.ThreadHelper.ThreadStart_Context(Object state)
   at System.Threading.ExecutionContext.RunInternal(ExecutionContext executionContext, ContextCallback
callback, Object state, Boolean preserveSyncCtx)
   at System.Threading.ExecutionContext.Run(ExecutionContext executionContext, ContextCallback
callback, Object state, Boolean preserveSyncCtx)
   at System.Threading.ExecutionContext.Run(ExecutionContext executionContext, ContextCallback
callback, Object state)
   at System.Threading.ThreadHelper.ThreadStart()
Unhandled exception in remote appdomain: Lucene.Net.Index.MergePolicy+MergeException: Specified
argument was out of the range of valid values.
Parameter name: toIndex
   at Lucene.Net.Index.ConcurrentMergeScheduler.HandleMergeException(Exception exc) in z:\Builds\work\bcdbe6b8cc677a49\src\Lucene.Net.Core\Index\ConcurrentMergeScheduler.cs:line
718
   at Lucene.Net.Index.ConcurrentMergeScheduler.MergeThread.Run() in z:\Builds\work\bcdbe6b8cc677a49\src\Lucene.Net.Core\Index\ConcurrentMergeScheduler.cs:line
682
   at System.Threading.ThreadHelper.ThreadStart_Context(Object state)
   at System.Threading.ExecutionContext.RunInternal(ExecutionContext executionContext, ContextCallback
callback, Object state, Boolean preserveSyncCtx)
   at System.Threading.ExecutionContext.Run(ExecutionContext executionContext, ContextCallback
callback, Object state, Boolean preserveSyncCtx)
   at System.Threading.ExecutionContext.Run(ExecutionContext executionContext, ContextCallback
callback, Object state)
   at System.Threading.ThreadHelper.ThreadStart()
Lucene.Net.Tests.dll: Lucene.Net.Index.TestSizeBoundedForceMerge.TestSingleNonMergeableSegment
(new) =================
Test(s) failed. System.IO.IOException : background merge hit exception: _0(4.8):c3 into _1
[maxNumSegments=1]
  ----> System.ArgumentOutOfRangeException : Specified argument was out of the range of
valid values.
Parameter name: toIndex
   at Lucene.Net.Index.IndexWriter.ForceMerge(Int32 maxNumSegments, Boolean doWait) in z:\Builds\work\bcdbe6b8cc677a49\src\Lucene.Net.Core\Index\IndexWriter.cs:line
2179
   at Lucene.Net.Index.IndexWriter.ForceMerge(Int32 maxNumSegments) in z:\Builds\work\bcdbe6b8cc677a49\src\Lucene.Net.Core\Index\IndexWriter.cs:line
2100
   at Lucene.Net.Index.TestSizeBoundedForceMerge.TestSingleNonMergeableSegment() in z:\Builds\work\bcdbe6b8cc677a49\src\Lucene.Net.Tests\core\Index\TestSizeBoundedForceMerge.cs:line
363
--ArgumentOutOfRangeException
   at Lucene.Net.Util.IOUtils.ReThrow(Exception th) in z:\Builds\work\bcdbe6b8cc677a49\src\Lucene.Net.Core\Util\IOUtils.cs:line
418
   at Lucene.Net.Index.IndexWriter.HandleMergeException(Exception t, OneMerge merge) in z:\Builds\work\bcdbe6b8cc677a49\src\Lucene.Net.Core\Index\IndexWriter.cs:line
4531
   at Lucene.Net.Index.IndexWriter.Merge(OneMerge merge) in z:\Builds\work\bcdbe6b8cc677a49\src\Lucene.Net.Core\Index\IndexWriter.cs:line
4569
   at Lucene.Net.Index.ConcurrentMergeScheduler.DoMerge(OneMerge merge) in z:\Builds\work\bcdbe6b8cc677a49\src\Lucene.Net.Core\Index\ConcurrentMergeScheduler.cs:line
514
   at Lucene.Net.Index.ConcurrentMergeScheduler.MergeThread.Run() in z:\Builds\work\bcdbe6b8cc677a49\src\Lucene.Net.Core\Index\ConcurrentMergeScheduler.cs:line
638
Lucene.Net.Tests.dll: Lucene.Net.Util.TestOpenBitSet.BaseDocIdSetTestCase`1.TestAgainstBitSet
(new) =================
Test(s) failed. Test exceeded Timeout value of 150000ms

see all newly failed tests: http://teamcity.codebetter.com/viewLog.html?buildId=225520&buildTypeId=LuceneNet_LuceneNetNightly
Changes included (6 changes)
====================================================
Change 80c9e8c953f405c54a231a94856279bf0a217d7e by itamar (10 files):
Merge remote-tracking branch '888/lucenenet-indexablefield-api'


Change 73f6094db4cde40343566d9c52398430f4ccbdc6 by shad (1 file):
Updated IndexableField references in Lucene.Net.Suggest\Suggest\DocumentDictionary


Change cf2396b91a8e3b87ce978d7dbb4ec6cfc6b11b48 by shad (19 files):
Changed IndexableField.BinaryValue() to IndexableField.BinaryValue (method into a property)
for API consistency.


Change 87aa4246960f41cf2df24e2561f2ef981f14f60d by shad (6 files):
Changed IndexableField.GetBoost() to IndexableField.Boost (method into a property) for API
consistency.


Change b83de2cdfe86edc1e284121b39afb8ba5ea72be9 by shad (23 files):
Changed IndexableField.FieldType() to IndexableField.FieldType (method into a property) for
API consistency.


Change 3c2c4f470ee8db976c03757e79be9303bc78b4d9 by shad (24 files):
Changed IndexableField.Name() to IndexableField.Name (method into a property) for API consistency.


see more information about changed files: http://teamcity.codebetter.com/viewLog.html?tab=buildChangesDiv&buildId=225520&buildTypeId=LuceneNet_LuceneNetNightly

============================================================================
Configure email notifications: http://teamcity.codebetter.com/profile.html?init=1&tab=userNotifications

Mime
  • Unnamed multipart/alternative (inline, None, 0 bytes)
View raw message