lucenenet-dev mailing list archives

Site index · List index
Message view « Date » · « Thread »
Top « Date » · « Thread »
From TeamCity at Codebetter ...@codebetter.com>
Subject [TeamCity, FAILED] Build Lucene.NET :: [vs2015] Lucene.NET Core [master] #6
Date Sun, 10 Apr 2016 17:54:59 GMT
Build Lucene.NET :: [vs2015] Lucene.NET Core [master] #6 failed (Tests failed: 75 (4 new),
passed: 2388, ignored: 110).
Agent: JetBrains-dotnet-agent01
Build results: http://teamcity.codebetter.com/viewLog.html?buildId=215120&buildTypeId=LuceneNet_Vs2015LuceneNetCore

Failed Tests Summary:
Newly failed tests (4 tests, alphabetically ordered)
==================================================================
Lucene.Net.Tests.dll: Lucene.Net.Index.TestBagOfPositions.Test
Lucene.Net.Tests.dll: Lucene.Net.Index.TestNeverDelete.TestIndexing
Lucene.Net.Tests.dll: Lucene.Net.Index.TestNumericDocValuesUpdates.TestUpdateOldSegments
Lucene.Net.Tests.dll: Lucene.Net.Search.TestShardSearching.TestSimple

Other failed tests (71 tests, alphabetically ordered)
==================================================================
Lucene.Net.Tests.dll: Lucene.Net.Codecs.Lucene3x.TestImpersonation.Test
Lucene.Net.Tests.dll: Lucene.Net.Codecs.Lucene3x.TestLucene3xPostingsFormat.BaseIndexFileFormatTestCase.TestMergeStability
Lucene.Net.Tests.dll: Lucene.Net.Codecs.Lucene3x.TestLucene3xStoredFieldsFormat.BaseIndexFileFormatTestCase.TestMergeStability
Lucene.Net.Tests.dll: Lucene.Net.Codecs.Lucene3x.TestLucene3xStoredFieldsFormat.BaseStoredFieldsFormatTestCase.TestBinaryFieldOffsetLength
Lucene.Net.Tests.dll: Lucene.Net.Codecs.Lucene3x.TestLucene3xStoredFieldsFormat.BaseStoredFieldsFormatTestCase.TestBulkMergeWithDeletes
Lucene.Net.Tests.dll: Lucene.Net.Codecs.Lucene3x.TestLucene3xStoredFieldsFormat.BaseStoredFieldsFormatTestCase.TestConcurrentReads
Lucene.Net.Tests.dll: Lucene.Net.Codecs.Lucene3x.TestLucene3xStoredFieldsFormat.BaseStoredFieldsFormatTestCase.TestEmptyDocs
Lucene.Net.Tests.dll: Lucene.Net.Codecs.Lucene3x.TestLucene3xStoredFieldsFormat.BaseStoredFieldsFormatTestCase.TestIndexedBit
Lucene.Net.Tests.dll: Lucene.Net.Codecs.Lucene3x.TestLucene3xStoredFieldsFormat.BaseStoredFieldsFormatTestCase.TestReadSkip
Lucene.Net.Tests.dll: Lucene.Net.Codecs.Lucene3x.TestLucene3xStoredFieldsFormat.BaseStoredFieldsFormatTestCase.TestStoredFieldsOrder
Lucene.Net.Tests.dll: Lucene.Net.Codecs.Lucene3x.TestLucene3xTermVectorsFormat.BaseIndexFileFormatTestCase.TestMergeStability
Lucene.Net.Tests.dll: Lucene.Net.Codecs.Lucene3x.TestLucene3xTermVectorsFormat.BaseTermVectorsFormatTestCase.TestClone
Lucene.Net.Tests.dll: Lucene.Net.Codecs.Lucene3x.TestLucene3xTermVectorsFormat.BaseTermVectorsFormatTestCase.TestHighFreqs
Lucene.Net.Tests.dll: Lucene.Net.Codecs.Lucene3x.TestLucene3xTermVectorsFormat.BaseTermVectorsFormatTestCase.TestMerge
Lucene.Net.Tests.dll: Lucene.Net.Codecs.Lucene3x.TestLucene3xTermVectorsFormat.BaseTermVectorsFormatTestCase.TestMixedOptions
Lucene.Net.Tests.dll: Lucene.Net.Codecs.Lucene3x.TestLucene3xTermVectorsFormat.BaseTermVectorsFormatTestCase.TestRandom
Lucene.Net.Tests.dll: Lucene.Net.Codecs.Lucene3x.TestLucene3xTermVectorsFormat.BaseTermVectorsFormatTestCase.TestRareVectors
Lucene.Net.Tests.dll: Lucene.Net.Codecs.Lucene3x.TestSurrogates.TestSurrogatesOrder
Lucene.Net.Tests.dll: Lucene.Net.Codecs.Lucene3x.TestTermInfosReaderIndex
Lucene.Net.Tests.dll: Lucene.Net.Codecs.Lucene40.TestLucene40DocValuesFormat.BaseDocValuesFormatTestCase.TestBinaryFixedLengthVsStoredFields
Lucene.Net.Tests.dll: Lucene.Net.Codecs.Lucene40.TestLucene40DocValuesFormat.BaseDocValuesFormatTestCase.TestBinaryVariableLengthVsStoredFields
Lucene.Net.Tests.dll: Lucene.Net.Codecs.Lucene40.TestLucene40DocValuesFormat.BaseDocValuesFormatTestCase.TestBooleanNumericsVsStoredFields
Lucene.Net.Tests.dll: Lucene.Net.Codecs.Lucene40.TestLucene40DocValuesFormat.BaseDocValuesFormatTestCase.TestByteNumericsVsStoredFields
Lucene.Net.Tests.dll: Lucene.Net.Codecs.Lucene40.TestLucene40DocValuesFormat.BaseDocValuesFormatTestCase.TestBytes
Lucene.Net.Tests.dll: Lucene.Net.Codecs.Lucene40.TestLucene40DocValuesFormat.BaseDocValuesFormatTestCase.TestBytesTwoDocumentsMerged
Lucene.Net.Tests.dll: Lucene.Net.Codecs.Lucene40.TestLucene40DocValuesFormat.BaseDocValuesFormatTestCase.TestDocValuesSimple
Lucene.Net.Tests.dll: Lucene.Net.Codecs.Lucene40.TestLucene40DocValuesFormat.BaseDocValuesFormatTestCase.TestGCDCompression
Lucene.Net.Tests.dll: Lucene.Net.Codecs.Lucene40.TestLucene40DocValuesFormat.BaseDocValuesFormatTestCase.TestHugeBinaryValueLimit
Lucene.Net.Tests.dll: Lucene.Net.Codecs.Lucene40.TestLucene40DocValuesFormat.BaseDocValuesFormatTestCase.TestIntNumericsVsStoredFields
Lucene.Net.Tests.dll: Lucene.Net.Codecs.Lucene40.TestLucene40DocValuesFormat.BaseDocValuesFormatTestCase.TestLongNumericsVsStoredFields
Lucene.Net.Tests.dll: Lucene.Net.Codecs.Lucene40.TestLucene40DocValuesFormat.BaseDocValuesFormatTestCase.TestOneFloat
Lucene.Net.Tests.dll: Lucene.Net.Codecs.Lucene40.TestLucene40DocValuesFormat.BaseDocValuesFormatTestCase.TestOneNumber
Lucene.Net.Tests.dll: Lucene.Net.Codecs.Lucene40.TestLucene40DocValuesFormat.BaseDocValuesFormatTestCase.TestRandomSortedBytes
Lucene.Net.Tests.dll: Lucene.Net.Codecs.Lucene40.TestLucene40DocValuesFormat.BaseDocValuesFormatTestCase.TestShortNumericsVsStoredFields
Lucene.Net.Tests.dll: Lucene.Net.Codecs.Lucene40.TestLucene40DocValuesFormat.BaseDocValuesFormatTestCase.TestSortedBytes
Lucene.Net.Tests.dll: Lucene.Net.Codecs.Lucene40.TestLucene40DocValuesFormat.BaseDocValuesFormatTestCase.TestSortedBytesTwoDocumentsMerged
Lucene.Net.Tests.dll: Lucene.Net.Codecs.Lucene40.TestLucene40DocValuesFormat.BaseDocValuesFormatTestCase.TestSortedFixedLengthVsFieldCache
Lucene.Net.Tests.dll: Lucene.Net.Codecs.Lucene40.TestLucene40DocValuesFormat.BaseDocValuesFormatTestCase.TestSortedFixedLengthVsStoredFields
Lucene.Net.Tests.dll: Lucene.Net.Codecs.Lucene40.TestLucene40DocValuesFormat.BaseDocValuesFormatTestCase.TestSortedMergeAwayAllValues
Lucene.Net.Tests.dll: Lucene.Net.Codecs.Lucene40.TestLucene40DocValuesFormat.BaseDocValuesFormatTestCase.TestSortedVariableLengthVsFieldCache
Lucene.Net.Tests.dll: Lucene.Net.Codecs.Lucene40.TestLucene40DocValuesFormat.BaseDocValuesFormatTestCase.TestSortedVariableLengthVsStoredFields
Lucene.Net.Tests.dll: Lucene.Net.Codecs.Lucene40.TestLucene40DocValuesFormat.BaseDocValuesFormatTestCase.TestThreads
Lucene.Net.Tests.dll: Lucene.Net.Codecs.Lucene40.TestLucene40DocValuesFormat.BaseDocValuesFormatTestCase.TestThreeFieldsMixed
Lucene.Net.Tests.dll: Lucene.Net.Codecs.Lucene40.TestLucene40DocValuesFormat.BaseDocValuesFormatTestCase.TestThreeFieldsMixed2
Lucene.Net.Tests.dll: Lucene.Net.Codecs.Lucene40.TestLucene40DocValuesFormat.BaseDocValuesFormatTestCase.TestTwoBinaryValues
Lucene.Net.Tests.dll: Lucene.Net.Codecs.Lucene40.TestLucene40DocValuesFormat.BaseDocValuesFormatTestCase.TestTwoDocumentsMerged
Lucene.Net.Tests.dll: Lucene.Net.Codecs.Lucene40.TestLucene40DocValuesFormat.BaseDocValuesFormatTestCase.TestTwoFieldsMixed
Lucene.Net.Tests.dll: Lucene.Net.Codecs.Lucene40.TestLucene40DocValuesFormat.BaseDocValuesFormatTestCase.TestTwoNumbers
Lucene.Net.Tests.dll: Lucene.Net.Codecs.Lucene40.TestLucene40PostingsFormat.BaseIndexFileFormatTestCase.TestMergeStability
Lucene.Net.Tests.dll: Lucene.Net.Codecs.Lucene40.TestLucene40PostingsFormat.BasePostingsFormatTestCase.TestDocsAndFreqs
Lucene.Net.Tests.dll: Lucene.Net.Codecs.Lucene40.TestLucene40PostingsFormat.BasePostingsFormatTestCase.TestDocsAndFreqsAndPositions
Lucene.Net.Tests.dll: Lucene.Net.Codecs.Lucene40.TestLucene40PostingsFormat.BasePostingsFormatTestCase.TestDocsAndFreqsAndPositionsAndOffsets
Lucene.Net.Tests.dll: Lucene.Net.Codecs.Lucene40.TestLucene40PostingsFormat.BasePostingsFormatTestCase.TestDocsAndFreqsAndPositionsAndOffsetsAndPayloads
Lucene.Net.Tests.dll: Lucene.Net.Codecs.Lucene40.TestLucene40PostingsFormat.BasePostingsFormatTestCase.TestDocsAndFreqsAndPositionsAndPayloads
Lucene.Net.Tests.dll: Lucene.Net.Codecs.Lucene40.TestLucene40PostingsFormat.BasePostingsFormatTestCase.TestDocsOnly
Lucene.Net.Tests.dll: Lucene.Net.Codecs.Lucene40.TestLucene40PostingsFormat.BasePostingsFormatTestCase.TestRandom
Lucene.Net.Tests.dll: Lucene.Net.Codecs.Lucene40.TestLucene40PostingsReader.TestPostings
Lucene.Net.Tests.dll: Lucene.Net.Codecs.Lucene40.TestLucene40StoredFieldsFormat.BaseStoredFieldsFormatTestCase.TestBulkMergeWithDeletes
Lucene.Net.Tests.dll: Lucene.Net.Codecs.Lucene40.TestLucene40StoredFieldsFormat.BaseStoredFieldsFormatTestCase.TestConcurrentReads
Lucene.Net.Tests.dll: Lucene.Net.Codecs.Lucene40.TestLucene40StoredFieldsFormat.BaseStoredFieldsFormatTestCase.TestIndexedBit
Lucene.Net.Tests.dll: Lucene.Net.Codecs.Lucene40.TestLucene40StoredFieldsFormat.BaseStoredFieldsFormatTestCase.TestReadSkip
Lucene.Net.Tests.dll: Lucene.Net.Codecs.Lucene40.TestLucene40StoredFieldsFormat.BaseStoredFieldsFormatTestCase.TestWriteReadMerge
Lucene.Net.Tests.dll: Lucene.Net.Codecs.Lucene40.TestLucene40TermVectorsFormat.BaseIndexFileFormatTestCase.TestMergeStability
Lucene.Net.Tests.dll: Lucene.Net.Codecs.Lucene40.TestLucene40TermVectorsFormat.BaseTermVectorsFormatTestCase.TestClone
Lucene.Net.Tests.dll: Lucene.Net.Codecs.Lucene40.TestLucene40TermVectorsFormat.BaseTermVectorsFormatTestCase.TestHighFreqs
Lucene.Net.Tests.dll: Lucene.Net.Codecs.Lucene40.TestLucene40TermVectorsFormat.BaseTermVectorsFormatTestCase.TestMerge
Lucene.Net.Tests.dll: Lucene.Net.Codecs.Lucene40.TestLucene40TermVectorsFormat.BaseTermVectorsFormatTestCase.TestMixedOptions
Lucene.Net.Tests.dll: Lucene.Net.Codecs.Lucene40.TestLucene40TermVectorsFormat.BaseTermVectorsFormatTestCase.TestRandom
Lucene.Net.Tests.dll: Lucene.Net.Codecs.Lucene40.TestLucene40TermVectorsFormat.BaseTermVectorsFormatTestCase.TestRareVectors
Lucene.Net.Tests.dll: Lucene.Net.Index.TestDuelingCodecs.TestEquals
Lucene.Net.Tests.dll: Lucene.Net.Store.TestFileSwitchDirectory.TestBasic



Newly failed tests details (only first 3 failures shown here)
==================================================================
Lucene.Net.Tests.dll: Lucene.Net.Index.TestBagOfPositions.Test (new) =================
Test(s) failed.   Expected: 100
  But was:  99

   at NUnit.Framework.Assert.That(Object actual, IResolveConstraint expression, String message,
Object[] args)
   at NUnit.Framework.Assert.AreEqual(Int64 expected, Int64 actual)
   at Lucene.Net.Index.TestBagOfPositions.Test() in Z:\TeamCityAgent\work\bcdbe6b8cc677a49\src\Lucene.Net.Tests\core\Index\TestBagOfPositions.cs:line
136
------- Stdout: -------
WARNING: Leftover undeleted temporary files The process cannot access the file 'write.lock'
because it is being used by another process.
------- Stderr: -------
Unhandled exception in remote appdomain: System.Exception: Index was outside the bounds of
the array. ---> System.IndexOutOfRangeException: Index was outside the bounds of the array.
   at Lucene.Net.Util.IOUtils.ReThrow(Exception th) in Z:\TeamCityAgent\work\bcdbe6b8cc677a49\src\Lucene.Net.Core\Util\IOUtils.cs:line
418
   at Lucene.Net.Util.IOUtils.Close(IDisposable[] objects) in Z:\TeamCityAgent\work\bcdbe6b8cc677a49\src\Lucene.Net.Core\Util\IOUtils.cs:line
176
   at Lucene.Net.Index.FreqProxTermsWriter.Flush(IDictionary`2 fieldsToFlush, SegmentWriteState
state) in Z:\TeamCityAgent\work\bcdbe6b8cc677a49\src\Lucene.Net.Core\Index\FreqProxTermsWriter.cs:line
108
   at Lucene.Net.Index.TermsHash.Flush(IDictionary`2 fieldsToFlush, SegmentWriteState state)
in Z:\TeamCityAgent\work\bcdbe6b8cc677a49\src\Lucene.Net.Core\Index\TermsHash.cs:line 130
   at Lucene.Net.Index.DocInverter.Flush(IDictionary`2 fieldsToFlush, SegmentWriteState state)
in Z:\TeamCityAgent\work\bcdbe6b8cc677a49\src\Lucene.Net.Core\Index\DocInverter.cs:line 53
   at Lucene.Net.Index.DocFieldProcessor.Flush(SegmentWriteState state) in Z:\TeamCityAgent\work\bcdbe6b8cc677a49\src\Lucene.Net.Core\Index\DocFieldProcessor.cs:line
82
   at Lucene.Net.Index.DocumentsWriterPerThread.Flush() in Z:\TeamCityAgent\work\bcdbe6b8cc677a49\src\Lucene.Net.Core\Index\DocumentsWriterPerThread.cs:line
550
   at Lucene.Net.Index.DocumentsWriter.DoFlush(DocumentsWriterPerThread flushingDWPT) in Z:\TeamCityAgent\work\bcdbe6b8cc677a49\src\Lucene.Net.Core\Index\DocumentsWriter.cs:line
635
   at Lucene.Net.Index.DocumentsWriter.PostUpdate(DocumentsWriterPerThread flushingDWPT, Boolean
hasEvents) in Z:\TeamCityAgent\work\bcdbe6b8cc677a49\src\Lucene.Net.Core\Index\DocumentsWriter.cs:line
485
   at Lucene.Net.Index.DocumentsWriter.UpdateDocument(IEnumerable`1 doc, Analyzer analyzer,
Term delTerm) in Z:\TeamCityAgent\work\bcdbe6b8cc677a49\src\Lucene.Net.Core\Index\DocumentsWriter.cs:line
597
   at Lucene.Net.Index.IndexWriter.UpdateDocument(Term term, IEnumerable`1 doc, Analyzer analyzer)
in Z:\TeamCityAgent\work\bcdbe6b8cc677a49\src\Lucene.Net.Core\Index\IndexWriter.cs:line 1831
   at Lucene.Net.Index.IndexWriter.AddDocument(IEnumerable`1 doc, Analyzer analyzer) in Z:\TeamCityAgent\work\bcdbe6b8cc677a49\src\Lucene.Net.Core\Index\IndexWriter.cs:line
1456
   at Lucene.Net.Index.RandomIndexWriter.AddDocument(IEnumerable`1 doc, Analyzer a) in Z:\TeamCityAgent\work\bcdbe6b8cc677a49\src\Lucene.Net.TestFramework\Index\RandomIndexWriter.cs:line
147
   at Lucene.Net.Index.RandomIndexWriter.AddDocument(IEnumerable`1 doc) in Z:\TeamCityAgent\work\bcdbe6b8cc677a49\src\Lucene.Net.TestFramework\Index\RandomIndexWriter.cs:line
132
   at Lucene.Net.Index.TestBagOfPositions.ThreadAnonymousInnerClassHelper.Run() in Z:\TeamCityAgent\work\bcdbe6b8cc677a49\src\Lucene.Net.Tests\core\Index\TestBagOfPositions.cs:line
197
   --- End of inner exception stack trace ---
   at Lucene.Net.Index.TestBagOfPositions.ThreadAnonymousInnerClassHelper.Run() in Z:\TeamCityAgent\work\bcdbe6b8cc677a49\src\Lucene.Net.Tests\core\Index\TestBagOfPositions.cs:line
202
   at System.Threading.ThreadHelper.ThreadStart_Context(Object state)
   at System.Threading.ExecutionContext.RunInternal(ExecutionContext executionContext, ContextCallback
callback, Object state, Boolean preserveSyncCtx)
   at System.Threading.ExecutionContext.Run(ExecutionContext executionContext, ContextCallback
callback, Object state, Boolean preserveSyncCtx)
   at System.Threading.ExecutionContext.Run(ExecutionContext executionContext, ContextCallback
callback, Object state)
   at System.Threading.ThreadHelper.ThreadStart()
Lucene.Net.Tests.dll: Lucene.Net.Index.TestNeverDelete.TestIndexing (new) =================
Test(s) failed. System.ArgumentException : When specifying MemoryMappedFileAccess.Read access,
the capacity must not be larger than the file size.
   at System.IO.MemoryMappedFiles.MemoryMappedFile.CreateFromFile(FileStream fileStream, String
mapName, Int64 capacity, MemoryMappedFileAccess access, MemoryMappedFileSecurity memoryMappedFileSecurity,
HandleInheritability inheritability, Boolean leaveOpen)
   at Lucene.Net.Store.MMapDirectory.Map(MMapIndexInput input, FileStream fc, Int64 offset,
Int64 length) in Z:\TeamCityAgent\work\bcdbe6b8cc677a49\src\Lucene.Net.Core\Store\MMapDirectory.cs:line
350
   at Lucene.Net.Store.MMapDirectory.MMapIndexInput..ctor(MMapDirectory outerInstance, String
resourceDescription, FileStream fc) in Z:\TeamCityAgent\work\bcdbe6b8cc677a49\src\Lucene.Net.Core\Store\MMapDirectory.cs:line
257
   at Lucene.Net.Store.MMapDirectory.OpenInput(String name, IOContext context) in Z:\TeamCityAgent\work\bcdbe6b8cc677a49\src\Lucene.Net.Core\Store\MMapDirectory.cs:line
205
   at Lucene.Net.Store.MockDirectoryWrapper.OpenInput(String name, IOContext context) in Z:\TeamCityAgent\work\bcdbe6b8cc677a49\src\Lucene.Net.TestFramework\Store\MockDirectoryWrapper.cs:line
787
   at Lucene.Net.Store.FilterDirectory.OpenChecksumInput(String name, IOContext context) in
Z:\TeamCityAgent\work\bcdbe6b8cc677a49\src\Lucene.Net.Core\Store\FilterDirectory.cs:line 132
   at Lucene.Net.Index.SegmentInfos.Read(Directory directory, String segmentFileName) in Z:\TeamCityAgent\work\bcdbe6b8cc677a49\src\Lucene.Net.Core\Index\SegmentInfos.cs:line
360
   at Lucene.Net.Index.SegmentInfos.FindSegmentsFileAnonymousInnerClassHelper.DoBody(String
segmentFileName) in Z:\TeamCityAgent\work\bcdbe6b8cc677a49\src\Lucene.Net.Core\Index\SegmentInfos.cs:line
487
   at Lucene.Net.Index.SegmentInfos.FindSegmentsFile.Run(IndexCommit commit) in Z:\TeamCityAgent\work\bcdbe6b8cc677a49\src\Lucene.Net.Core\Index\SegmentInfos.cs:line
1031
   at Lucene.Net.Index.SegmentInfos.FindSegmentsFile.Run() in Z:\TeamCityAgent\work\bcdbe6b8cc677a49\src\Lucene.Net.Core\Index\SegmentInfos.cs:line
838
   at Lucene.Net.Index.SegmentInfos.Read(Directory directory) in Z:\TeamCityAgent\work\bcdbe6b8cc677a49\src\Lucene.Net.Core\Index\SegmentInfos.cs:line
469
   at Lucene.Net.Index.StandardDirectoryReader.get_Current() in Z:\TeamCityAgent\work\bcdbe6b8cc677a49\src\Lucene.Net.Core\Index\StandardDirectoryReader.cs:line
453
   at Lucene.Net.Index.StandardDirectoryReader.DoOpenNoWriter(IndexCommit commit) in Z:\TeamCityAgent\work\bcdbe6b8cc677a49\src\Lucene.Net.Core\Index\StandardDirectoryReader.cs:line
383
   at Lucene.Net.Index.StandardDirectoryReader.DoOpenIfChanged(IndexCommit commit) in Z:\TeamCityAgent\work\bcdbe6b8cc677a49\src\Lucene.Net.Core\Index\StandardDirectoryReader.cs:line
332
   at Lucene.Net.Index.StandardDirectoryReader.DoOpenIfChanged() in Z:\TeamCityAgent\work\bcdbe6b8cc677a49\src\Lucene.Net.Core\Index\StandardDirectoryReader.cs:line
323
   at Lucene.Net.Index.TestNeverDelete.TestIndexing() in Z:\TeamCityAgent\work\bcdbe6b8cc677a49\src\Lucene.Net.Tests\core\Index\TestNeverDelete.cs:line
81
------- Stdout: -------
WARNING: Leftover undeleted temporary files The process cannot access the file 'write.lock'
because it is being used by another process.
Lucene.Net.Tests.dll: Lucene.Net.Index.TestNumericDocValuesUpdates.TestUpdateOldSegments (new)
=================
Test(s) failed. System.NotSupportedException : this codec can only be used for reading
   at Lucene.Net.Codecs.Lucene40.Lucene40PostingsFormat.FieldsConsumer(SegmentWriteState state)
in Z:\TeamCityAgent\work\bcdbe6b8cc677a49\src\Lucene.Net.Core\Codecs\Lucene40\Lucene40PostingsFormat.cs:line
248
   at Lucene.Net.Codecs.Perfield.PerFieldPostingsFormat.FieldsWriter.AddField(FieldInfo field)
in Z:\TeamCityAgent\work\bcdbe6b8cc677a49\src\Lucene.Net.Core\Codecs\Perfield\PerFieldPostingsFormat.cs:line
136
   at Lucene.Net.Index.FreqProxTermsWriterPerField.Flush(String fieldName, FieldsConsumer
consumer, SegmentWriteState state) in Z:\TeamCityAgent\work\bcdbe6b8cc677a49\src\Lucene.Net.Core\Index\FreqProxTermsWriterPerField.cs:line
405
   at Lucene.Net.Index.FreqProxTermsWriter.Flush(IDictionary`2 fieldsToFlush, SegmentWriteState
state) in Z:\TeamCityAgent\work\bcdbe6b8cc677a49\src\Lucene.Net.Core\Index\FreqProxTermsWriter.cs:line
83
   at Lucene.Net.Index.TermsHash.Flush(IDictionary`2 fieldsToFlush, SegmentWriteState state)
in Z:\TeamCityAgent\work\bcdbe6b8cc677a49\src\Lucene.Net.Core\Index\TermsHash.cs:line 130
   at Lucene.Net.Index.DocInverter.Flush(IDictionary`2 fieldsToFlush, SegmentWriteState state)
in Z:\TeamCityAgent\work\bcdbe6b8cc677a49\src\Lucene.Net.Core\Index\DocInverter.cs:line 53
   at Lucene.Net.Index.DocFieldProcessor.Flush(SegmentWriteState state) in Z:\TeamCityAgent\work\bcdbe6b8cc677a49\src\Lucene.Net.Core\Index\DocFieldProcessor.cs:line
82
   at Lucene.Net.Index.DocumentsWriterPerThread.Flush() in Z:\TeamCityAgent\work\bcdbe6b8cc677a49\src\Lucene.Net.Core\Index\DocumentsWriterPerThread.cs:line
550
   at Lucene.Net.Index.DocumentsWriter.DoFlush(DocumentsWriterPerThread flushingDWPT) in Z:\TeamCityAgent\work\bcdbe6b8cc677a49\src\Lucene.Net.Core\Index\DocumentsWriter.cs:line
635
   at Lucene.Net.Index.DocumentsWriter.FlushAllThreads(IndexWriter indexWriter) in Z:\TeamCityAgent\work\bcdbe6b8cc677a49\src\Lucene.Net.Core\Index\DocumentsWriter.cs:line
769
   at Lucene.Net.Index.IndexWriter.DoFlush(Boolean applyAllDeletes) in Z:\TeamCityAgent\work\bcdbe6b8cc677a49\src\Lucene.Net.Core\Index\IndexWriter.cs:line
3884
   at Lucene.Net.Index.IndexWriter.CloseInternal(Boolean waitForMerges, Boolean doFlush) in
Z:\TeamCityAgent\work\bcdbe6b8cc677a49\src\Lucene.Net.Core\Index\IndexWriter.cs:line 1177
   at Lucene.Net.Index.IndexWriter.Dispose(Boolean waitForMerges) in Z:\TeamCityAgent\work\bcdbe6b8cc677a49\src\Lucene.Net.Core\Index\IndexWriter.cs:line
1102
   at Lucene.Net.Index.TestNumericDocValuesUpdates.TestUpdateOldSegments() in Z:\TeamCityAgent\work\bcdbe6b8cc677a49\src\Lucene.Net.Tests\core\Index\TestNumericDocValuesUpdates.cs:line
1078
see all newly failed tests: http://teamcity.codebetter.com/viewLog.html?buildId=215120&buildTypeId=LuceneNet_Vs2015LuceneNetCore



Other failed tests details (only first 3 failures shown here)
==================================================================
Lucene.Net.Tests.dll: Lucene.Net.Codecs.Lucene3x.TestImpersonation.Test =================
Test(s) failed.   Expected: True
  But was:  False

   at NUnit.Framework.Assert.That(Object actual, IResolveConstraint expression, String message,
Object[] args)
   at NUnit.Framework.Assert.IsTrue(Boolean condition)
   at Lucene.Net.Codecs.Lucene3x.TestImpersonation.Test() in Z:\TeamCityAgent\work\bcdbe6b8cc677a49\src\Lucene.Net.Tests\core\Codecs\Lucene3x\TestImpersonation.cs:line
35
Lucene.Net.Tests.dll: Lucene.Net.Codecs.Lucene3x.TestLucene3xPostingsFormat.BaseIndexFileFormatTestCase.TestMergeStability
=================
Test(s) failed. Lucene.Net.Index.IndexFormatTooNewException : Format version is not supported
(resource: MockIndexInputWrapper(RAMInputStream(name=_0.fnm))): -2147483648 (needs to be between
-2 and -3)
   at Lucene.Net.Codecs.Lucene3x.Lucene3xFieldInfosReader.Read(Directory directory, String
segmentName, String segmentSuffix, IOContext iocontext) in Z:\TeamCityAgent\work\bcdbe6b8cc677a49\src\Lucene.Net.Core\Codecs\Lucene3x\Lucene3xFieldInfosReader.cs:line
76
   at Lucene.Net.Index.SegmentReader.ReadFieldInfos(SegmentCommitInfo info) in Z:\TeamCityAgent\work\bcdbe6b8cc677a49\src\Lucene.Net.Core\Index\SegmentReader.cs:line
258
   at Lucene.Net.Index.SegmentReader..ctor(SegmentCommitInfo si, Int32 termInfosIndexDivisor,
IOContext context) in Z:\TeamCityAgent\work\bcdbe6b8cc677a49\src\Lucene.Net.Core\Index\SegmentReader.cs:line
110
   at Lucene.Net.Index.StandardDirectoryReader.FindSegmentsFileAnonymousInnerClassHelper.DoBody(String
segmentFileName) in Z:\TeamCityAgent\work\bcdbe6b8cc677a49\src\Lucene.Net.Core\Index\StandardDirectoryReader.cs:line
70
   at Lucene.Net.Index.SegmentInfos.FindSegmentsFile.Run(IndexCommit commit) in Z:\TeamCityAgent\work\bcdbe6b8cc677a49\src\Lucene.Net.Core\Index\SegmentInfos.cs:line
1031
   at Lucene.Net.Index.StandardDirectoryReader.Open(Directory directory, IndexCommit commit,
Int32 termInfosIndexDivisor) in Z:\TeamCityAgent\work\bcdbe6b8cc677a49\src\Lucene.Net.Core\Index\StandardDirectoryReader.cs:line
53
   at Lucene.Net.Index.BaseIndexFileFormatTestCase.TestMergeStability() in Z:\TeamCityAgent\work\bcdbe6b8cc677a49\src\Lucene.Net.TestFramework\Index\BaseIndexFileFormatTestCase.cs:line
112
Lucene.Net.Tests.dll: Lucene.Net.Codecs.Lucene3x.TestLucene3xStoredFieldsFormat.BaseIndexFileFormatTestCase.TestMergeStability
=================
Test(s) failed. Lucene.Net.Index.IndexFormatTooNewException : Format version is not supported
(resource: MockIndexInputWrapper(RAMInputStream(name=_2.fnm))): -2147483648 (needs to be between
-2 and -3)
   at Lucene.Net.Codecs.Lucene3x.Lucene3xFieldInfosReader.Read(Directory directory, String
segmentName, String segmentSuffix, IOContext iocontext) in Z:\TeamCityAgent\work\bcdbe6b8cc677a49\src\Lucene.Net.Core\Codecs\Lucene3x\Lucene3xFieldInfosReader.cs:line
76
   at Lucene.Net.Index.SegmentReader.ReadFieldInfos(SegmentCommitInfo info) in Z:\TeamCityAgent\work\bcdbe6b8cc677a49\src\Lucene.Net.Core\Index\SegmentReader.cs:line
258
   at Lucene.Net.Index.SegmentReader..ctor(SegmentCommitInfo si, Int32 termInfosIndexDivisor,
IOContext context) in Z:\TeamCityAgent\work\bcdbe6b8cc677a49\src\Lucene.Net.Core\Index\SegmentReader.cs:line
110
   at Lucene.Net.Index.StandardDirectoryReader.FindSegmentsFileAnonymousInnerClassHelper.DoBody(String
segmentFileName) in Z:\TeamCityAgent\work\bcdbe6b8cc677a49\src\Lucene.Net.Core\Index\StandardDirectoryReader.cs:line
70
   at Lucene.Net.Index.SegmentInfos.FindSegmentsFile.Run(IndexCommit commit) in Z:\TeamCityAgent\work\bcdbe6b8cc677a49\src\Lucene.Net.Core\Index\SegmentInfos.cs:line
1031
   at Lucene.Net.Index.StandardDirectoryReader.Open(Directory directory, IndexCommit commit,
Int32 termInfosIndexDivisor) in Z:\TeamCityAgent\work\bcdbe6b8cc677a49\src\Lucene.Net.Core\Index\StandardDirectoryReader.cs:line
53
   at Lucene.Net.Index.BaseIndexFileFormatTestCase.TestMergeStability() in Z:\TeamCityAgent\work\bcdbe6b8cc677a49\src\Lucene.Net.TestFramework\Index\BaseIndexFileFormatTestCase.cs:line
112

============================================================================
Configure email notifications: http://teamcity.codebetter.com/profile.html?init=1&tab=userNotifications

Mime
  • Unnamed multipart/alternative (inline, None, 0 bytes)
View raw message