lucenenet-dev mailing list archives

Site index · List index
Message view « Date » · « Thread »
Top « Date » · « Thread »
From t.@codebetter.com
Subject [TeamCity, FAILED] Build Lucene.NET :: Lucene.NET Core [master] #431
Date Sat, 16 May 2015 17:58:04 GMT
Build Lucene.NET :: Lucene.NET Core [master] #431 failed (Tests failed: 9 (6 new), passed:
2444, ignored: 112).
Agent: JetBrains-dotnet-agent01
Build results: http://teamcity.codebetter.com/viewLog.html?buildId=191292&buildTypeId=LuceneNet_Core

Failed Tests Summary:
Newly failed tests (6 tests, alphabetically ordered)
==================================================================
Lucene.Net.Tests.dll: Lucene.Net.Index.TestIndexWriterForceMerge.TestPartialMerge
Lucene.Net.Tests.dll: Lucene.Net.Index.TestIndexWriterWithThreads.TestIOExceptionDuringAbortWithThreadsOnlyOnce
Lucene.Net.Tests.dll: Lucene.Net.Index.TestNRTThreads.TestNRTThreads_Mem
Lucene.Net.Tests.dll: Lucene.Net.Search.TestRegexpRandom2.TestRegexps
Lucene.Net.Tests.dll: Lucene.Net.Search.TestShardSearching.TestSimple
Lucene.Net.Tests.dll: Lucene.Net.Search.TestTopDocsMerge.TestSort_2

Other failed tests (3 tests, alphabetically ordered)
==================================================================
Lucene.Net.Tests.dll: Lucene.Net.Index.TestDuelingCodecs.TestEquals
Lucene.Net.Tests.dll: Lucene.Net.Search.TestFuzzyQuery.TestTieBreaker
Lucene.Net.Tests.dll: Lucene.Net.Search.TestSimpleExplanations.TestDMQ8



Newly failed tests details (only first 3 failures shown here)
==================================================================
Lucene.Net.Tests.dll: Lucene.Net.Index.TestIndexWriterForceMerge.TestPartialMerge (new) =================
Test(s) failed. Test exceeded Timeout value of 20000ms

Lucene.Net.Tests.dll: Lucene.Net.Index.TestIndexWriterWithThreads.TestIOExceptionDuringAbortWithThreadsOnlyOnce
(new) =================
Test(s) failed. Test exceeded Timeout value of 20000ms

Lucene.Net.Tests.dll: Lucene.Net.Index.TestNRTThreads.TestNRTThreads_Mem (new) =================
Test(s) failed.   Expected: False
  But was:  True

   at NUnit.Framework.Assert.That(Object actual, IResolveConstraint expression, String message,
Object[] args)
   at NUnit.Framework.Assert.IsFalse(Boolean condition)
   at Lucene.Net.Index.ThreadedIndexingAndSearchingTestCase.RunTest(String testName) in z:\Builds\work\bcdbe6b8cc677a49\src\Lucene.Net.TestFramework\Index\ThreadedIndexingAndSearchingTestCase.cs:line
639
   at Lucene.Net.Index.TestNRTThreads.TestNRTThreads_Mem() in z:\Builds\work\bcdbe6b8cc677a49\src\Lucene.Net.Tests\core\Index\TestNRTThreads.cs:line
182
------- Stdout: -------
WARNING: Leftover undeleted temporary files The process cannot access the file 'write.lock'
because it is being used by another process.
------- Stderr: -------
: hit exc
: hit exc
   at Lucene.Net.Store.ByteArrayDataInput.ReadVLong() in z:\Builds\work\bcdbe6b8cc677a49\src\Lucene.Net.Core\Store\ByteArrayDataInput.cs:line
172
   at Lucene.Net.Codecs.BlockTreeTermsReader.FieldReader.SegmentTermsEnum.Frame.ScanToTermNonLeaf(BytesRef
target, Boolean exactOnly) in z:\Builds\work\bcdbe6b8cc677a49\src\Lucene.Net.Core\Codecs\BlockTreeTermsReader.cs:line
3355
   at Lucene.Net.Codecs.BlockTreeTermsReader.FieldReader.SegmentTermsEnum.SeekExact(BytesRef
target) in z:\Builds\work\bcdbe6b8cc677a49\src\Lucene.Net.Core\Codecs\BlockTreeTermsReader.cs:line
2036
   at Lucene.Net.Index.TermContext.Build(IndexReaderContext context, Term term) in z:\Builds\work\bcdbe6b8cc677a49\src\Lucene.Net.Core\Index\TermContext.cs:line
107
   at Lucene.Net.Search.TermQuery.CreateWeight(IndexSearcher searcher) in z:\Builds\work\bcdbe6b8cc677a49\src\Lucene.Net.Core\Search\TermQuery.cs:line
203
   at Lucene.Net.Search.IndexSearcher.CreateNormalizedWeight(Query query) in z:\Builds\work\bcdbe6b8cc677a49\src\Lucene.Net.Core\Search\IndexSearcher.cs:line
728
   at Lucene.Net.Search.IndexSearcher.Search(Query query, Filter filter, Int32 n, Sort sort)
in z:\Builds\work\bcdbe6b8cc677a49\src\Lucene.Net.Core\Search\IndexSearcher.cs:line 346
   at Lucene.Net.Index.ThreadedIndexingAndSearchingTestCase.RunQuery(IndexSearcher s, Query
q) in z:\Builds\work\bcdbe6b8cc677a49\src\Lucene.Net.TestFramework\Index\ThreadedIndexingAndSearchingTestCase.cs:line
837
   at Lucene.Net.Index.ThreadedIndexingAndSearchingTestCase.SmokeTestSearcher(IndexSearcher
s) in z:\Builds\work\bcdbe6b8cc677a49\src\Lucene.Net.TestFramework\Index\ThreadedIndexingAndSearchingTestCase.cs:line
849
   at Lucene.Net.Index.ThreadedIndexingAndSearchingTestCase.ThreadAnonymousInnerClassHelper2.Run()
in z:\Builds\work\bcdbe6b8cc677a49\src\Lucene.Net.TestFramework\Index\ThreadedIndexingAndSearchingTestCase.cs:line
467
   at Lucene.Net.Store.BufferedIndexInput.ReadBytes(Byte[] b, Int32 offset, Int32 len, Boolean
useBuffer) in z:\Builds\work\bcdbe6b8cc677a49\src\Lucene.Net.Core\Store\BufferedIndexInput.cs:line
192
   at Lucene.Net.Store.BufferedIndexInput.ReadBytes(Byte[] b, Int32 offset, Int32 len) in
z:\Builds\work\bcdbe6b8cc677a49\src\Lucene.Net.Core\Store\BufferedIndexInput.cs:line 136
   at Lucene.Net.Store.MockIndexInputWrapper.ReadBytes(Byte[] b, Int32 offset, Int32 len)
in z:\Builds\work\bcdbe6b8cc677a49\src\Lucene.Net.TestFramework\Store\MockIndexInputWrapper.cs:line
134
   at Lucene.Net.Codecs.BlockTreeTermsReader.FieldReader.SegmentTermsEnum.Frame.LoadBlock()
in z:\Builds\work\bcdbe6b8cc677a49\src\Lucene.Net.Core\Codecs\BlockTreeTermsReader.cs:line
2836
   at Lucene.Net.Codecs.BlockTreeTermsReader.FieldReader.SegmentTermsEnum.SeekExact(BytesRef
target) in z:\Builds\work\bcdbe6b8cc677a49\src\Lucene.Net.Core\Codecs\BlockTreeTermsReader.cs:line
2034
   at Lucene.Net.Index.TermContext.Build(IndexReaderContext context, Term term) in z:\Builds\work\bcdbe6b8cc677a49\src\Lucene.Net.Core\Index\TermContext.cs:line
107
   at Lucene.Net.Search.TermQuery.CreateWeight(IndexSearcher searcher) in z:\Builds\work\bcdbe6b8cc677a49\src\Lucene.Net.Core\Search\TermQuery.cs:line
203
   at Lucene.Net.Search.IndexSearcher.CreateNormalizedWeight(Query query) in z:\Builds\work\bcdbe6b8cc677a49\src\Lucene.Net.Core\Search\IndexSearcher.cs:line
728
   at Lucene.Net.Search.IndexSearcher.Search(Query query, Filter filter, Int32 n) in z:\Builds\work\bcdbe6b8cc677a49\src\Lucene.Net.Core\Search\IndexSearcher.cs:line
301
   at Lucene.Net.Search.IndexSearcher.Search(Query query, Int32 n) in z:\Builds\work\bcdbe6b8cc677a49\src\Lucene.Net.Core\Search\IndexSearcher.cs:line
290
   at Lucene.Net.Index.ThreadedIndexingAndSearchingTestCase.RunQuery(IndexSearcher s, Query
q) in z:\Builds\work\bcdbe6b8cc677a49\src\Lucene.Net.TestFramework\Index\ThreadedIndexingAndSearchingTestCase.cs:line
836
   at Lucene.Net.Index.ThreadedIndexingAndSearchingTestCase.SmokeTestSearcher(IndexSearcher
s) in z:\Builds\work\bcdbe6b8cc677a49\src\Lucene.Net.TestFramework\Index\ThreadedIndexingAndSearchingTestCase.cs:line
849
   at Lucene.Net.Index.ThreadedIndexingAndSearchingTestCase.ThreadAnonymousInnerClassHelper2.Run()
in z:\Builds\work\bcdbe6b8cc677a49\src\Lucene.Net.TestFramework\Index\ThreadedIndexingAndSearchingTestCase.cs:line
467
Unhandled exception in remote appdomain: System.Exception: Index was outside the bounds of
the array. ---> System.IndexOutOfRangeException: Index was outside the bounds of the array.
   at Lucene.Net.Store.ByteArrayDataInput.ReadVLong() in z:\Builds\work\bcdbe6b8cc677a49\src\Lucene.Net.Core\Store\ByteArrayDataInput.cs:line
172
   at Lucene.Net.Codecs.BlockTreeTermsReader.FieldReader.SegmentTermsEnum.Frame.ScanToTermNonLeaf(BytesRef
target, Boolean exactOnly) in z:\Builds\work\bcdbe6b8cc677a49\src\Lucene.Net.Core\Codecs\BlockTreeTermsReader.cs:line
3355
   at Lucene.Net.Codecs.BlockTreeTermsReader.FieldReader.SegmentTermsEnum.SeekExact(BytesRef
target) in z:\Builds\work\bcdbe6b8cc677a49\src\Lucene.Net.Core\Codecs\BlockTreeTermsReader.cs:line
2036
   at Lucene.Net.Index.TermContext.Build(IndexReaderContext context, Term term) in z:\Builds\work\bcdbe6b8cc677a49\src\Lucene.Net.Core\Index\TermContext.cs:line
107
   at Lucene.Net.Search.TermQuery.CreateWeight(IndexSearcher searcher) in z:\Builds\work\bcdbe6b8cc677a49\src\Lucene.Net.Core\Search\TermQuery.cs:line
203
   at Lucene.Net.Search.IndexSearcher.CreateNormalizedWeight(Query query) in z:\Builds\work\bcdbe6b8cc677a49\src\Lucene.Net.Core\Search\IndexSearcher.cs:line
728
   at Lucene.Net.Search.IndexSearcher.Search(Query query, Filter filter, Int32 n, Sort sort)
in z:\Builds\work\bcdbe6b8cc677a49\src\Lucene.Net.Core\Search\IndexSearcher.cs:line 346
   at Lucene.Net.Index.ThreadedIndexingAndSearchingTestCase.RunQuery(IndexSearcher s, Query
q) in z:\Builds\work\bcdbe6b8cc677a49\src\Lucene.Net.TestFramework\Index\ThreadedIndexingAndSearchingTestCase.cs:line
837
   at Lucene.Net.Index.ThreadedIndexingAndSearchingTestCase.SmokeTestSearcher(IndexSearcher
s) in z:\Builds\work\bcdbe6b8cc677a49\src\Lucene.Net.TestFramework\Index\ThreadedIndexingAndSearchingTestCase.cs:line
849
   at Lucene.Net.Index.ThreadedIndexingAndSearchingTestCase.ThreadAnonymousInnerClassHelper2.Run()
in z:\Builds\work\bcdbe6b8cc677a49\src\Lucene.Net.TestFramework\Index\ThreadedIndexingAndSearchingTestCase.cs:line
467
   --- End of inner exception stack trace ---
   at Lucene.Net.Index.ThreadedIndexingAndSearchingTestCase.ThreadAnonymousInnerClassHelper2.Run()
in z:\Builds\work\bcdbe6b8cc677a49\src\Lucene.Net.TestFramework\Index\ThreadedIndexingAndSearchingTestCase.cs:line
525
   at System.Threading.ThreadHelper.ThreadStart_Context(Object state)
   at System.Threading.ExecutionContext.RunInternal(ExecutionContext executionContext, ContextCallback
callback, Object state, Boolean preserveSyncCtx)
   at System.Threading.ExecutionContext.Run(ExecutionContext executionContext, ContextCallback
callback, Object state, Boolean preserveSyncCtx)
   at System.Threading.ExecutionContext.Run(ExecutionContext executionContext, ContextCallback
callback, Object state)
   at System.Threading.ThreadHelper.ThreadStart()
: hit exc
   at System.IO.FileStream.ReadByte()
   at Lucene.Net.Support.FileStreamExtensions.Read(FileStream file, ByteBuffer dst, Int64
position) in z:\Builds\work\bcdbe6b8cc677a49\src\Lucene.Net.Core\Support\FileStreamExtensions.cs:line
22
   at Lucene.Net.Store.NIOFSDirectory.NIOFSIndexInput.ReadInternal(Byte[] b, Int32 offset,
Int32 len) in z:\Builds\work\bcdbe6b8cc677a49\src\Lucene.Net.Core\Store\NIOFSDirectory.cs:line
252
   at Lucene.Net.Store.BufferedIndexInput.Refill() in z:\Builds\work\bcdbe6b8cc677a49\src\Lucene.Net.Core\Store\BufferedIndexInput.cs:line
368
   at Lucene.Net.Store.BufferedIndexInput.ReadByte() in z:\Builds\work\bcdbe6b8cc677a49\src\Lucene.Net.Core\Store\BufferedIndexInput.cs:line
55
   at Lucene.Net.Store.DataInput.ReadVInt() in z:\Builds\work\bcdbe6b8cc677a49\src\Lucene.Net.Core\Store\DataInput.cs:line
117
   at Lucene.Net.Store.BufferedIndexInput.ReadVInt() in z:\Builds\work\bcdbe6b8cc677a49\src\Lucene.Net.Core\Store\BufferedIndexInput.cs:line
279
   at Lucene.Net.Store.MockIndexInputWrapper.ReadVInt() in z:\Builds\work\bcdbe6b8cc677a49\src\Lucene.Net.TestFramework\Store\MockIndexInputWrapper.cs:line
176
   at Lucene.Net.Codecs.BlockTreeTermsReader.FieldReader.SegmentTermsEnum.Frame.LoadBlock()
in z:\Builds\work\bcdbe6b8cc677a49\src\Lucene.Net.Core\Codecs\BlockTreeTermsReader.cs:line
2800
   at Lucene.Net.Codecs.BlockTreeTermsReader.FieldReader.SegmentTermsEnum.SeekExact(BytesRef
target) in z:\Builds\work\bcdbe6b8cc677a49\src\Lucene.Net.Core\Codecs\BlockTreeTermsReader.cs:line
2034
   at Lucene.Net.Index.TermContext.Build(IndexReaderContext context, Term term) in z:\Builds\work\bcdbe6b8cc677a49\src\Lucene.Net.Core\Index\TermContext.cs:line
107
   at Lucene.Net.Search.TermQuery.CreateWeight(IndexSearcher searcher) in z:\Builds\work\bcdbe6b8cc677a49\src\Lucene.Net.Core\Search\TermQuery.cs:line
203
   at Lucene.Net.Search.IndexSearcher.CreateNormalizedWeight(Query query) in z:\Builds\work\bcdbe6b8cc677a49\src\Lucene.Net.Core\Search\IndexSearcher.cs:line
728
   at Lucene.Net.Search.IndexSearcher.Search(Query query, Filter filter, Int32 n, Sort sort)
in z:\Builds\work\bcdbe6b8cc677a49\src\Lucene.Net.Core\Search\IndexSearcher.cs:line 346
   at Lucene.Net.Index.ThreadedIndexingAndSearchingTestCase.RunQuery(IndexSearcher s, Query
q) in z:\Builds\work\bcdbe6b8cc677a49\src\Lucene.Net.TestFramework\Index\ThreadedIndexingAndSearchingTestCase.cs:line
841
   at Lucene.Net.Index.ThreadedIndexingAndSearchingTestCase.ThreadAnonymousInnerClassHelper2.Run()
in z:\Builds\work\bcdbe6b8cc677a49\src\Lucene.Net.TestFramework\Index\ThreadedIndexingAndSearchingTestCase.cs:line
507
: hit exc
   at System.IO.FileStream.ReadByte()
   at Lucene.Net.Support.FileStreamExtensions.Read(FileStream file, ByteBuffer dst, Int64
position) in z:\Builds\work\bcdbe6b8cc677a49\src\Lucene.Net.Core\Support\FileStreamExtensions.cs:line
22
   at Lucene.Net.Store.NIOFSDirectory.NIOFSIndexInput.ReadInternal(Byte[] b, Int32 offset,
Int32 len) in z:\Builds\work\bcdbe6b8cc677a49\src\Lucene.Net.Core\Store\NIOFSDirectory.cs:line
252
   at Lucene.Net.Store.BufferedIndexInput.Refill() in z:\Builds\work\bcdbe6b8cc677a49\src\Lucene.Net.Core\Store\BufferedIndexInput.cs:line
368
   at Lucene.Net.Store.BufferedIndexInput.ReadByte() in z:\Builds\work\bcdbe6b8cc677a49\src\Lucene.Net.Core\Store\BufferedIndexInput.cs:line
55
   at Lucene.Net.Store.DataInput.ReadVInt() in z:\Builds\work\bcdbe6b8cc677a49\src\Lucene.Net.Core\Store\DataInput.cs:line
117
   at Lucene.Net.Store.BufferedIndexInput.ReadVInt() in z:\Builds\work\bcdbe6b8cc677a49\src\Lucene.Net.Core\Store\BufferedIndexInput.cs:line
279
   at Lucene.Net.Store.MockIndexInputWrapper.ReadVInt() in z:\Builds\work\bcdbe6b8cc677a49\src\Lucene.Net.TestFramework\Store\MockIndexInputWrapper.cs:line
176
   at Lucene.Net.Codecs.BlockTreeTermsReader.FieldReader.SegmentTermsEnum.Frame.LoadBlock()
in z:\Builds\work\bcdbe6b8cc677a49\src\Lucene.Net.Core\Codecs\BlockTreeTermsReader.cs:line
2800
   at Lucene.Net.Codecs.BlockTreeTermsReader.FieldReader.SegmentTermsEnum.SeekExact(BytesRef
target) in z:\Builds\work\bcdbe6b8cc677a49\src\Lucene.Net.Core\Codecs\BlockTreeTermsReader.cs:line
2034
   at Lucene.Net.Index.TermContext.Build(IndexReaderContext context, Term term) in z:\Builds\work\bcdbe6b8cc677a49\src\Lucene.Net.Core\Index\TermContext.cs:line
107
   at Lucene.Net.Search.TermQuery.CreateWeight(IndexSearcher searcher) in z:\Builds\work\bcdbe6b8cc677a49\src\Lucene.Net.Core\Search\TermQuery.cs:line
203
   at Lucene.Net.Search.IndexSearcher.CreateNormalizedWeight(Query query) in z:\Builds\work\bcdbe6b8cc677a49\src\Lucene.Net.Core\Search\IndexSearcher.cs:line
728
   at Lucene.Net.Search.IndexSearcher.Search(Query query, Filter filter, Int32 n) in z:\Builds\work\bcdbe6b8cc677a49\src\Lucene.Net.Core\Search\IndexSearcher.cs:line
301
   at Lucene.Net.Search.IndexSearcher.Search(Query query, Int32 n) in z:\Builds\work\bcdbe6b8cc677a49\src\Lucene.Net.Core\Search\IndexSearcher.cs:line
290
   at Lucene.Net.Index.ThreadedIndexingAndSearchingTestCase.RunQuery(IndexSearcher s, Query
q) in z:\Builds\work\bcdbe6b8cc677a49\src\Lucene.Net.TestFramework\Index\ThreadedIndexingAndSearchingTestCase.cs:line
836
   at Lucene.Net.Index.ThreadedIndexingAndSearchingTestCase.SmokeTestSearcher(IndexSearcher
s) in z:\Builds\work\bcdbe6b8cc677a49\src\Lucene.Net.TestFramework\Index\ThreadedIndexingAndSearchingTestCase.cs:line
849
   at Lucene.Net.Index.ThreadedIndexingAndSearchingTestCase.ThreadAnonymousInnerClassHelper2.Run()
in z:\Builds\work\bcdbe6b8cc677a49\src\Lucene.Net.TestFramework\Index\ThreadedIndexingAndSearchingTestCase.cs:line
467
Unhandled exception in remote appdomain: System.Exception: read past EOF: NIOFSIndexInput(_1_Lucene41_0.tim
in path="Z:\Builds\temp\buildTmp\LuceneTemp\TestNRTThreads-1\_1.cfs" slice=87668:133835) --->
System.IO.EndOfStreamException: read past EOF: NIOFSIndexInput(_1_Lucene41_0.tim in path="Z:\Builds\temp\buildTmp\LuceneTemp\TestNRTThreads-1\_1.cfs"
slice=87668:133835)
   at Lucene.Net.Store.BufferedIndexInput.ReadBytes(Byte[] b, Int32 offset, Int32 len, Boolean
useBuffer) in z:\Builds\work\bcdbe6b8cc677a49\src\Lucene.Net.Core\Store\BufferedIndexInput.cs:line
192
   at Lucene.Net.Store.BufferedIndexInput.ReadBytes(Byte[] b, Int32 offset, Int32 len) in
z:\Builds\work\bcdbe6b8cc677a49\src\Lucene.Net.Core\Store\BufferedIndexInput.cs:line 136
   at Lucene.Net.Store.MockIndexInputWrapper.ReadBytes(Byte[] b, Int32 offset, Int32 len)
in z:\Builds\work\bcdbe6b8cc677a49\src\Lucene.Net.TestFramework\Store\MockIndexInputWrapper.cs:line
134
   at Lucene.Net.Codecs.BlockTreeTermsReader.FieldReader.SegmentTermsEnum.Frame.LoadBlock()
in z:\Builds\work\bcdbe6b8cc677a49\src\Lucene.Net.Core\Codecs\BlockTreeTermsReader.cs:line
2836
   at Lucene.Net.Codecs.BlockTreeTermsReader.FieldReader.SegmentTermsEnum.SeekExact(BytesRef
target) in z:\Builds\work\bcdbe6b8cc677a49\src\Lucene.Net.Core\Codecs\BlockTreeTermsReader.cs:line
2034
   at Lucene.Net.Index.TermContext.Build(IndexReaderContext context, Term term) in z:\Builds\work\bcdbe6b8cc677a49\src\Lucene.Net.Core\Index\TermContext.cs:line
107
   at Lucene.Net.Search.TermQuery.CreateWeight(IndexSearcher searcher) in z:\Builds\work\bcdbe6b8cc677a49\src\Lucene.Net.Core\Search\TermQuery.cs:line
203
   at Lucene.Net.Search.IndexSearcher.CreateNormalizedWeight(Query query) in z:\Builds\work\bcdbe6b8cc677a49\src\Lucene.Net.Core\Search\IndexSearcher.cs:line
728
   at Lucene.Net.Search.IndexSearcher.Search(Query query, Filter filter, Int32 n) in z:\Builds\work\bcdbe6b8cc677a49\src\Lucene.Net.Core\Search\IndexSearcher.cs:line
301
   at Lucene.Net.Search.IndexSearcher.Search(Query query, Int32 n) in z:\Builds\work\bcdbe6b8cc677a49\src\Lucene.Net.Core\Search\IndexSearcher.cs:line
290
   at Lucene.Net.Index.ThreadedIndexingAndSearchingTestCase.RunQuery(IndexSearcher s, Query
q) in z:\Builds\work\bcdbe6b8cc677a49\src\Lucene.Net.TestFramework\Index\ThreadedIndexingAndSearchingTestCase.cs:line
836
   at Lucene.Net.Index.ThreadedIndexingAndSearchingTestCase.SmokeTestSearcher(IndexSearcher
s) in z:\Builds\work\bcdbe6b8cc677a49\src\Lucene.Net.TestFramework\Index\ThreadedIndexingAndSearchingTestCase.cs:line
849
   at Lucene.Net.Index.ThreadedIndexingAndSearchingTestCase.ThreadAnonymousInnerClassHelper2.Run()
in z:\Builds\work\bcdbe6b8cc677a49\src\Lucene.Net.TestFramework\Index\ThreadedIndexingAndSearchingTestCase.cs:line
467
   --- End of inner exception stack trace ---
   at Lucene.Net.Index.ThreadedIndexingAndSearchingTestCase.ThreadAnonymousInnerClassHelper2.Run()
in z:\Builds\work\bcdbe6b8cc677a49\src\Lucene.Net.TestFramework\Index\ThreadedIndexingAndSearchingTestCase.cs:line
525
   at System.Threading.ThreadHelper.ThreadStart_Context(Object state)
   at System.Threading.ExecutionContext.RunInternal(ExecutionContext executionContext, ContextCallback
callback, Object state, Boolean preserveSyncCtx)
   at System.Threading.ExecutionContext.Run(ExecutionContext executionContext, ContextCallback
callback, Object state, Boolean preserveSyncCtx)
   at System.Threading.ExecutionContext.Run(ExecutionContext executionContext, ContextCallback
callback, Object state)
   at System.Threading.ThreadHelper.ThreadStart()
Unhandled exception in remote appdomain: System.Exception: Index was outside the bounds of
the array. ---> System.IndexOutOfRangeException: Index was outside the bounds of the array.
   at System.IO.FileStream.ReadByte()
   at Lucene.Net.Support.FileStreamExtensions.Read(FileStream file, ByteBuffer dst, Int64
position) in z:\Builds\work\bcdbe6b8cc677a49\src\Lucene.Net.Core\Support\FileStreamExtensions.cs:line
22
   at Lucene.Net.Store.NIOFSDirectory.NIOFSIndexInput.ReadInternal(Byte[] b, Int32 offset,
Int32 len) in z:\Builds\work\bcdbe6b8cc677a49\src\Lucene.Net.Core\Store\NIOFSDirectory.cs:line
252
   at Lucene.Net.Store.BufferedIndexInput.Refill() in z:\Builds\work\bcdbe6b8cc677a49\src\Lucene.Net.Core\Store\BufferedIndexInput.cs:line
368
   at Lucene.Net.Store.BufferedIndexInput.ReadByte() in z:\Builds\work\bcdbe6b8cc677a49\src\Lucene.Net.Core\Store\BufferedIndexInput.cs:line
55
   at Lucene.Net.Store.DataInput.ReadVInt() in z:\Builds\work\bcdbe6b8cc677a49\src\Lucene.Net.Core\Store\DataInput.cs:line
117
   at Lucene.Net.Store.BufferedIndexInput.ReadVInt() in z:\Builds\work\bcdbe6b8cc677a49\src\Lucene.Net.Core\Store\BufferedIndexInput.cs:line
279
   at Lucene.Net.Store.MockIndexInputWrapper.ReadVInt() in z:\Builds\work\bcdbe6b8cc677a49\src\Lucene.Net.TestFramework\Store\MockIndexInputWrapper.cs:line
176
   at Lucene.Net.Codecs.BlockTreeTermsReader.FieldReader.SegmentTermsEnum.Frame.LoadBlock()
in z:\Builds\work\bcdbe6b8cc677a49\src\Lucene.Net.Core\Codecs\BlockTreeTermsReader.cs:line
2800
   at Lucene.Net.Codecs.BlockTreeTermsReader.FieldReader.SegmentTermsEnum.SeekExact(BytesRef
target) in z:\Builds\work\bcdbe6b8cc677a49\src\Lucene.Net.Core\Codecs\BlockTreeTermsReader.cs:line
2034
   at Lucene.Net.Index.TermContext.Build(IndexReaderContext context, Term term) in z:\Builds\work\bcdbe6b8cc677a49\src\Lucene.Net.Core\Index\TermContext.cs:line
107
   at Lucene.Net.Search.TermQuery.CreateWeight(IndexSearcher searcher) in z:\Builds\work\bcdbe6b8cc677a49\src\Lucene.Net.Core\Search\TermQuery.cs:line
203
   at Lucene.Net.Search.IndexSearcher.CreateNormalizedWeight(Query query) in z:\Builds\work\bcdbe6b8cc677a49\src\Lucene.Net.Core\Search\IndexSearcher.cs:line
728
   at Lucene.Net.Search.IndexSearcher.Search(Query query, Filter filter, Int32 n, Sort sort)
in z:\Builds\work\bcdbe6b8cc677a49\src\Lucene.Net.Core\Search\IndexSearcher.cs:line 346
   at Lucene.Net.Index.ThreadedIndexingAndSearchingTestCase.RunQuery(IndexSearcher s, Query
q) in z:\Builds\work\bcdbe6b8cc677a49\src\Lucene.Net.TestFramework\Index\ThreadedIndexingAndSearchingTestCase.cs:line
841
   at Lucene.Net.Index.ThreadedIndexingAndSearchingTestCase.ThreadAnonymousInnerClassHelper2.Run()
in z:\Builds\work\bcdbe6b8cc677a49\src\Lucene.Net.TestFramework\Index\ThreadedIndexingAndSearchingTestCase.cs:line
507
   --- End of inner exception stack trace ---
   at Lucene.Net.Index.ThreadedIndexingAndSearchingTestCase.ThreadAnonymousInnerClassHelper2.Run()
in z:\Builds\work\bcdbe6b8cc677a49\src\Lucene.Net.TestFramework\Index\ThreadedIndexingAndSearchingTestCase.cs:line
525
   at System.Threading.ThreadHelper.ThreadStart_Context(Object state)
   at System.Threading.ExecutionContext.RunInternal(ExecutionContext executionContext, ContextCallback
callback, Object state, Boolean preserveSyncCtx)
   at System.Threading.ExecutionContext.Run(ExecutionContext executionContext, ContextCallback
callback, Object state, Boolean preserveSyncCtx)
   at System.Threading.ExecutionContext.Run(ExecutionContext executionContext, ContextCallback
callback, Object state)
   at System.Threading.ThreadHelper.ThreadStart()
Unhandled exception in remote appdomain: System.Exception: Index was outside the bounds of
the array. ---> System.IndexOutOfRangeException: Index was outside the bounds of the array.
   at System.IO.FileStream.ReadByte()
   at Lucene.Net.Support.FileStreamExtensions.Read(FileStream file, ByteBuffer dst, Int64
position) in z:\Builds\work\bcdbe6b8cc677a49\src\Lucene.Net.Core\Support\FileStreamExtensions.cs:line
22
   at Lucene.Net.Store.NIOFSDirectory.NIOFSIndexInput.ReadInternal(Byte[] b, Int32 offset,
Int32 len) in z:\Builds\work\bcdbe6b8cc677a49\src\Lucene.Net.Core\Store\NIOFSDirectory.cs:line
252
   at Lucene.Net.Store.BufferedIndexInput.Refill() in z:\Builds\work\bcdbe6b8cc677a49\src\Lucene.Net.Core\Store\BufferedIndexInput.cs:line
368
   at Lucene.Net.Store.BufferedIndexInput.ReadByte() in z:\Builds\work\bcdbe6b8cc677a49\src\Lucene.Net.Core\Store\BufferedIndexInput.cs:line
55
   at Lucene.Net.Store.DataInput.ReadVInt() in z:\Builds\work\bcdbe6b8cc677a49\src\Lucene.Net.Core\Store\DataInput.cs:line
117
   at Lucene.Net.Store.BufferedIndexInput.ReadVInt() in z:\Builds\work\bcdbe6b8cc677a49\src\Lucene.Net.Core\Store\BufferedIndexInput.cs:line
279
   at Lucene.Net.Store.MockIndexInputWrapper.ReadVInt() in z:\Builds\work\bcdbe6b8cc677a49\src\Lucene.Net.TestFramework\Store\MockIndexInputWrapper.cs:line
176
   at Lucene.Net.Codecs.BlockTreeTermsReader.FieldReader.SegmentTermsEnum.Frame.LoadBlock()
in z:\Builds\work\bcdbe6b8cc677a49\src\Lucene.Net.Core\Codecs\BlockTreeTermsReader.cs:line
2800
   at Lucene.Net.Codecs.BlockTreeTermsReader.FieldReader.SegmentTermsEnum.SeekExact(BytesRef
target) in z:\Builds\work\bcdbe6b8cc677a49\src\Lucene.Net.Core\Codecs\BlockTreeTermsReader.cs:line
2034
   at Lucene.Net.Index.TermContext.Build(IndexReaderContext context, Term term) in z:\Builds\work\bcdbe6b8cc677a49\src\Lucene.Net.Core\Index\TermContext.cs:line
107
   at Lucene.Net.Search.TermQuery.CreateWeight(IndexSearcher searcher) in z:\Builds\work\bcdbe6b8cc677a49\src\Lucene.Net.Core\Search\TermQuery.cs:line
203
   at Lucene.Net.Search.IndexSearcher.CreateNormalizedWeight(Query query) in z:\Builds\work\bcdbe6b8cc677a49\src\Lucene.Net.Core\Search\IndexSearcher.cs:line
728
   at Lucene.Net.Search.IndexSearcher.Search(Query query, Filter filter, Int32 n) in z:\Builds\work\bcdbe6b8cc677a49\src\Lucene.Net.Core\Search\IndexSearcher.cs:line
301
   at Lucene.Net.Search.IndexSearcher.Search(Query query, Int32 n) in z:\Builds\work\bcdbe6b8cc677a49\src\Lucene.Net.Core\Search\IndexSearcher.cs:line
290
   at Lucene.Net.Index.ThreadedIndexingAndSearchingTestCase.RunQuery(IndexSearcher s, Query
q) in z:\Builds\work\bcdbe6b8cc677a49\src\Lucene.Net.TestFramework\Index\ThreadedIndexingAndSearchingTestCase.cs:line
836
   at Lucene.Net.Index.ThreadedIndexingAndSearchingTestCase.SmokeTestSearcher(IndexSearcher
s) in z:\Builds\work\bcdbe6b8cc677a49\src\Lucene.Net.TestFramework\Index\ThreadedIndexingAndSearchingTestCase.cs:line
849
   at Lucene.Net.Index.ThreadedIndexingAndSearchingTestCase.ThreadAnonymousInnerClassHelper2.Run()
in z:\Builds\work\bcdbe6b8cc677a49\src\Lucene.Net.TestFramework\Index\ThreadedIndexingAndSearchingTestCase.cs:line
467
   --- End of inner exception stack trace ---
   at Lucene.Net.Index.ThreadedIndexingAndSearchingTestCase.ThreadAnonymousInnerClassHelper2.Run()
in z:\Builds\work\bcdbe6b8cc677a49\src\Lucene.Net.TestFramework\Index\ThreadedIndexingAndSearchingTestCase.cs:line
525
   at System.Threading.ThreadHelper.ThreadStart_Context(Object state)
   at System.Threading.ExecutionContext.RunInternal(ExecutionContext executionContext, ContextCallback
callback, Object state, Boolean preserveSyncCtx)
   at System.Threading.ExecutionContext.Run(ExecutionContext executionContext, ContextCallback
callback, Object state, Boolean preserveSyncCtx)
   at System.Threading.ExecutionContext.Run(ExecutionContext executionContext, ContextCallback
callback, Object state)
   at System.Threading.ThreadHelper.ThreadStart()
: hit exc
   at Lucene.Net.Store.BufferedIndexInput.ReadBytes(Byte[] b, Int32 offset, Int32 len, Boolean
useBuffer) in z:\Builds\work\bcdbe6b8cc677a49\src\Lucene.Net.Core\Store\BufferedIndexInput.cs:line
192
   at Lucene.Net.Store.BufferedIndexInput.ReadBytes(Byte[] b, Int32 offset, Int32 len) in
z:\Builds\work\bcdbe6b8cc677a49\src\Lucene.Net.Core\Store\BufferedIndexInput.cs:line 136
   at Lucene.Net.Store.MockIndexInputWrapper.ReadBytes(Byte[] b, Int32 offset, Int32 len)
in z:\Builds\work\bcdbe6b8cc677a49\src\Lucene.Net.TestFramework\Store\MockIndexInputWrapper.cs:line
134
   at Lucene.Net.Codecs.BlockTreeTermsReader.FieldReader.SegmentTermsEnum.Frame.LoadBlock()
in z:\Builds\work\bcdbe6b8cc677a49\src\Lucene.Net.Core\Codecs\BlockTreeTermsReader.cs:line
2836
   at Lucene.Net.Codecs.BlockTreeTermsReader.FieldReader.SegmentTermsEnum.SeekExact(BytesRef
target) in z:\Builds\work\bcdbe6b8cc677a49\src\Lucene.Net.Core\Codecs\BlockTreeTermsReader.cs:line
2034
   at Lucene.Net.Index.TermContext.Build(IndexReaderContext context, Term term) in z:\Builds\work\bcdbe6b8cc677a49\src\Lucene.Net.Core\Index\TermContext.cs:line
107
   at Lucene.Net.Search.TermQuery.CreateWeight(IndexSearcher searcher) in z:\Builds\work\bcdbe6b8cc677a49\src\Lucene.Net.Core\Search\TermQuery.cs:line
203
   at Lucene.Net.Search.IndexSearcher.CreateNormalizedWeight(Query query) in z:\Builds\work\bcdbe6b8cc677a49\src\Lucene.Net.Core\Search\IndexSearcher.cs:line
728
   at Lucene.Net.Search.IndexSearcher.Search(Query query, Filter filter, Int32 n) in z:\Builds\work\bcdbe6b8cc677a49\src\Lucene.Net.Core\Search\IndexSearcher.cs:line
301
   at Lucene.Net.Search.IndexSearcher.Search(Query query, Int32 n) in z:\Builds\work\bcdbe6b8cc677a49\src\Lucene.Net.Core\Search\IndexSearcher.cs:line
290
   at Lucene.Net.Index.ThreadedIndexingAndSearchingTestCase.RunQuery(IndexSearcher s, Query
q) in z:\Builds\work\bcdbe6b8cc677a49\src\Lucene.Net.TestFramework\Index\ThreadedIndexingAndSearchingTestCase.cs:line
836
   at Lucene.Net.Index.ThreadedIndexingAndSearchingTestCase.SmokeTestSearcher(IndexSearcher
s) in z:\Builds\work\bcdbe6b8cc677a49\src\Lucene.Net.TestFramework\Index\ThreadedIndexingAndSearchingTestCase.cs:line
849
   at Lucene.Net.Index.ThreadedIndexingAndSearchingTestCase.ThreadAnonymousInnerClassHelper2.Run()
in z:\Builds\work\bcdbe6b8cc677a49\src\Lucene.Net.TestFramework\Index\ThreadedIndexingAndSearchingTestCase.cs:line
467
Unhandled exception in remote appdomain: System.Exception: read past EOF: NIOFSIndexInput(_3_Lucene41_0.tim
in path="Z:\Builds\temp\buildTmp\LuceneTemp\TestNRTThreads-1\_3.cfs" slice=115727:180061)
---> System.IO.EndOfStreamException: read past EOF: NIOFSIndexInput(_3_Lucene41_0.tim in
path="Z:\Builds\temp\buildTmp\LuceneTemp\TestNRTThreads-1\_3.cfs" slice=115727:180061)
   at Lucene.Net.Store.BufferedIndexInput.ReadBytes(Byte[] b, Int32 offset, Int32 len, Boolean
useBuffer) in z:\Builds\work\bcdbe6b8cc677a49\src\Lucene.Net.Core\Store\BufferedIndexInput.cs:line
192
   at Lucene.Net.Store.BufferedIndexInput.ReadBytes(Byte[] b, Int32 offset, Int32 len) in
z:\Builds\work\bcdbe6b8cc677a49\src\Lucene.Net.Core\Store\BufferedIndexInput.cs:line 136
   at Lucene.Net.Store.MockIndexInputWrapper.ReadBytes(Byte[] b, Int32 offset, Int32 len)
in z:\Builds\work\bcdbe6b8cc677a49\src\Lucene.Net.TestFramework\Store\MockIndexInputWrapper.cs:line
134
   at Lucene.Net.Codecs.BlockTreeTermsReader.FieldReader.SegmentTermsEnum.Frame.LoadBlock()
in z:\Builds\work\bcdbe6b8cc677a49\src\Lucene.Net.Core\Codecs\BlockTreeTermsReader.cs:line
2836
   at Lucene.Net.Codecs.BlockTreeTermsReader.FieldReader.SegmentTermsEnum.SeekExact(BytesRef
target) in z:\Builds\work\bcdbe6b8cc677a49\src\Lucene.Net.Core\Codecs\BlockTreeTermsReader.cs:line
2034
   at Lucene.Net.Index.TermContext.Build(IndexReaderContext context, Term term) in z:\Builds\work\bcdbe6b8cc677a49\src\Lucene.Net.Core\Index\TermContext.cs:line
107
   at Lucene.Net.Search.TermQuery.CreateWeight(IndexSearcher searcher) in z:\Builds\work\bcdbe6b8cc677a49\src\Lucene.Net.Core\Search\TermQuery.cs:line
203
   at Lucene.Net.Search.IndexSearcher.CreateNormalizedWeight(Query query) in z:\Builds\work\bcdbe6b8cc677a49\src\Lucene.Net.Core\Search\IndexSearcher.cs:line
728
   at Lucene.Net.Search.IndexSearcher.Search(Query query, Filter filter, Int32 n) in z:\Builds\work\bcdbe6b8cc677a49\src\Lucene.Net.Core\Search\IndexSearcher.cs:line
301
   at Lucene.Net.Search.IndexSearcher.Search(Query query, Int32 n) in z:\Builds\work\bcdbe6b8cc677a49\src\Lucene.Net.Core\Search\IndexSearcher.cs:line
290
   at Lucene.Net.Index.ThreadedIndexingAndSearchingTestCase.RunQuery(IndexSearcher s, Query
q) in z:\Builds\work\bcdbe6b8cc677a49\src\Lucene.Net.TestFramework\Index\ThreadedIndexingAndSearchingTestCase.cs:line
836
   at Lucene.Net.Index.ThreadedIndexingAndSearchingTestCase.SmokeTestSearcher(IndexSearcher
s) in z:\Builds\work\bcdbe6b8cc677a49\src\Lucene.Net.TestFramework\Index\ThreadedIndexingAndSearchingTestCase.cs:line
849
   at Lucene.Net.Index.ThreadedIndexingAndSearchingTestCase.ThreadAnonymousInnerClassHelper2.Run()
in z:\Builds\work\bcdbe6b8cc677a49\src\Lucene.Net.TestFramework\Index\ThreadedIndexingAndSearchingTestCase.cs:line
467
   --- End of inner exception stack trace ---
   at Lucene.Net.Index.ThreadedIndexingAndSearchingTestCase.ThreadAnonymousInnerClassHelper2.Run()
in z:\Builds\work\bcdbe6b8cc677a49\src\Lucene.Net.TestFramework\Index\ThreadedIndexingAndSearchingTestCase.cs:line
525
   at System.Threading.ThreadHelper.ThreadStart_Context(Object state)
   at System.Threading.ExecutionContext.RunInternal(ExecutionContext executionContext, ContextCallback
callback, Object state, Boolean preserveSyncCtx)
   at System.Threading.ExecutionContext.Run(ExecutionContext executionContext, ContextCallback
callback, Object state, Boolean preserveSyncCtx)
   at System.Threading.ExecutionContext.Run(ExecutionContext executionContext, ContextCallback
callback, Object state)
   at System.Threading.ThreadHelper.ThreadStart()
see all newly failed tests: http://teamcity.codebetter.com/viewLog.html?buildId=191292&buildTypeId=LuceneNet_Core



Other failed tests details (only first 3 failures shown here)
==================================================================
Lucene.Net.Tests.dll: Lucene.Net.Index.TestDuelingCodecs.TestEquals =================
TearDown method failed. SetUp : System.NotSupportedException : Lucene 4.0 does not support
SortedSet docvalues
TearDown : System.Exception : MockDirectoryWrapper: cannot close: there are still open locks:
write.lock
   at Lucene.Net.Codecs.Lucene40.Lucene40DocValuesWriter.AddSortedSetField(FieldInfo field,
IEnumerable`1 values, IEnumerable`1 docToOrdCount, IEnumerable`1 ords) in z:\Builds\work\bcdbe6b8cc677a49\src\Lucene.Net.TestFramework\Codecs\lucene40\Lucene40DocValuesWriter.cs:line
614
   at Lucene.Net.Index.SortedSetDocValuesWriter.Flush(SegmentWriteState state, DocValuesConsumer
dvConsumer) in z:\Builds\work\bcdbe6b8cc677a49\src\Lucene.Net.Core\Index\SortedSetDocValuesWriter.cs:line
177
   at Lucene.Net.Index.DocValuesProcessor.Flush(SegmentWriteState state) in z:\Builds\work\bcdbe6b8cc677a49\src\Lucene.Net.Core\Index\DocValuesProcessor.cs:line
99
   at Lucene.Net.Index.TwoStoredFieldsConsumers.Flush(SegmentWriteState state) in z:\Builds\work\bcdbe6b8cc677a49\src\Lucene.Net.Core\Index\TwoStoredFieldsConsumers.cs:line
45
   at Lucene.Net.Index.DocFieldProcessor.Flush(SegmentWriteState state) in z:\Builds\work\bcdbe6b8cc677a49\src\Lucene.Net.Core\Index\DocFieldProcessor.cs:line
81
   at Lucene.Net.Index.DocumentsWriterPerThread.Flush() in z:\Builds\work\bcdbe6b8cc677a49\src\Lucene.Net.Core\Index\DocumentsWriterPerThread.cs:line
550
   at Lucene.Net.Index.DocumentsWriter.DoFlush(DocumentsWriterPerThread flushingDWPT) in z:\Builds\work\bcdbe6b8cc677a49\src\Lucene.Net.Core\Index\DocumentsWriter.cs:line
635
   at Lucene.Net.Index.DocumentsWriter.FlushAllThreads(IndexWriter indexWriter) in z:\Builds\work\bcdbe6b8cc677a49\src\Lucene.Net.Core\Index\DocumentsWriter.cs:line
769
   at Lucene.Net.Index.IndexWriter.DoFlush(Boolean applyAllDeletes) in z:\Builds\work\bcdbe6b8cc677a49\src\Lucene.Net.Core\Index\IndexWriter.cs:line
3884
   at Lucene.Net.Index.IndexWriter.ForceMerge(Int32 maxNumSegments, Boolean doWait) in z:\Builds\work\bcdbe6b8cc677a49\src\Lucene.Net.Core\Index\IndexWriter.cs:line
2129
   at Lucene.Net.Index.IndexWriter.ForceMerge(Int32 maxNumSegments) in z:\Builds\work\bcdbe6b8cc677a49\src\Lucene.Net.Core\Index\IndexWriter.cs:line
2100
   at Lucene.Net.Index.RandomIndexWriter.DoRandomForceMerge() in z:\Builds\work\bcdbe6b8cc677a49\src\Lucene.Net.TestFramework\Index\RandomIndexWriter.cs:line
432
   at Lucene.Net.Index.RandomIndexWriter.GetReader(Boolean applyDeletions) in z:\Builds\work\bcdbe6b8cc677a49\src\Lucene.Net.TestFramework\Index\RandomIndexWriter.cs:line
453
   at Lucene.Net.Index.RandomIndexWriter.get_Reader() in z:\Builds\work\bcdbe6b8cc677a49\src\Lucene.Net.TestFramework\Index\RandomIndexWriter.cs:line
387
   at Lucene.Net.Index.TestDuelingCodecs.SetUp() in z:\Builds\work\bcdbe6b8cc677a49\src\Lucene.Net.Tests\core\Index\TestDuelingCodecs.cs:line
96
--TearDown
   at Lucene.Net.Store.MockDirectoryWrapper.Dispose() in z:\Builds\work\bcdbe6b8cc677a49\src\Lucene.Net.TestFramework\Store\MockDirectoryWrapper.cs:line
923
   at Lucene.Net.Index.TestDuelingCodecs.TearDown() in z:\Builds\work\bcdbe6b8cc677a49\src\Lucene.Net.Tests\core\Index\TestDuelingCodecs.cs:line
122
Lucene.Net.Tests.dll: Lucene.Net.Search.TestFuzzyQuery.TestTieBreaker =================
Test(s) failed.   Expected: 5
  But was:  2

   at NUnit.Framework.Assert.That(Object actual, IResolveConstraint expression, String message,
Object[] args)
   at NUnit.Framework.Assert.AreEqual(Int32 expected, Int32 actual)
   at Lucene.Net.Search.TestFuzzyQuery.TestTieBreaker() in z:\Builds\work\bcdbe6b8cc677a49\src\Lucene.Net.Tests\core\Search\TestFuzzyQuery.cs:line
268
Lucene.Net.Tests.dll: Lucene.Net.Search.TestSimpleExplanations.TestDMQ8 =================
Test(s) failed.   unstable skipTo(1) score!
  Expected: 155358.0d +/- 0.0010000000474974513d
  But was:  155357.9921875d

   at NUnit.Framework.Assert.That(Object actual, IResolveConstraint expression, String message,
Object[] args)
   at NUnit.Framework.Assert.AssertDoublesAreEqual(Double expected, Double actual, Double
delta, String message, Object[] args)
   at Lucene.Net.Search.QueryUtils.CollectorAnonymousInnerClassHelper2.Collect(Int32 doc)
in z:\Builds\work\bcdbe6b8cc677a49\src\Lucene.Net.TestFramework\Search\QueryUtils.cs:line
481
   at Lucene.Net.Search.Weight.DefaultBulkScorer.ScoreAll(Collector collector, Scorer scorer)
in z:\Builds\work\bcdbe6b8cc677a49\src\Lucene.Net.Core\Search\Weight.cs:line 198
   at Lucene.Net.Search.Weight.DefaultBulkScorer.Score(Collector collector, Int32 max) in
z:\Builds\work\bcdbe6b8cc677a49\src\Lucene.Net.Core\Search\Weight.cs:line 169
   at Lucene.Net.Search.AssertingBulkScorer.Score(Collector collector) in z:\Builds\work\bcdbe6b8cc677a49\src\Lucene.Net.TestFramework\Search\AssertingBulkScorer.cs:line
71
   at Lucene.Net.Search.IndexSearcher.Search(IList`1 leaves, Weight weight, Collector collector)
in z:\Builds\work\bcdbe6b8cc677a49\src\Lucene.Net.Core\Search\IndexSearcher.cs:line 658
   at Lucene.Net.Search.AssertingIndexSearcher.Search(IList`1 leaves, Weight weight, Collector
collector) in z:\Builds\work\bcdbe6b8cc677a49\src\Lucene.Net.TestFramework\Search\AssertingIndexSearcher.cs:line
116
   at Lucene.Net.Search.IndexSearcher.Search(Query query, Collector results) in z:\Builds\work\bcdbe6b8cc677a49\src\Lucene.Net.Core\Search\IndexSearcher.cs:line
329
   at Lucene.Net.Search.QueryUtils.CheckFirstSkipTo(Query q, IndexSearcher s) in z:\Builds\work\bcdbe6b8cc677a49\src\Lucene.Net.TestFramework\Search\QueryUtils.cs:line
418
   at Lucene.Net.Search.QueryUtils.Check(Random random, Query q1, IndexSearcher s, Boolean
wrap) in z:\Builds\work\bcdbe6b8cc677a49\src\Lucene.Net.TestFramework\Search\QueryUtils.cs:line
137
   at Lucene.Net.Search.QueryUtils.Check(Random random, Query q1, IndexSearcher s, Boolean
wrap) in z:\Builds\work\bcdbe6b8cc677a49\src\Lucene.Net.TestFramework\Search\QueryUtils.cs:line
141
   at Lucene.Net.Search.CheckHits.CheckHitCollector(Random random, Query query, String defaultFieldName,
IndexSearcher searcher, Int32[] results) in z:\Builds\work\bcdbe6b8cc677a49\src\Lucene.Net.TestFramework\Search\CheckHits.cs:line
96
   at Lucene.Net.Search.TestExplanations.Qtest(Query q, Int32[] expDocNrs) in z:\Builds\work\bcdbe6b8cc677a49\src\Lucene.Net.Tests\core\Search\TestExplanations.cs:line
101
   at Lucene.Net.Search.TestSimpleExplanations.TestDMQ8() in z:\Builds\work\bcdbe6b8cc677a49\src\Lucene.Net.Tests\core\Search\TestSimpleExplanations.cs:line
293
Changes included (4 changes)
====================================================
Change f963b1d7a6b76cb1cb3df858f821cd2ce8d020c5 by itamar (0 file):
Merge remote-tracking branch 'laimis/incrementtoken_fixes'


Change 4e804cd6dd1145cb32f08de8bfa3110fdafb96a0 by laimis (1 file):
set platform target to AnyCPU for Release builds


Change 2473bbf4ec01c77652e52b946737a95fbe6f11fe by laimis (4 files):
couple more sealed IncrementToken changes


Change 88645fa606bdbc3dbf1b91ba8233c8c7fd0e417e by laimis (1 file):
use setup/teardown instead of fixture setup/teardown


see more information about changed files: http://teamcity.codebetter.com/viewLog.html?tab=buildChangesDiv&buildId=191292&buildTypeId=LuceneNet_Core

============================================================================
Configure email notifications: http://teamcity.codebetter.com/profile.html?init=1&tab=userNotifications

Mime
  • Unnamed multipart/alternative (inline, None, 0 bytes)
View raw message