lucenenet-dev mailing list archives

Site index · List index
Message view « Date » · « Thread »
Top « Date » · « Thread »
From t.@codebetter.com
Subject [TeamCity, FAILED] Build Lucene.NET :: Lucene.NET Core [master] #408
Date Sat, 02 May 2015 17:54:18 GMT
Build Lucene.NET :: Lucene.NET Core [master] #408 failed (Tests failed: 21 (9 new), passed:
2433, ignored: 112).
Agent: JetBrains-dotnet-agent02
Build results: http://teamcity.codebetter.com/viewLog.html?buildId=190065&buildTypeId=LuceneNet_Core

Failed Tests Summary:
Newly failed tests (9 tests, alphabetically ordered)
==================================================================
Lucene.Net.Tests.dll: Lucene.Net.Codecs.Lucene3x.TestLucene3xStoredFieldsFormat.BaseStoredFieldsFormatTestCase.TestConcurrentReads
Lucene.Net.Tests.dll: Lucene.Net.Index.TestIndexWriter.TestThreadInterruptDeadlock
Lucene.Net.Tests.dll: Lucene.Net.Index.TestIndexWriterExceptions.TestExceptionDuringRollback
Lucene.Net.Tests.dll: Lucene.Net.Index.TestIndexWriterForceMerge.TestPartialMerge
Lucene.Net.Tests.dll: Lucene.Net.Index.TestIndexWriterReader.TestMergeWarmer
Lucene.Net.Tests.dll: Lucene.Net.Index.TestIndexWriterWithThreads.TestIOExceptionDuringAbortWithThreadsOnlyOnce
Lucene.Net.Tests.dll: Lucene.Net.Index.TestStoredFieldsFormat.BaseStoredFieldsFormatTestCase.TestConcurrentReads
Lucene.Net.Tests.dll: Lucene.Net.Index.TestTransactions.TestTransactions_Mem
Lucene.Net.Tests.dll: Lucene.Net.Search.TestShardSearching.TestSimple

Other failed tests (12 tests, alphabetically ordered)
==================================================================
Lucene.Net.Tests.dll: Lucene.Net.Codecs.Lucene41.TestBlockPostingsFormat2
Lucene.Net.Tests.dll: Lucene.Net.Index.TestDirectoryReader.TestNoDir
Lucene.Net.Tests.dll: Lucene.Net.Index.TestDocumentsWriterStallControl.TestSimpleStall
Lucene.Net.Tests.dll: Lucene.Net.Index.TestDuelingCodecs.TestEquals
Lucene.Net.Tests.dll: Lucene.Net.Index.TestIndexWriterExceptions.TestExceptionOnMergeInit
Lucene.Net.Tests.dll: Lucene.Net.Search.TestFuzzyQuery.TestTieBreaker
Lucene.Net.Tests.dll: Lucene.Net.Search.TestSimpleExplanations.TestDMQ8
Lucene.Net.Tests.dll: Lucene.Net.Search.TestTermVectors
Lucene.Net.Tests.dll: Lucene.Net.Search.TestTermVectors.TestMixedVectrosVectors
Lucene.Net.Tests.dll: Lucene.Net.Store.TestDirectory.TestDontCreate
Lucene.Net.Tests.dll: Lucene.Net.Store.TestFileSwitchDirectory.TestNoDir
Lucene.Net.Tests.dll: Lucene.Net.Tests.TestAssertions.TestTokenStreams



Newly failed tests details (only first 3 failures shown here)
==================================================================
Lucene.Net.Tests.dll: Lucene.Net.Codecs.Lucene3x.TestLucene3xStoredFieldsFormat.BaseStoredFieldsFormatTestCase.TestConcurrentReads
(new) =================
Test(s) failed. System.InvalidOperationException : Expected 1 hit, got 0
   at Lucene.Net.Index.BaseStoredFieldsFormatTestCase.TestConcurrentReads() in z:\Builds\work\bcdbe6b8cc677a49\src\Lucene.Net.TestFramework\Index\BaseStoredFieldsFormatTestCase.cs:line
453
Lucene.Net.Tests.dll: Lucene.Net.Index.TestIndexWriter.TestThreadInterruptDeadlock (new) =================
Test(s) failed.   Expected: False
  But was:  True

   at NUnit.Framework.Assert.That(Object actual, IResolveConstraint expression, String message,
Object[] args)
   at NUnit.Framework.Assert.IsFalse(Boolean condition)
   at Lucene.Net.Index.TestIndexWriter.TestThreadInterruptDeadlock() in z:\Builds\work\bcdbe6b8cc677a49\src\Lucene.Net.Tests\core\Index\TestIndexWriter.cs:line
1412
------- Stderr: -------
TEST: got interrupt
   at Lucene.Net.Store.SlowOpeningMockIndexInputWrapper..ctor(MockDirectoryWrapper dir, String
name, IndexInput delegate) in z:\Builds\work\bcdbe6b8cc677a49\src\Lucene.Net.TestFramework\Store\SlowOpeningMockIndexInputWrapper.cs:line
45
   at Lucene.Net.Store.MockDirectoryWrapper.OpenInput(String name, IOContext context) in z:\Builds\work\bcdbe6b8cc677a49\src\Lucene.Net.TestFramework\Store\MockDirectoryWrapper.cs:line
805
   at Lucene.Net.Store.FilterDirectory.OpenChecksumInput(String name, IOContext context) in
z:\Builds\work\bcdbe6b8cc677a49\src\Lucene.Net.Core\Store\FilterDirectory.cs:line 132
   at Lucene.Net.Codecs.Lucene42.Lucene42DocValuesProducer..ctor(SegmentReadState state, String
dataCodec, String dataExtension, String metaCodec, String metaExtension) in z:\Builds\work\bcdbe6b8cc677a49\src\Lucene.Net.Core\Codecs\Lucene42\Lucene42DocValuesProducer.cs:line
98
   at Lucene.Net.Codecs.Lucene42.Lucene42NormsFormat.NormsProducer(SegmentReadState state)
in z:\Builds\work\bcdbe6b8cc677a49\src\Lucene.Net.Core\Codecs\Lucene42\Lucene42NormsFormat.cs:line
72
   at Lucene.Net.Index.SegmentCoreReaders..ctor(SegmentReader owner, Directory dir, SegmentCommitInfo
si, IOContext context, Int32 termsIndexDivisor) in z:\Builds\work\bcdbe6b8cc677a49\src\Lucene.Net.Core\Index\SegmentCoreReaders.cs:line
159
   at Lucene.Net.Index.SegmentReader..ctor(SegmentCommitInfo si, Int32 termInfosIndexDivisor,
IOContext context) in z:\Builds\work\bcdbe6b8cc677a49\src\Lucene.Net.Core\Index\SegmentReader.cs:line
111
   at Lucene.Net.Index.ReadersAndUpdates.GetReader(IOContext context) in z:\Builds\work\bcdbe6b8cc677a49\src\Lucene.Net.Core\Index\ReadersAndUpdates.cs:line
167
   at Lucene.Net.Index.ReadersAndUpdates.GetReadOnlyClone(IOContext context) in z:\Builds\work\bcdbe6b8cc677a49\src\Lucene.Net.Core\Index\ReadersAndUpdates.cs:line
298
   at Lucene.Net.Index.StandardDirectoryReader.Open(IndexWriter writer, SegmentInfos infos,
Boolean applyAllDeletes) in z:\Builds\work\bcdbe6b8cc677a49\src\Lucene.Net.Core\Index\StandardDirectoryReader.cs:line
126
   at Lucene.Net.Index.IndexWriter.GetReader(Boolean applyAllDeletes) in z:\Builds\work\bcdbe6b8cc677a49\src\Lucene.Net.Core\Index\IndexWriter.cs:line
413
   at Lucene.Net.Index.DirectoryReader.Open(IndexWriter writer, Boolean applyAllDeletes) in
z:\Builds\work\bcdbe6b8cc677a49\src\Lucene.Net.Core\Index\DirectoryReader.cs:line 115
   at Lucene.Net.Index.TestIndexWriter.IndexerThreadInterrupt.Run() in z:\Builds\work\bcdbe6b8cc677a49\src\Lucene.Net.Tests\core\Index\TestIndexWriter.cs:line
1253
TEST: got interrupt
   at Lucene.Net.Store.SlowOpeningMockIndexInputWrapper..ctor(MockDirectoryWrapper dir, String
name, IndexInput delegate) in z:\Builds\work\bcdbe6b8cc677a49\src\Lucene.Net.TestFramework\Store\SlowOpeningMockIndexInputWrapper.cs:line
45
   at Lucene.Net.Store.MockDirectoryWrapper.OpenInput(String name, IOContext context) in z:\Builds\work\bcdbe6b8cc677a49\src\Lucene.Net.TestFramework\Store\MockDirectoryWrapper.cs:line
805
   at Lucene.Net.Store.FilterDirectory.OpenChecksumInput(String name, IOContext context) in
z:\Builds\work\bcdbe6b8cc677a49\src\Lucene.Net.Core\Store\FilterDirectory.cs:line 132
   at Lucene.Net.Codecs.Lucene46.Lucene46SegmentInfoReader.Read(Directory dir, String segment,
IOContext context) in z:\Builds\work\bcdbe6b8cc677a49\src\Lucene.Net.Core\Codecs\Lucene46\Lucene46SegmentInfoReader.cs:line
47
   at Lucene.Net.Index.SegmentInfos.Read(Directory directory, String segmentFileName) in z:\Builds\work\bcdbe6b8cc677a49\src\Lucene.Net.Core\Index\SegmentInfos.cs:line
381
   at Lucene.Net.Index.SegmentInfos.FindSegmentsFileAnonymousInnerClassHelper.DoBody(String
segmentFileName) in z:\Builds\work\bcdbe6b8cc677a49\src\Lucene.Net.Core\Index\SegmentInfos.cs:line
487
   at Lucene.Net.Index.SegmentInfos.FindSegmentsFile.Run(IndexCommit commit) in z:\Builds\work\bcdbe6b8cc677a49\src\Lucene.Net.Core\Index\SegmentInfos.cs:line
1031
   at Lucene.Net.Index.SegmentInfos.FindSegmentsFile.Run() in z:\Builds\work\bcdbe6b8cc677a49\src\Lucene.Net.Core\Index\SegmentInfos.cs:line
838
   at Lucene.Net.Index.SegmentInfos.Read(Directory directory) in z:\Builds\work\bcdbe6b8cc677a49\src\Lucene.Net.Core\Index\SegmentInfos.cs:line
469
   at Lucene.Net.Index.IndexWriter..ctor(Directory d, IndexWriterConfig conf) in z:\Builds\work\bcdbe6b8cc677a49\src\Lucene.Net.Core\Index\IndexWriter.cs:line
895
   at Lucene.Net.Index.TestIndexWriter.IndexerThreadInterrupt.Run() in z:\Builds\work\bcdbe6b8cc677a49\src\Lucene.Net.Tests\core\Index\TestIndexWriter.cs:line
1201
FAILED; unexpected exception
   at Lucene.Net.Util.IOUtils.ReThrowUnchecked(Exception th) in z:\Builds\work\bcdbe6b8cc677a49\src\Lucene.Net.Core\Util\IOUtils.cs:line
435
   at Lucene.Net.Util.IOUtils.ReThrow(Exception th) in z:\Builds\work\bcdbe6b8cc677a49\src\Lucene.Net.Core\Util\IOUtils.cs:line
418
   at Lucene.Net.Index.IndexWriter.ReaderPool.DropAll(Boolean doSave) in z:\Builds\work\bcdbe6b8cc677a49\src\Lucene.Net.Core\Index\IndexWriter.cs:line
656
   at Lucene.Net.Index.IndexWriter.DeleteAll() in z:\Builds\work\bcdbe6b8cc677a49\src\Lucene.Net.Core\Index\IndexWriter.cs:line
2708
   at Lucene.Net.Index.TestIndexWriter.IndexerThreadInterrupt.Run() in z:\Builds\work\bcdbe6b8cc677a49\src\Lucene.Net.Tests\core\Index\TestIndexWriter.cs:line
1241
Unhandled exception in remote appdomain: System.Exception: System.Exception: MockDirectoryWrapper:
cannot close: there are still open locks: write.lock
   at Lucene.Net.Store.MockDirectoryWrapper.Dispose() in z:\Builds\work\bcdbe6b8cc677a49\src\Lucene.Net.TestFramework\Store\MockDirectoryWrapper.cs:line
923
   at Lucene.Net.Util.IOUtils.Close(IDisposable[] objects) in z:\Builds\work\bcdbe6b8cc677a49\src\Lucene.Net.Core\Util\IOUtils.cs:line
163 ---> System.Exception: MockDirectoryWrapper: cannot close: there are still open locks:
write.lock
   at Lucene.Net.Store.MockDirectoryWrapper.Dispose() in z:\Builds\work\bcdbe6b8cc677a49\src\Lucene.Net.TestFramework\Store\MockDirectoryWrapper.cs:line
923
   at Lucene.Net.Util.IOUtils.Close(IDisposable[] objects) in z:\Builds\work\bcdbe6b8cc677a49\src\Lucene.Net.Core\Util\IOUtils.cs:line
163
   --- End of inner exception stack trace ---
   at Lucene.Net.Util.IOUtils.ReThrowUnchecked(Exception th) in z:\Builds\work\bcdbe6b8cc677a49\src\Lucene.Net.Core\Util\IOUtils.cs:line
435
   at Lucene.Net.Util.IOUtils.ReThrow(Exception th) in z:\Builds\work\bcdbe6b8cc677a49\src\Lucene.Net.Core\Util\IOUtils.cs:line
418
   at Lucene.Net.Util.IOUtils.Close(IDisposable[] objects) in z:\Builds\work\bcdbe6b8cc677a49\src\Lucene.Net.Core\Util\IOUtils.cs:line
176
   at Lucene.Net.Index.TestIndexWriter.IndexerThreadInterrupt.Run() in z:\Builds\work\bcdbe6b8cc677a49\src\Lucene.Net.Tests\core\Index\TestIndexWriter.cs:line
1362
   at System.Threading.ThreadHelper.ThreadStart_Context(Object state)
   at System.Threading.ExecutionContext.RunInternal(ExecutionContext executionContext, ContextCallback
callback, Object state, Boolean preserveSyncCtx)
   at System.Threading.ExecutionContext.Run(ExecutionContext executionContext, ContextCallback
callback, Object state, Boolean preserveSyncCtx)
   at System.Threading.ExecutionContext.Run(ExecutionContext executionContext, ContextCallback
callback, Object state)
   at System.Threading.ThreadHelper.ThreadStart()
Lucene.Net.Tests.dll: Lucene.Net.Index.TestIndexWriterExceptions.TestExceptionDuringRollback
(new) =================
Test(s) failed.   Expected string length 5 but was 0. Strings differ at index 0.
  Expected: "BOOM!"
  But was:  <string.Empty>
  -----------^

   at NUnit.Framework.Assert.That(Object actual, IResolveConstraint expression, String message,
Object[] args)
   at NUnit.Framework.Assert.AreEqual(Object expected, Object actual)
   at Lucene.Net.Index.TestIndexWriterExceptions.TestExceptionDuringRollback() in z:\Builds\work\bcdbe6b8cc677a49\src\Lucene.Net.Tests\core\Index\TestIndexWriterExceptions.cs:line
2474
see all newly failed tests: http://teamcity.codebetter.com/viewLog.html?buildId=190065&buildTypeId=LuceneNet_Core



Other failed tests details (only first 3 failures shown here)
==================================================================
Lucene.Net.Tests.dll: Lucene.Net.Codecs.Lucene41.TestBlockPostingsFormat2 =================
TearDown method failed. CheckIndex failed
   at Lucene.Net.Util.TestUtil.CheckIndex(Directory dir, Boolean crossCheckTermVectors) in
z:\Builds\work\bcdbe6b8cc677a49\src\Lucene.Net.TestFramework\Util\TestUtil.cs:line 257
   at Lucene.Net.Codecs.Lucene41.TestBlockPostingsFormat2.TearDown() in z:\Builds\work\bcdbe6b8cc677a49\src\Lucene.Net.Tests\core\Codecs\Lucene41\TestBlockPostingsFormat2.cs:line
65
Lucene.Net.Tests.dll: Lucene.Net.Index.TestDirectoryReader.TestNoDir =================
Test(s) failed. Lucene.Net.Store.NoSuchDirectoryException : directory 'Z:\Builds\temp\buildTmp\LuceneTemp\doesnotexist-1'
does not exist
   at Lucene.Net.Store.FSDirectory.ListAll(DirectoryInfo dir) in z:\Builds\work\bcdbe6b8cc677a49\src\Lucene.Net.Core\Store\FSDirectory.cs:line
238
   at Lucene.Net.Store.FSDirectory.ListAll() in z:\Builds\work\bcdbe6b8cc677a49\src\Lucene.Net.Core\Store\FSDirectory.cs:line
284
   at Lucene.Net.Store.MockDirectoryWrapper.ListAll() in z:\Builds\work\bcdbe6b8cc677a49\src\Lucene.Net.TestFramework\Store\MockDirectoryWrapper.cs:line
1207
   at Lucene.Net.Index.SegmentInfos.FindSegmentsFile.Run(IndexCommit commit) in z:\Builds\work\bcdbe6b8cc677a49\src\Lucene.Net.Core\Index\SegmentInfos.cs:line
892
   at Lucene.Net.Index.StandardDirectoryReader.Open(Directory directory, IndexCommit commit,
Int32 termInfosIndexDivisor) in z:\Builds\work\bcdbe6b8cc677a49\src\Lucene.Net.Core\Index\StandardDirectoryReader.cs:line
53
   at Lucene.Net.Index.TestDirectoryReader.TestNoDir() in z:\Builds\work\bcdbe6b8cc677a49\src\Lucene.Net.Tests\core\Index\TestDirectoryReader.cs:line
739
Lucene.Net.Tests.dll: Lucene.Net.Index.TestDocumentsWriterStallControl.TestSimpleStall =================
Test(s) failed.   Expected: True
  But was:  False

   at NUnit.Framework.Assert.That(Object actual, IResolveConstraint expression, String message,
Object[] args)
   at NUnit.Framework.Assert.IsTrue(Boolean condition)
   at Lucene.Net.Index.TestDocumentsWriterStallControl.TestSimpleStall() in z:\Builds\work\bcdbe6b8cc677a49\src\Lucene.Net.Tests\core\Index\TestDocumentsWriterStallControl.cs:line
54
Changes included (3 changes)
====================================================
Change ef7a7ad88668ef87a880aed2d1f9e4bff6ccae21 by laimis (2 files):
use appropriate filestream share mode


Change ff6f2426cb96a74f5573350ee0e1b56bcc9dbcd9 by laimis (1 file):
put back the test to match what Lucene is doing


Change 19f506cd6a2fe4c84f4b1df2d51e48e24757c11c by laimis (2 files):
open with read/write sharing instead of read


see more information about changed files: http://teamcity.codebetter.com/viewLog.html?tab=buildChangesDiv&buildId=190065&buildTypeId=LuceneNet_Core

============================================================================
Configure email notifications: http://teamcity.codebetter.com/profile.html?init=1&tab=userNotifications

Mime
  • Unnamed multipart/alternative (inline, None, 0 bytes)
View raw message