lucenenet-dev mailing list archives

Site index · List index
Message view « Date » · « Thread »
Top « Date » · « Thread »
From t.@codebetter.com
Subject [TeamCity, FAILED] Build Lucene.NET :: Lucene.NET Core [master] #434
Date Sat, 16 May 2015 18:48:41 GMT
Build Lucene.NET :: Lucene.NET Core [master] #434 failed (Tests failed: 6 (1 new), passed:
2456, ignored: 107).
Agent: JetBrains-dotnet-agent01
Build results: http://teamcity.codebetter.com/viewLog.html?buildId=191298&buildTypeId=LuceneNet_Core

Failed Tests Summary:
Newly failed tests (1 test, alphabetically ordered)
==================================================================
Lucene.Net.Tests.dll: Lucene.Net.Index.TestIndexWriterReader.TestMergeWarmer

Other failed tests (5 tests, alphabetically ordered)
==================================================================
Lucene.Net.Tests.dll: Lucene.Net.Index.TestDuelingCodecs.TestEquals
Lucene.Net.Tests.dll: Lucene.Net.Index.TestNRTThreads.TestNRTThreads_Mem
Lucene.Net.Tests.dll: Lucene.Net.Search.TestFuzzyQuery.TestTieBreaker
Lucene.Net.Tests.dll: Lucene.Net.Search.TestSimpleExplanations.TestDMQ8
Lucene.Net.Tests.dll: Lucene.Net.Search.TestTopDocsMerge.TestSort_2



Newly failed tests details (naturally ordered)
==================================================================
Lucene.Net.Tests.dll: Lucene.Net.Index.TestIndexWriterReader.TestMergeWarmer (new) =================
Test(s) failed. Test exceeded Timeout value of 20000ms




Other failed tests details (only first 3 failures shown here)
==================================================================
Lucene.Net.Tests.dll: Lucene.Net.Index.TestDuelingCodecs.TestEquals =================
TearDown method failed. SetUp : System.NotSupportedException : Lucene 4.0 does not support
SortedSet docvalues
TearDown : System.Exception : MockDirectoryWrapper: cannot close: there are still open locks:
write.lock
   at Lucene.Net.Codecs.Lucene40.Lucene40DocValuesWriter.AddSortedSetField(FieldInfo field,
IEnumerable`1 values, IEnumerable`1 docToOrdCount, IEnumerable`1 ords) in z:\Builds\work\bcdbe6b8cc677a49\src\Lucene.Net.TestFramework\Codecs\lucene40\Lucene40DocValuesWriter.cs:line
614
   at Lucene.Net.Index.SortedSetDocValuesWriter.Flush(SegmentWriteState state, DocValuesConsumer
dvConsumer) in z:\Builds\work\bcdbe6b8cc677a49\src\Lucene.Net.Core\Index\SortedSetDocValuesWriter.cs:line
177
   at Lucene.Net.Index.DocValuesProcessor.Flush(SegmentWriteState state) in z:\Builds\work\bcdbe6b8cc677a49\src\Lucene.Net.Core\Index\DocValuesProcessor.cs:line
99
   at Lucene.Net.Index.TwoStoredFieldsConsumers.Flush(SegmentWriteState state) in z:\Builds\work\bcdbe6b8cc677a49\src\Lucene.Net.Core\Index\TwoStoredFieldsConsumers.cs:line
45
   at Lucene.Net.Index.DocFieldProcessor.Flush(SegmentWriteState state) in z:\Builds\work\bcdbe6b8cc677a49\src\Lucene.Net.Core\Index\DocFieldProcessor.cs:line
81
   at Lucene.Net.Index.DocumentsWriterPerThread.Flush() in z:\Builds\work\bcdbe6b8cc677a49\src\Lucene.Net.Core\Index\DocumentsWriterPerThread.cs:line
550
   at Lucene.Net.Index.DocumentsWriter.DoFlush(DocumentsWriterPerThread flushingDWPT) in z:\Builds\work\bcdbe6b8cc677a49\src\Lucene.Net.Core\Index\DocumentsWriter.cs:line
635
   at Lucene.Net.Index.DocumentsWriter.FlushAllThreads(IndexWriter indexWriter) in z:\Builds\work\bcdbe6b8cc677a49\src\Lucene.Net.Core\Index\DocumentsWriter.cs:line
769
   at Lucene.Net.Index.IndexWriter.PrepareCommitInternal() in z:\Builds\work\bcdbe6b8cc677a49\src\Lucene.Net.Core\Index\IndexWriter.cs:line
3577
   at Lucene.Net.Index.IndexWriter.CommitInternal() in z:\Builds\work\bcdbe6b8cc677a49\src\Lucene.Net.Core\Index\IndexWriter.cs:line
3763
   at Lucene.Net.Index.RandomIndexWriter.MaybeCommit() in z:\Builds\work\bcdbe6b8cc677a49\src\Lucene.Net.TestFramework\Index\RandomIndexWriter.cs:line
228
   at Lucene.Net.Index.RandomIndexWriter.AddDocument(IEnumerable`1 doc, Analyzer a) in z:\Builds\work\bcdbe6b8cc677a49\src\Lucene.Net.TestFramework\Index\RandomIndexWriter.cs:line
150
   at Lucene.Net.Index.RandomIndexWriter.AddDocument(IEnumerable`1 doc) in z:\Builds\work\bcdbe6b8cc677a49\src\Lucene.Net.TestFramework\Index\RandomIndexWriter.cs:line
132
   at Lucene.Net.Index.TestDuelingCodecs.CreateRandomIndex(Int32 numdocs, RandomIndexWriter
writer, Int64 seed) in z:\Builds\work\bcdbe6b8cc677a49\src\Lucene.Net.Tests\core\Index\TestDuelingCodecs.cs:line
159
   at Lucene.Net.Index.TestDuelingCodecs.SetUp() in z:\Builds\work\bcdbe6b8cc677a49\src\Lucene.Net.Tests\core\Index\TestDuelingCodecs.cs:line
93
--TearDown
   at Lucene.Net.Store.MockDirectoryWrapper.Dispose() in z:\Builds\work\bcdbe6b8cc677a49\src\Lucene.Net.TestFramework\Store\MockDirectoryWrapper.cs:line
923
   at Lucene.Net.Index.TestDuelingCodecs.TearDown() in z:\Builds\work\bcdbe6b8cc677a49\src\Lucene.Net.Tests\core\Index\TestDuelingCodecs.cs:line
122
Lucene.Net.Tests.dll: Lucene.Net.Index.TestNRTThreads.TestNRTThreads_Mem =================
Test(s) failed. System.IndexOutOfRangeException : Index was outside the bounds of the array.
   at System.IO.FileStream.ReadByte()
   at Lucene.Net.Support.FileStreamExtensions.Read(FileStream file, ByteBuffer dst, Int64
position) in z:\Builds\work\bcdbe6b8cc677a49\src\Lucene.Net.Core\Support\FileStreamExtensions.cs:line
22
   at Lucene.Net.Store.NIOFSDirectory.NIOFSIndexInput.ReadInternal(Byte[] b, Int32 offset,
Int32 len) in z:\Builds\work\bcdbe6b8cc677a49\src\Lucene.Net.Core\Store\NIOFSDirectory.cs:line
252
   at Lucene.Net.Store.BufferedIndexInput.Refill() in z:\Builds\work\bcdbe6b8cc677a49\src\Lucene.Net.Core\Store\BufferedIndexInput.cs:line
368
   at Lucene.Net.Store.BufferedIndexInput.ReadByte() in z:\Builds\work\bcdbe6b8cc677a49\src\Lucene.Net.Core\Store\BufferedIndexInput.cs:line
55
   at Lucene.Net.Store.DataInput.ReadVInt() in z:\Builds\work\bcdbe6b8cc677a49\src\Lucene.Net.Core\Store\DataInput.cs:line
117
   at Lucene.Net.Store.BufferedIndexInput.ReadVInt() in z:\Builds\work\bcdbe6b8cc677a49\src\Lucene.Net.Core\Store\BufferedIndexInput.cs:line
279
   at Lucene.Net.Store.MockIndexInputWrapper.ReadVInt() in z:\Builds\work\bcdbe6b8cc677a49\src\Lucene.Net.TestFramework\Store\MockIndexInputWrapper.cs:line
176
   at Lucene.Net.Codecs.BlockTreeTermsReader.FieldReader.SegmentTermsEnum.Frame.LoadBlock()
in z:\Builds\work\bcdbe6b8cc677a49\src\Lucene.Net.Core\Codecs\BlockTreeTermsReader.cs:line
2800
   at Lucene.Net.Codecs.BlockTreeTermsReader.FieldReader.SegmentTermsEnum.SeekExact(BytesRef
target) in z:\Builds\work\bcdbe6b8cc677a49\src\Lucene.Net.Core\Codecs\BlockTreeTermsReader.cs:line
2034
   at Lucene.Net.Index.BufferedUpdatesStream.ApplyTermDeletes(IEnumerable`1 termsIter, ReadersAndUpdates
rld, SegmentReader reader) in z:\Builds\work\bcdbe6b8cc677a49\src\Lucene.Net.Core\Index\BufferedUpdatesStream.cs:line
499
   at Lucene.Net.Index.BufferedUpdatesStream.ApplyDeletesAndUpdates(ReaderPool readerPool,
IList`1 infos) in z:\Builds\work\bcdbe6b8cc677a49\src\Lucene.Net.Core\Index\BufferedUpdatesStream.cs:line
333
   at Lucene.Net.Index.IndexWriter.ApplyAllDeletesAndUpdates() in z:\Builds\work\bcdbe6b8cc677a49\src\Lucene.Net.Core\Index\IndexWriter.cs:line
3949
   at Lucene.Net.Index.IndexWriter.MaybeApplyDeletes(Boolean applyAllDeletes) in z:\Builds\work\bcdbe6b8cc677a49\src\Lucene.Net.Core\Index\IndexWriter.cs:line
3934
   at Lucene.Net.Index.IndexWriter.GetReader(Boolean applyAllDeletes) in z:\Builds\work\bcdbe6b8cc677a49\src\Lucene.Net.Core\Index\IndexWriter.cs:line
412
   at Lucene.Net.Index.IndexWriter.get_Reader() in z:\Builds\work\bcdbe6b8cc677a49\src\Lucene.Net.Core\Index\IndexWriter.cs:line
295
   at Lucene.Net.Index.TestNRTThreads.get_FinalSearcher() in z:\Builds\work\bcdbe6b8cc677a49\src\Lucene.Net.Tests\core\Index\TestNRTThreads.cs:line
173
   at Lucene.Net.Index.ThreadedIndexingAndSearchingTestCase.RunTest(String testName) in z:\Builds\work\bcdbe6b8cc677a49\src\Lucene.Net.TestFramework\Index\ThreadedIndexingAndSearchingTestCase.cs:line
636
   at Lucene.Net.Index.TestNRTThreads.TestNRTThreads_Mem() in z:\Builds\work\bcdbe6b8cc677a49\src\Lucene.Net.Tests\core\Index\TestNRTThreads.cs:line
182
------- Stdout: -------
WARNING: Leftover undeleted temporary files The process cannot access the file 'write.lock'
because it is being used by another process.
------- Stderr: -------
: hit exc
: hit exc
   at NUnit.Framework.Assert.That(Object actual, IResolveConstraint expression, String message,
Object[] args)
   at NUnit.Framework.Assert.AreEqual(Int32 expected, Int32 actual)
   at Lucene.Net.Index.ThreadedIndexingAndSearchingTestCase.RunQuery(IndexSearcher s, Query
q) in z:\Builds\work\bcdbe6b8cc677a49\src\Lucene.Net.TestFramework\Index\ThreadedIndexingAndSearchingTestCase.cs:line
842
   at Lucene.Net.Index.ThreadedIndexingAndSearchingTestCase.ThreadAnonymousInnerClassHelper2.Run()
in z:\Builds\work\bcdbe6b8cc677a49\src\Lucene.Net.TestFramework\Index\ThreadedIndexingAndSearchingTestCase.cs:line
507
: hit exc
   at System.IO.FileStream.ReadByte()
   at Lucene.Net.Support.FileStreamExtensions.Read(FileStream file, ByteBuffer dst, Int64
position) in z:\Builds\work\bcdbe6b8cc677a49\src\Lucene.Net.Core\Support\FileStreamExtensions.cs:line
22
   at Lucene.Net.Store.NIOFSDirectory.NIOFSIndexInput.ReadInternal(Byte[] b, Int32 offset,
Int32 len) in z:\Builds\work\bcdbe6b8cc677a49\src\Lucene.Net.Core\Store\NIOFSDirectory.cs:line
252
   at Lucene.Net.Store.BufferedIndexInput.Refill() in z:\Builds\work\bcdbe6b8cc677a49\src\Lucene.Net.Core\Store\BufferedIndexInput.cs:line
368
   at Lucene.Net.Store.BufferedIndexInput.ReadByte() in z:\Builds\work\bcdbe6b8cc677a49\src\Lucene.Net.Core\Store\BufferedIndexInput.cs:line
55
   at Lucene.Net.Store.DataInput.ReadVInt() in z:\Builds\work\bcdbe6b8cc677a49\src\Lucene.Net.Core\Store\DataInput.cs:line
117
   at Lucene.Net.Store.BufferedIndexInput.ReadVInt() in z:\Builds\work\bcdbe6b8cc677a49\src\Lucene.Net.Core\Store\BufferedIndexInput.cs:line
279
   at Lucene.Net.Store.MockIndexInputWrapper.ReadVInt() in z:\Builds\work\bcdbe6b8cc677a49\src\Lucene.Net.TestFramework\Store\MockIndexInputWrapper.cs:line
176
   at Lucene.Net.Codecs.BlockTreeTermsReader.FieldReader.SegmentTermsEnum.Frame.LoadBlock()
in z:\Builds\work\bcdbe6b8cc677a49\src\Lucene.Net.Core\Codecs\BlockTreeTermsReader.cs:line
2800
   at Lucene.Net.Codecs.BlockTreeTermsReader.FieldReader.SegmentTermsEnum.SeekExact(BytesRef
target) in z:\Builds\work\bcdbe6b8cc677a49\src\Lucene.Net.Core\Codecs\BlockTreeTermsReader.cs:line
2034
   at Lucene.Net.Index.TermContext.Build(IndexReaderContext context, Term term) in z:\Builds\work\bcdbe6b8cc677a49\src\Lucene.Net.Core\Index\TermContext.cs:line
107
   at Lucene.Net.Search.TermQuery.CreateWeight(IndexSearcher searcher) in z:\Builds\work\bcdbe6b8cc677a49\src\Lucene.Net.Core\Search\TermQuery.cs:line
203
   at Lucene.Net.Search.IndexSearcher.CreateNormalizedWeight(Query query) in z:\Builds\work\bcdbe6b8cc677a49\src\Lucene.Net.Core\Search\IndexSearcher.cs:line
728
   at Lucene.Net.Search.IndexSearcher.Search(Query query, Filter filter, Int32 n, Sort sort)
in z:\Builds\work\bcdbe6b8cc677a49\src\Lucene.Net.Core\Search\IndexSearcher.cs:line 346
   at Lucene.Net.Index.ThreadedIndexingAndSearchingTestCase.RunQuery(IndexSearcher s, Query
q) in z:\Builds\work\bcdbe6b8cc677a49\src\Lucene.Net.TestFramework\Index\ThreadedIndexingAndSearchingTestCase.cs:line
837
   at Lucene.Net.Index.ThreadedIndexingAndSearchingTestCase.ThreadAnonymousInnerClassHelper2.Run()
in z:\Builds\work\bcdbe6b8cc677a49\src\Lucene.Net.TestFramework\Index\ThreadedIndexingAndSearchingTestCase.cs:line
507
Unhandled exception in remote appdomain: System.Exception:   Expected: 3
  But was:  4
 ---> NUnit.Framework.AssertionException:   Expected: 3
  But was:  4

   at NUnit.Framework.Assert.That(Object actual, IResolveConstraint expression, String message,
Object[] args)
   at NUnit.Framework.Assert.AreEqual(Int32 expected, Int32 actual)
   at Lucene.Net.Index.ThreadedIndexingAndSearchingTestCase.RunQuery(IndexSearcher s, Query
q) in z:\Builds\work\bcdbe6b8cc677a49\src\Lucene.Net.TestFramework\Index\ThreadedIndexingAndSearchingTestCase.cs:line
842
   at Lucene.Net.Index.ThreadedIndexingAndSearchingTestCase.ThreadAnonymousInnerClassHelper2.Run()
in z:\Builds\work\bcdbe6b8cc677a49\src\Lucene.Net.TestFramework\Index\ThreadedIndexingAndSearchingTestCase.cs:line
507
   --- End of inner exception stack trace ---
   at Lucene.Net.Index.ThreadedIndexingAndSearchingTestCase.ThreadAnonymousInnerClassHelper2.Run()
in z:\Builds\work\bcdbe6b8cc677a49\src\Lucene.Net.TestFramework\Index\ThreadedIndexingAndSearchingTestCase.cs:line
525
   at System.Threading.ThreadHelper.ThreadStart_Context(Object state)
   at System.Threading.ExecutionContext.RunInternal(ExecutionContext executionContext, ContextCallback
callback, Object state, Boolean preserveSyncCtx)
   at System.Threading.ExecutionContext.Run(ExecutionContext executionContext, ContextCallback
callback, Object state, Boolean preserveSyncCtx)
   at System.Threading.ExecutionContext.Run(ExecutionContext executionContext, ContextCallback
callback, Object state)
   at System.Threading.ThreadHelper.ThreadStart()
Unhandled exception in remote appdomain: System.Exception: Index was outside the bounds of
the array. ---> System.IndexOutOfRangeException: Index was outside the bounds of the array.
   at System.IO.FileStream.ReadByte()
   at Lucene.Net.Support.FileStreamExtensions.Read(FileStream file, ByteBuffer dst, Int64
position) in z:\Builds\work\bcdbe6b8cc677a49\src\Lucene.Net.Core\Support\FileStreamExtensions.cs:line
22
   at Lucene.Net.Store.NIOFSDirectory.NIOFSIndexInput.ReadInternal(Byte[] b, Int32 offset,
Int32 len) in z:\Builds\work\bcdbe6b8cc677a49\src\Lucene.Net.Core\Store\NIOFSDirectory.cs:line
252
   at Lucene.Net.Store.BufferedIndexInput.Refill() in z:\Builds\work\bcdbe6b8cc677a49\src\Lucene.Net.Core\Store\BufferedIndexInput.cs:line
368
   at Lucene.Net.Store.BufferedIndexInput.ReadByte() in z:\Builds\work\bcdbe6b8cc677a49\src\Lucene.Net.Core\Store\BufferedIndexInput.cs:line
55
   at Lucene.Net.Store.DataInput.ReadVInt() in z:\Builds\work\bcdbe6b8cc677a49\src\Lucene.Net.Core\Store\DataInput.cs:line
117
   at Lucene.Net.Store.BufferedIndexInput.ReadVInt() in z:\Builds\work\bcdbe6b8cc677a49\src\Lucene.Net.Core\Store\BufferedIndexInput.cs:line
279
   at Lucene.Net.Store.MockIndexInputWrapper.ReadVInt() in z:\Builds\work\bcdbe6b8cc677a49\src\Lucene.Net.TestFramework\Store\MockIndexInputWrapper.cs:line
176
   at Lucene.Net.Codecs.BlockTreeTermsReader.FieldReader.SegmentTermsEnum.Frame.LoadBlock()
in z:\Builds\work\bcdbe6b8cc677a49\src\Lucene.Net.Core\Codecs\BlockTreeTermsReader.cs:line
2800
   at Lucene.Net.Codecs.BlockTreeTermsReader.FieldReader.SegmentTermsEnum.SeekExact(BytesRef
target) in z:\Builds\work\bcdbe6b8cc677a49\src\Lucene.Net.Core\Codecs\BlockTreeTermsReader.cs:line
2034
   at Lucene.Net.Index.TermContext.Build(IndexReaderContext context, Term term) in z:\Builds\work\bcdbe6b8cc677a49\src\Lucene.Net.Core\Index\TermContext.cs:line
107
   at Lucene.Net.Search.TermQuery.CreateWeight(IndexSearcher searcher) in z:\Builds\work\bcdbe6b8cc677a49\src\Lucene.Net.Core\Search\TermQuery.cs:line
203
   at Lucene.Net.Search.IndexSearcher.CreateNormalizedWeight(Query query) in z:\Builds\work\bcdbe6b8cc677a49\src\Lucene.Net.Core\Search\IndexSearcher.cs:line
728
   at Lucene.Net.Search.IndexSearcher.Search(Query query, Filter filter, Int32 n, Sort sort)
in z:\Builds\work\bcdbe6b8cc677a49\src\Lucene.Net.Core\Search\IndexSearcher.cs:line 346
   at Lucene.Net.Index.ThreadedIndexingAndSearchingTestCase.RunQuery(IndexSearcher s, Query
q) in z:\Builds\work\bcdbe6b8cc677a49\src\Lucene.Net.TestFramework\Index\ThreadedIndexingAndSearchingTestCase.cs:line
837
   at Lucene.Net.Index.ThreadedIndexingAndSearchingTestCase.ThreadAnonymousInnerClassHelper2.Run()
in z:\Builds\work\bcdbe6b8cc677a49\src\Lucene.Net.TestFramework\Index\ThreadedIndexingAndSearchingTestCase.cs:line
507
   --- End of inner exception stack trace ---
   at Lucene.Net.Index.ThreadedIndexingAndSearchingTestCase.ThreadAnonymousInnerClassHelper2.Run()
in z:\Builds\work\bcdbe6b8cc677a49\src\Lucene.Net.TestFramework\Index\ThreadedIndexingAndSearchingTestCase.cs:line
525
   at System.Threading.ThreadHelper.ThreadStart_Context(Object state)
   at System.Threading.ExecutionContext.RunInternal(ExecutionContext executionContext, ContextCallback
callback, Object state, Boolean preserveSyncCtx)
   at System.Threading.ExecutionContext.Run(ExecutionContext executionContext, ContextCallback
callback, Object state, Boolean preserveSyncCtx)
   at System.Threading.ExecutionContext.Run(ExecutionContext executionContext, ContextCallback
callback, Object state)
   at System.Threading.ThreadHelper.ThreadStart()
   at System.IO.FileStream.ReadByte()
   at Lucene.Net.Support.FileStreamExtensions.Read(FileStream file, ByteBuffer dst, Int64
position) in z:\Builds\work\bcdbe6b8cc677a49\src\Lucene.Net.Core\Support\FileStreamExtensions.cs:line
22
   at Lucene.Net.Store.NIOFSDirectory.NIOFSIndexInput.ReadInternal(Byte[] b, Int32 offset,
Int32 len) in z:\Builds\work\bcdbe6b8cc677a49\src\Lucene.Net.Core\Store\NIOFSDirectory.cs:line
252
   at Lucene.Net.Store.BufferedIndexInput.Refill() in z:\Builds\work\bcdbe6b8cc677a49\src\Lucene.Net.Core\Store\BufferedIndexInput.cs:line
368
   at Lucene.Net.Store.BufferedIndexInput.ReadByte() in z:\Builds\work\bcdbe6b8cc677a49\src\Lucene.Net.Core\Store\BufferedIndexInput.cs:line
55
   at Lucene.Net.Store.DataInput.ReadVInt() in z:\Builds\work\bcdbe6b8cc677a49\src\Lucene.Net.Core\Store\DataInput.cs:line
117
   at Lucene.Net.Store.BufferedIndexInput.ReadVInt() in z:\Builds\work\bcdbe6b8cc677a49\src\Lucene.Net.Core\Store\BufferedIndexInput.cs:line
279
   at Lucene.Net.Store.MockIndexInputWrapper.ReadVInt() in z:\Builds\work\bcdbe6b8cc677a49\src\Lucene.Net.TestFramework\Store\MockIndexInputWrapper.cs:line
176
   at Lucene.Net.Codecs.BlockTreeTermsReader.FieldReader.SegmentTermsEnum.Frame.LoadBlock()
in z:\Builds\work\bcdbe6b8cc677a49\src\Lucene.Net.Core\Codecs\BlockTreeTermsReader.cs:line
2800
   at Lucene.Net.Codecs.BlockTreeTermsReader.FieldReader.SegmentTermsEnum.SeekExact(BytesRef
target) in z:\Builds\work\bcdbe6b8cc677a49\src\Lucene.Net.Core\Codecs\BlockTreeTermsReader.cs:line
2034
   at Lucene.Net.Index.TermContext.Build(IndexReaderContext context, Term term) in z:\Builds\work\bcdbe6b8cc677a49\src\Lucene.Net.Core\Index\TermContext.cs:line
107
   at Lucene.Net.Search.TermQuery.CreateWeight(IndexSearcher searcher) in z:\Builds\work\bcdbe6b8cc677a49\src\Lucene.Net.Core\Search\TermQuery.cs:line
203
   at Lucene.Net.Search.IndexSearcher.CreateNormalizedWeight(Query query) in z:\Builds\work\bcdbe6b8cc677a49\src\Lucene.Net.Core\Search\IndexSearcher.cs:line
728
   at Lucene.Net.Search.IndexSearcher.Search(Query query, Filter filter, Int32 n) in z:\Builds\work\bcdbe6b8cc677a49\src\Lucene.Net.Core\Search\IndexSearcher.cs:line
301
   at Lucene.Net.Search.IndexSearcher.Search(Query query, Int32 n) in z:\Builds\work\bcdbe6b8cc677a49\src\Lucene.Net.Core\Search\IndexSearcher.cs:line
290
   at Lucene.Net.Index.ThreadedIndexingAndSearchingTestCase.RunQuery(IndexSearcher s, Query
q) in z:\Builds\work\bcdbe6b8cc677a49\src\Lucene.Net.TestFramework\Index\ThreadedIndexingAndSearchingTestCase.cs:line
836
   at Lucene.Net.Index.ThreadedIndexingAndSearchingTestCase.ThreadAnonymousInnerClassHelper2.Run()
in z:\Builds\work\bcdbe6b8cc677a49\src\Lucene.Net.TestFramework\Index\ThreadedIndexingAndSearchingTestCase.cs:line
507
Unhandled exception in remote appdomain: System.Exception: Index was outside the bounds of
the array. ---> System.IndexOutOfRangeException: Index was outside the bounds of the array.
   at System.IO.FileStream.ReadByte()
   at Lucene.Net.Support.FileStreamExtensions.Read(FileStream file, ByteBuffer dst, Int64
position) in z:\Builds\work\bcdbe6b8cc677a49\src\Lucene.Net.Core\Support\FileStreamExtensions.cs:line
22
   at Lucene.Net.Store.NIOFSDirectory.NIOFSIndexInput.ReadInternal(Byte[] b, Int32 offset,
Int32 len) in z:\Builds\work\bcdbe6b8cc677a49\src\Lucene.Net.Core\Store\NIOFSDirectory.cs:line
252
   at Lucene.Net.Store.BufferedIndexInput.Refill() in z:\Builds\work\bcdbe6b8cc677a49\src\Lucene.Net.Core\Store\BufferedIndexInput.cs:line
368
   at Lucene.Net.Store.BufferedIndexInput.ReadByte() in z:\Builds\work\bcdbe6b8cc677a49\src\Lucene.Net.Core\Store\BufferedIndexInput.cs:line
55
   at Lucene.Net.Store.DataInput.ReadVInt() in z:\Builds\work\bcdbe6b8cc677a49\src\Lucene.Net.Core\Store\DataInput.cs:line
117
   at Lucene.Net.Store.BufferedIndexInput.ReadVInt() in z:\Builds\work\bcdbe6b8cc677a49\src\Lucene.Net.Core\Store\BufferedIndexInput.cs:line
279
   at Lucene.Net.Store.MockIndexInputWrapper.ReadVInt() in z:\Builds\work\bcdbe6b8cc677a49\src\Lucene.Net.TestFramework\Store\MockIndexInputWrapper.cs:line
176
   at Lucene.Net.Codecs.BlockTreeTermsReader.FieldReader.SegmentTermsEnum.Frame.LoadBlock()
in z:\Builds\work\bcdbe6b8cc677a49\src\Lucene.Net.Core\Codecs\BlockTreeTermsReader.cs:line
2800
   at Lucene.Net.Codecs.BlockTreeTermsReader.FieldReader.SegmentTermsEnum.SeekExact(BytesRef
target) in z:\Builds\work\bcdbe6b8cc677a49\src\Lucene.Net.Core\Codecs\BlockTreeTermsReader.cs:line
2034
   at Lucene.Net.Index.TermContext.Build(IndexReaderContext context, Term term) in z:\Builds\work\bcdbe6b8cc677a49\src\Lucene.Net.Core\Index\TermContext.cs:line
107
   at Lucene.Net.Search.TermQuery.CreateWeight(IndexSearcher searcher) in z:\Builds\work\bcdbe6b8cc677a49\src\Lucene.Net.Core\Search\TermQuery.cs:line
203
   at Lucene.Net.Search.IndexSearcher.CreateNormalizedWeight(Query query) in z:\Builds\work\bcdbe6b8cc677a49\src\Lucene.Net.Core\Search\IndexSearcher.cs:line
728
   at Lucene.Net.Search.IndexSearcher.Search(Query query, Filter filter, Int32 n) in z:\Builds\work\bcdbe6b8cc677a49\src\Lucene.Net.Core\Search\IndexSearcher.cs:line
301
   at Lucene.Net.Search.IndexSearcher.Search(Query query, Int32 n) in z:\Builds\work\bcdbe6b8cc677a49\src\Lucene.Net.Core\Search\IndexSearcher.cs:line
290
   at Lucene.Net.Index.ThreadedIndexingAndSearchingTestCase.RunQuery(IndexSearcher s, Query
q) in z:\Builds\work\bcdbe6b8cc677a49\src\Lucene.Net.TestFramework\Index\ThreadedIndexingAndSearchingTestCase.cs:line
836
   at Lucene.Net.Index.ThreadedIndexingAndSearchingTestCase.ThreadAnonymousInnerClassHelper2.Run()
in z:\Builds\work\bcdbe6b8cc677a49\src\Lucene.Net.TestFramework\Index\ThreadedIndexingAndSearchingTestCase.cs:line
507
   --- End of inner exception stack trace ---
   at Lucene.Net.Index.ThreadedIndexingAndSearchingTestCase.ThreadAnonymousInnerClassHelper2.Run()
in z:\Builds\work\bcdbe6b8cc677a49\src\Lucene.Net.TestFramework\Index\ThreadedIndexingAndSearchingTestCase.cs:line
525
   at System.Threading.ThreadHelper.ThreadStart_Context(Object state)
   at System.Threading.ExecutionContext.RunInternal(ExecutionContext executionContext, ContextCallback
callback, Object state, Boolean preserveSyncCtx)
   at System.Threading.ExecutionContext.Run(ExecutionContext executionContext, ContextCallback
callback, Object state, Boolean preserveSyncCtx)
   at System.Threading.ExecutionContext.Run(ExecutionContext executionContext, ContextCallback
callback, Object state)
   at System.Threading.ThreadHelper.ThreadStart()
Lucene.Net.Tests.dll: Lucene.Net.Search.TestFuzzyQuery.TestTieBreaker =================
Test(s) failed.   Expected: 5
  But was:  2

   at NUnit.Framework.Assert.That(Object actual, IResolveConstraint expression, String message,
Object[] args)
   at NUnit.Framework.Assert.AreEqual(Int32 expected, Int32 actual)
   at Lucene.Net.Search.TestFuzzyQuery.TestTieBreaker() in z:\Builds\work\bcdbe6b8cc677a49\src\Lucene.Net.Tests\core\Search\TestFuzzyQuery.cs:line
268
Changes included (3 changes)
====================================================
Change e3833d6ccac28ed7879336e826cdeb5e3f9bdc77 by laimis (1 file):
put back commented out code


Change 6133cf8b66b41f7411f828120fdc7eb78ab6cadf by laimis (1 file):
Merge remote-tracking branch 'upstream/master' into timing_fixes


Change ee1635f4c12385f9310fef75078d0c9e13fda966 by laimis (25 files):
use Environment.TickCount instead DateTime.Now.Millisecond


see more information about changed files: http://teamcity.codebetter.com/viewLog.html?tab=buildChangesDiv&buildId=191298&buildTypeId=LuceneNet_Core

============================================================================
Configure email notifications: http://teamcity.codebetter.com/profile.html?init=1&tab=userNotifications

Mime
  • Unnamed multipart/alternative (inline, None, 0 bytes)
View raw message