lucenenet-dev mailing list archives

Site index · List index
Message view « Date » · « Thread »
Top « Date » · « Thread »
From t.@codebetter.com
Subject [TeamCity, FAILED] Build Lucene.NET :: Lucene.NET Nightly [master] #385
Date Thu, 16 Apr 2015 10:00:12 GMT
Build Lucene.NET :: Lucene.NET Nightly [master] #385 failed (Tests failed: 106 (7 new), passed:
2665, ignored: 122; snapshot dependency failed: Lucene.NET :: Lucene.NET Core).
Agent: JetBrains-dotnet-agent01
Build results: http://teamcity.codebetter.com/viewLog.html?buildId=188622&buildTypeId=LuceneNet_LuceneNetNightly

Failed Tests Summary:
Newly failed tests (7 tests, alphabetically ordered)
==================================================================
Lucene.Net.Tests.dll: Lucene.Net.Codecs.Compressing.TestCompressingStoredFieldsFormat.BaseStoredFieldsFormatTestCase.TestConcurrentReads
Lucene.Net.Tests.dll: Lucene.Net.Index.TestIndexWriter.TestThreadInterruptDeadlock
Lucene.Net.Tests.dll: Lucene.Net.Index.TestIndexWriterWithThreads.TestIOExceptionDuringWriteSegmentWithThreadsOnlyOnce
Lucene.Net.Tests.dll: Lucene.Net.Index.TestStressIndexing2.TestMultiConfig
Lucene.Net.Tests.dll: Lucene.Net.Search.TestShardSearching.TestSimple
Lucene.Net.Tests.dll: Lucene.Net.Store.TestLockFactory.TestStressLocksNativeFSLockFactory
Lucene.Net.Tests.dll: Lucene.Net.Util.TestOpenBitSet.BaseDocIdSetTestCase`1.TestAgainstBitSet

Other failed tests (99 tests, alphabetically ordered)
==================================================================
Lucene.Net.Tests.Facet.dll: Lucene.Net.Facet.Range.TestRangeFacetCounts.TestMixedRangeAndNonRangeTaxonomy
Lucene.Net.Tests.Facet.dll: Lucene.Net.Facet.SortedSet.TestSortedSetDocValuesFacets.TestRandom
Lucene.Net.Tests.Facet.dll: Lucene.Net.Facet.SortedSet.TestSortedSetDocValuesFacets.TestStaleState
Lucene.Net.Tests.Facet.dll: Lucene.Net.Facet.Taxonomy.Directory.TestAddTaxonomy.TestConcurrency
Lucene.Net.Tests.Facet.dll: Lucene.Net.Facet.Taxonomy.Directory.TestAddTaxonomy.TestSimple
Lucene.Net.Tests.Facet.dll: Lucene.Net.Facet.Taxonomy.Directory.TestConcurrentFacetedIndexing.TestConcurrency
Lucene.Net.Tests.Facet.dll: Lucene.Net.Facet.Taxonomy.Directory.TestDirectoryTaxonomyReader.TestFreshReadRecreatedTaxonomy
Lucene.Net.Tests.Facet.dll: Lucene.Net.Facet.Taxonomy.Directory.TestDirectoryTaxonomyReader.TestGetChildren
Lucene.Net.Tests.Facet.dll: Lucene.Net.Facet.Taxonomy.Directory.TestDirectoryTaxonomyReader.TestOpenIfChangedManySegments
Lucene.Net.Tests.Facet.dll: Lucene.Net.Facet.Taxonomy.Directory.TestDirectoryTaxonomyReader.TestOpenIfChangedMergedSegment
Lucene.Net.Tests.Facet.dll: Lucene.Net.Facet.Taxonomy.Directory.TestDirectoryTaxonomyReader.TestOpenIfChangedNoChangesButSegmentMerges
Lucene.Net.Tests.Facet.dll: Lucene.Net.Facet.Taxonomy.Directory.TestDirectoryTaxonomyReader.TestOpenIfChangedReadRecreatedTaxonomy
Lucene.Net.Tests.Facet.dll: Lucene.Net.Facet.Taxonomy.Directory.TestDirectoryTaxonomyWriter.TestConcurrency
Lucene.Net.Tests.Facet.dll: Lucene.Net.Facet.Taxonomy.Directory.TestDirectoryTaxonomyWriter.TestHugeLabel
Lucene.Net.Tests.Facet.dll: Lucene.Net.Facet.Taxonomy.TestLRUHashMap.TestLru
Lucene.Net.Tests.Facet.dll: Lucene.Net.Facet.Taxonomy.TestSearcherTaxonomyManager.TestReplaceTaxonomyNrt
Lucene.Net.Tests.Facet.dll: Lucene.Net.Facet.Taxonomy.TestTaxonomyCombined.TestChildrenArrays
Lucene.Net.Tests.Facet.dll: Lucene.Net.Facet.Taxonomy.TestTaxonomyCombined.TestChildrenArraysGrowth
Lucene.Net.Tests.Facet.dll: Lucene.Net.Facet.Taxonomy.TestTaxonomyCombined.TestChildrenArraysInvariants
Lucene.Net.Tests.Facet.dll: Lucene.Net.Facet.Taxonomy.TestTaxonomyCombined.TestReaderBasic
Lucene.Net.Tests.Facet.dll: Lucene.Net.Facet.Taxonomy.TestTaxonomyCombined.TestReaderParent
Lucene.Net.Tests.Facet.dll: Lucene.Net.Facet.Taxonomy.TestTaxonomyCombined.TestSeparateReaderAndWriter
Lucene.Net.Tests.Facet.dll: Lucene.Net.Facet.Taxonomy.TestTaxonomyCombined.TestWriter
Lucene.Net.Tests.Facet.dll: Lucene.Net.Facet.Taxonomy.TestTaxonomyCombined.TestWriterCheckPaths
Lucene.Net.Tests.Facet.dll: Lucene.Net.Facet.Taxonomy.TestTaxonomyCombined.TestWriterCheckPaths2
Lucene.Net.Tests.Facet.dll: Lucene.Net.Facet.Taxonomy.TestTaxonomyCombined.TestWriterParent1
Lucene.Net.Tests.Facet.dll: Lucene.Net.Facet.Taxonomy.TestTaxonomyCombined.TestWriterParent2
Lucene.Net.Tests.Facet.dll: Lucene.Net.Facet.Taxonomy.TestTaxonomyCombined.TestWriterSimpler
Lucene.Net.Tests.Facet.dll: Lucene.Net.Facet.Taxonomy.TestTaxonomyCombined.TestWriterTwice
Lucene.Net.Tests.Facet.dll: Lucene.Net.Facet.Taxonomy.TestTaxonomyCombined.TestWriterTwice2
Lucene.Net.Tests.Facet.dll: Lucene.Net.Facet.Taxonomy.TestTaxonomyCombined.TestWriterTwice3
Lucene.Net.Tests.Facet.dll: Lucene.Net.Facet.Taxonomy.TestTaxonomyFacetAssociations.TestFloatSumAssociation
Lucene.Net.Tests.Facet.dll: Lucene.Net.Facet.Taxonomy.TestTaxonomyFacetAssociations.TestIntAndFloatAssocation
Lucene.Net.Tests.Facet.dll: Lucene.Net.Facet.Taxonomy.TestTaxonomyFacetAssociations.TestIntSumAssociation
Lucene.Net.Tests.Facet.dll: Lucene.Net.Facet.Taxonomy.TestTaxonomyFacetAssociations.TestIntSumAssociationDrillDown
Lucene.Net.Tests.Facet.dll: Lucene.Net.Facet.Taxonomy.TestTaxonomyFacetCounts.TestBasic
Lucene.Net.Tests.Facet.dll: Lucene.Net.Facet.Taxonomy.TestTaxonomyFacetCounts.TestChildCount
Lucene.Net.Tests.Facet.dll: Lucene.Net.Facet.Taxonomy.TestTaxonomyFacetCounts.TestCountRoot
Lucene.Net.Tests.Facet.dll: Lucene.Net.Facet.Taxonomy.TestTaxonomyFacetCounts.TestLabelWithDelimiter
Lucene.Net.Tests.Facet.dll: Lucene.Net.Facet.Taxonomy.TestTaxonomyFacetCounts.TestManyFacetsInOneDocument
Lucene.Net.Tests.Facet.dll: Lucene.Net.Facet.Taxonomy.TestTaxonomyFacetCounts.TestRandom
Lucene.Net.Tests.Facet.dll: Lucene.Net.Facet.Taxonomy.TestTaxonomyFacetCounts.TestSegmentsWithoutCategoriesOrResults
Lucene.Net.Tests.Facet.dll: Lucene.Net.Facet.Taxonomy.TestTaxonomyFacetCounts.TestSeparateIndexedFields
Lucene.Net.Tests.Facet.dll: Lucene.Net.Facet.Taxonomy.TestTaxonomyFacetCounts.TestSparseFacets
Lucene.Net.Tests.Facet.dll: Lucene.Net.Facet.Taxonomy.TestTaxonomyFacetCounts2
Lucene.Net.Tests.Facet.dll: Lucene.Net.Facet.Taxonomy.TestTaxonomyFacetCounts2.TestAllCounts
Lucene.Net.Tests.Facet.dll: Lucene.Net.Facet.Taxonomy.TestTaxonomyFacetCounts2.TestBigNumResults
Lucene.Net.Tests.Facet.dll: Lucene.Net.Facet.Taxonomy.TestTaxonomyFacetCounts2.TestDifferentNumResults
Lucene.Net.Tests.Facet.dll: Lucene.Net.Facet.Taxonomy.TestTaxonomyFacetCounts2.TestNoParents
Lucene.Net.Tests.Facet.dll: Lucene.Net.Facet.Taxonomy.TestTaxonomyFacetSumValueSource.TestBasic
Lucene.Net.Tests.Facet.dll: Lucene.Net.Facet.Taxonomy.TestTaxonomyFacetSumValueSource.TestCountAndSumScore
Lucene.Net.Tests.Facet.dll: Lucene.Net.Facet.Taxonomy.TestTaxonomyFacetSumValueSource.TestNoScore
Lucene.Net.Tests.Facet.dll: Lucene.Net.Facet.Taxonomy.TestTaxonomyFacetSumValueSource.TestRandom
Lucene.Net.Tests.Facet.dll: Lucene.Net.Facet.Taxonomy.TestTaxonomyFacetSumValueSource.TestRollupValues
Lucene.Net.Tests.Facet.dll: Lucene.Net.Facet.Taxonomy.TestTaxonomyFacetSumValueSource.TestSparseFacets
Lucene.Net.Tests.Facet.dll: Lucene.Net.Facet.Taxonomy.TestTaxonomyFacetSumValueSource.TestSumScoreAggregator
Lucene.Net.Tests.Facet.dll: Lucene.Net.Facet.Taxonomy.TestTaxonomyFacetSumValueSource.TestWithScore
Lucene.Net.Tests.Facet.dll: Lucene.Net.Facet.TestDrillSideways.TestBasic
Lucene.Net.Tests.Facet.dll: Lucene.Net.Facet.TestDrillSideways.TestMultipleRequestsPerDim
Lucene.Net.Tests.Facet.dll: Lucene.Net.Facet.TestDrillSideways.TestRandom
Lucene.Net.Tests.Facet.dll: Lucene.Net.Facet.TestDrillSideways.TestSometimesInvalidDrillDown
Lucene.Net.Tests.Queries.dll: Lucene.Net.Tests.Queries.CommonTermsQueryTest.TestEqualsHashCode
Lucene.Net.Tests.dll: Lucene.Net.Codecs.Lucene41.TestBlockPostingsFormat2
Lucene.Net.Tests.dll: Lucene.Net.Codecs.Lucene41.TestBlockPostingsFormat3.Test
Lucene.Net.Tests.dll: Lucene.Net.Index.TestAtomicUpdate.TestAtomicUpdates
Lucene.Net.Tests.dll: Lucene.Net.Index.TestDirectoryReader.TestNoDir
Lucene.Net.Tests.dll: Lucene.Net.Index.TestDocumentsWriterStallControl.TestSimpleStall
Lucene.Net.Tests.dll: Lucene.Net.Index.TestDuelingCodecs.TestEquals
Lucene.Net.Tests.dll: Lucene.Net.Index.TestIndexWriter.TestTwoThreadsInterruptDeadlock
Lucene.Net.Tests.dll: Lucene.Net.Index.TestIndexWriterExceptions.TestExceptionOnMergeInit
Lucene.Net.Tests.dll: Lucene.Net.Index.TestIndexWriterReader.TestDuringAddDelete
Lucene.Net.Tests.dll: Lucene.Net.Index.TestIndexWriterWithThreads.TestIOExceptionDuringAbortWithThreadsOnlyOnce
Lucene.Net.Tests.dll: Lucene.Net.Index.TestStressIndexing.TestStressIndexAndSearching
Lucene.Net.Tests.dll: Lucene.Net.Index.TestTermdocPerf.TestTermDocPerf
Lucene.Net.Tests.dll: Lucene.Net.Index.TestTransactions.TestTransactions_Mem
Lucene.Net.Tests.dll: Lucene.Net.Search.Spans.TestSpanMultiTermQueryWrapper.TestFuzzy2
Lucene.Net.Tests.dll: Lucene.Net.Search.TestFuzzyQuery.TestTieBreaker
Lucene.Net.Tests.dll: Lucene.Net.Search.TestNumericRangeQuery32.TestInfiniteValues
Lucene.Net.Tests.dll: Lucene.Net.Search.TestNumericRangeQuery64.TestInfiniteValues
Lucene.Net.Tests.dll: Lucene.Net.Search.TestSearchAfter.TestQueries
Lucene.Net.Tests.dll: Lucene.Net.Search.TestSimpleExplanations.TestDMQ8
Lucene.Net.Tests.dll: Lucene.Net.Search.TestTermVectors
Lucene.Net.Tests.dll: Lucene.Net.Search.TestTermVectors.TestMixedVectrosVectors
Lucene.Net.Tests.dll: Lucene.Net.Search.TestTopDocsMerge.TestSort_2
Lucene.Net.Tests.dll: Lucene.Net.Store.TestBufferedIndexInput.TestSetBufferSize
Lucene.Net.Tests.dll: Lucene.Net.Store.TestDirectory.TestDontCreate
Lucene.Net.Tests.dll: Lucene.Net.Store.TestFileSwitchDirectory.TestNoDir
Lucene.Net.Tests.dll: Lucene.Net.Tests.TestAssertions.TestTokenStreams
Lucene.Net.Tests.dll: Lucene.Net.Util.Packed.TestEliasFanoSequence.TestMonotoneSequencesLonger
Lucene.Net.Tests.dll: Lucene.Net.Util.Packed.TestEliasFanoSequence.TestStrictMonotoneSequencesLonger
Lucene.Net.Tests.dll: Lucene.Net.Util.TestIndexableBinaryStringTools.TestEncodedSortability
Lucene.Net.Tests.dll: Lucene.Net.Util.TestPagedBytes.TestDataInputOutput
Lucene.Net.Tests.dll: Lucene.Net.Util.TestPagedBytes.TestOverflow



Newly failed tests details (only first 3 failures shown here)
==================================================================
Lucene.Net.Tests.dll: Lucene.Net.Codecs.Compressing.TestCompressingStoredFieldsFormat.BaseStoredFieldsFormatTestCase.TestConcurrentReads
(new) =================
Test(s) failed. System.InvalidOperationException : Expected 1 hit, got 0
   at Lucene.Net.Index.BaseStoredFieldsFormatTestCase.TestConcurrentReads() in z:\Builds\work\bcdbe6b8cc677a49\src\Lucene.Net.TestFramework\Index\BaseStoredFieldsFormatTestCase.cs:line
453
Lucene.Net.Tests.dll: Lucene.Net.Index.TestIndexWriter.TestThreadInterruptDeadlock (new) =================
Test(s) failed.   Expected: False
  But was:  True

   at NUnit.Framework.Assert.That(Object actual, IResolveConstraint expression, String message,
Object[] args)
   at NUnit.Framework.Assert.IsFalse(Boolean condition)
   at Lucene.Net.Index.TestIndexWriter.TestThreadInterruptDeadlock() in z:\Builds\work\bcdbe6b8cc677a49\src\Lucene.Net.Tests\core\Index\TestIndexWriter.cs:line
1412
------- Stderr: -------
TEST: got interrupt
   at Lucene.Net.Store.SlowOpeningMockIndexInputWrapper..ctor(MockDirectoryWrapper dir, String
name, IndexInput delegate) in z:\Builds\work\bcdbe6b8cc677a49\src\Lucene.Net.TestFramework\Store\SlowOpeningMockIndexInputWrapper.cs:line
45
   at Lucene.Net.Store.MockDirectoryWrapper.OpenInput(String name, IOContext context) in z:\Builds\work\bcdbe6b8cc677a49\src\Lucene.Net.TestFramework\Store\MockDirectoryWrapper.cs:line
805
   at Lucene.Net.Store.FilterDirectory.OpenChecksumInput(String name, IOContext context) in
z:\Builds\work\bcdbe6b8cc677a49\src\Lucene.Net.Core\Store\FilterDirectory.cs:line 132
   at Lucene.Net.Codecs.Lucene46.Lucene46SegmentInfoReader.Read(Directory dir, String segment,
IOContext context) in z:\Builds\work\bcdbe6b8cc677a49\src\Lucene.Net.Core\Codecs\Lucene46\Lucene46SegmentInfoReader.cs:line
47
   at Lucene.Net.Index.SegmentInfos.Read(Directory directory, String segmentFileName) in z:\Builds\work\bcdbe6b8cc677a49\src\Lucene.Net.Core\Index\SegmentInfos.cs:line
381
   at Lucene.Net.Index.SegmentInfos.FindSegmentsFileAnonymousInnerClassHelper.DoBody(String
segmentFileName) in z:\Builds\work\bcdbe6b8cc677a49\src\Lucene.Net.Core\Index\SegmentInfos.cs:line
487
   at Lucene.Net.Index.SegmentInfos.FindSegmentsFile.Run(IndexCommit commit) in z:\Builds\work\bcdbe6b8cc677a49\src\Lucene.Net.Core\Index\SegmentInfos.cs:line
1031
   at Lucene.Net.Index.SegmentInfos.FindSegmentsFile.Run() in z:\Builds\work\bcdbe6b8cc677a49\src\Lucene.Net.Core\Index\SegmentInfos.cs:line
838
   at Lucene.Net.Index.SegmentInfos.Read(Directory directory) in z:\Builds\work\bcdbe6b8cc677a49\src\Lucene.Net.Core\Index\SegmentInfos.cs:line
469
   at Lucene.Net.Index.IndexWriter..ctor(Directory d, IndexWriterConfig conf) in z:\Builds\work\bcdbe6b8cc677a49\src\Lucene.Net.Core\Index\IndexWriter.cs:line
895
   at Lucene.Net.Index.TestIndexWriter.IndexerThreadInterrupt.Run() in z:\Builds\work\bcdbe6b8cc677a49\src\Lucene.Net.Tests\core\Index\TestIndexWriter.cs:line
1201
TEST: got interrupt
   at Lucene.Net.Store.SlowOpeningMockIndexInputWrapper..ctor(MockDirectoryWrapper dir, String
name, IndexInput delegate) in z:\Builds\work\bcdbe6b8cc677a49\src\Lucene.Net.TestFramework\Store\SlowOpeningMockIndexInputWrapper.cs:line
45
   at Lucene.Net.Store.MockDirectoryWrapper.OpenInput(String name, IOContext context) in z:\Builds\work\bcdbe6b8cc677a49\src\Lucene.Net.TestFramework\Store\MockDirectoryWrapper.cs:line
805
   at Lucene.Net.Codecs.Lucene41.Lucene41PostingsReader..ctor(Directory dir, FieldInfos fieldInfos,
SegmentInfo segmentInfo, IOContext ioContext, String segmentSuffix) in z:\Builds\work\bcdbe6b8cc677a49\src\Lucene.Net.Core\Codecs\Lucene41\Lucene41PostingsReader.cs:line
60
   at Lucene.Net.Codecs.Lucene41.Lucene41PostingsFormat.FieldsProducer(SegmentReadState state)
in z:\Builds\work\bcdbe6b8cc677a49\src\Lucene.Net.Core\Codecs\Lucene41\Lucene41PostingsFormat.cs:line
428
   at Lucene.Net.Codecs.Perfield.PerFieldPostingsFormat.FieldsReader..ctor(PerFieldPostingsFormat
outerInstance, SegmentReadState readState) in z:\Builds\work\bcdbe6b8cc677a49\src\Lucene.Net.Core\Codecs\Perfield\PerFieldPostingsFormat.cs:line
216
   at Lucene.Net.Codecs.Perfield.PerFieldPostingsFormat.FieldsProducer(SegmentReadState state)
in z:\Builds\work\bcdbe6b8cc677a49\src\Lucene.Net.Core\Codecs\Perfield\PerFieldPostingsFormat.cs:line
277
   at Lucene.Net.Index.SegmentCoreReaders..ctor(SegmentReader owner, Directory dir, SegmentCommitInfo
si, IOContext context, Int32 termsIndexDivisor) in z:\Builds\work\bcdbe6b8cc677a49\src\Lucene.Net.Core\Index\SegmentCoreReaders.cs:line
151
   at Lucene.Net.Index.SegmentReader..ctor(SegmentCommitInfo si, Int32 termInfosIndexDivisor,
IOContext context) in z:\Builds\work\bcdbe6b8cc677a49\src\Lucene.Net.Core\Index\SegmentReader.cs:line
111
   at Lucene.Net.Index.ReadersAndUpdates.GetReader(IOContext context) in z:\Builds\work\bcdbe6b8cc677a49\src\Lucene.Net.Core\Index\ReadersAndUpdates.cs:line
167
   at Lucene.Net.Index.ReadersAndUpdates.GetReadOnlyClone(IOContext context) in z:\Builds\work\bcdbe6b8cc677a49\src\Lucene.Net.Core\Index\ReadersAndUpdates.cs:line
298
   at Lucene.Net.Index.StandardDirectoryReader.Open(IndexWriter writer, SegmentInfos infos,
Boolean applyAllDeletes) in z:\Builds\work\bcdbe6b8cc677a49\src\Lucene.Net.Core\Index\StandardDirectoryReader.cs:line
126
   at Lucene.Net.Index.IndexWriter.GetReader(Boolean applyAllDeletes) in z:\Builds\work\bcdbe6b8cc677a49\src\Lucene.Net.Core\Index\IndexWriter.cs:line
413
   at Lucene.Net.Index.DirectoryReader.Open(IndexWriter writer, Boolean applyAllDeletes) in
z:\Builds\work\bcdbe6b8cc677a49\src\Lucene.Net.Core\Index\DirectoryReader.cs:line 115
   at Lucene.Net.Index.TestIndexWriter.IndexerThreadInterrupt.Run() in z:\Builds\work\bcdbe6b8cc677a49\src\Lucene.Net.Tests\core\Index\TestIndexWriter.cs:line
1253
TEST: got interrupt
   at Lucene.Net.Store.SlowOpeningMockIndexInputWrapper..ctor(MockDirectoryWrapper dir, String
name, IndexInput delegate) in z:\Builds\work\bcdbe6b8cc677a49\src\Lucene.Net.TestFramework\Store\SlowOpeningMockIndexInputWrapper.cs:line
45
   at Lucene.Net.Store.MockDirectoryWrapper.OpenInput(String name, IOContext context) in z:\Builds\work\bcdbe6b8cc677a49\src\Lucene.Net.TestFramework\Store\MockDirectoryWrapper.cs:line
805
   at Lucene.Net.Store.FilterDirectory.OpenChecksumInput(String name, IOContext context) in
z:\Builds\work\bcdbe6b8cc677a49\src\Lucene.Net.Core\Store\FilterDirectory.cs:line 132
   at Lucene.Net.Store.CompoundFileDirectory.ReadEntries(IndexInputSlicer handle, Directory
dir, String name) in z:\Builds\work\bcdbe6b8cc677a49\src\Lucene.Net.Core\Store\CompoundFileDirectory.cs:line
165
   at Lucene.Net.Store.CompoundFileDirectory..ctor(Directory directory, String fileName, IOContext
context, Boolean openForWrite) in z:\Builds\work\bcdbe6b8cc677a49\src\Lucene.Net.Core\Store\CompoundFileDirectory.cs:line
110
   at Lucene.Net.Index.SegmentReader.ReadFieldInfos(SegmentCommitInfo info) in z:\Builds\work\bcdbe6b8cc677a49\src\Lucene.Net.Core\Index\SegmentReader.cs:line
245
   at Lucene.Net.Index.SegmentReader..ctor(SegmentCommitInfo si, Int32 termInfosIndexDivisor,
IOContext context) in z:\Builds\work\bcdbe6b8cc677a49\src\Lucene.Net.Core\Index\SegmentReader.cs:line
110
   at Lucene.Net.Index.ReadersAndUpdates.GetReader(IOContext context) in z:\Builds\work\bcdbe6b8cc677a49\src\Lucene.Net.Core\Index\ReadersAndUpdates.cs:line
167
   at Lucene.Net.Index.ReadersAndUpdates.GetReadOnlyClone(IOContext context) in z:\Builds\work\bcdbe6b8cc677a49\src\Lucene.Net.Core\Index\ReadersAndUpdates.cs:line
298
   at Lucene.Net.Index.StandardDirectoryReader.Open(IndexWriter writer, SegmentInfos infos,
Boolean applyAllDeletes) in z:\Builds\work\bcdbe6b8cc677a49\src\Lucene.Net.Core\Index\StandardDirectoryReader.cs:line
126
   at Lucene.Net.Index.IndexWriter.GetReader(Boolean applyAllDeletes) in z:\Builds\work\bcdbe6b8cc677a49\src\Lucene.Net.Core\Index\IndexWriter.cs:line
413
   at Lucene.Net.Index.DirectoryReader.Open(IndexWriter writer, Boolean applyAllDeletes) in
z:\Builds\work\bcdbe6b8cc677a49\src\Lucene.Net.Core\Index\DirectoryReader.cs:line 115
   at Lucene.Net.Index.TestIndexWriter.IndexerThreadInterrupt.Run() in z:\Builds\work\bcdbe6b8cc677a49\src\Lucene.Net.Tests\core\Index\TestIndexWriter.cs:line
1253
TEST: got interrupt
   at Lucene.Net.Store.SlowOpeningMockIndexInputWrapper..ctor(MockDirectoryWrapper dir, String
name, IndexInput delegate) in z:\Builds\work\bcdbe6b8cc677a49\src\Lucene.Net.TestFramework\Store\SlowOpeningMockIndexInputWrapper.cs:line
45
   at Lucene.Net.Store.MockDirectoryWrapper.OpenInput(String name, IOContext context) in z:\Builds\work\bcdbe6b8cc677a49\src\Lucene.Net.TestFramework\Store\MockDirectoryWrapper.cs:line
805
   at Lucene.Net.Store.FilterDirectory.OpenChecksumInput(String name, IOContext context) in
z:\Builds\work\bcdbe6b8cc677a49\src\Lucene.Net.Core\Store\FilterDirectory.cs:line 132
   at Lucene.Net.Store.CompoundFileDirectory.ReadEntries(IndexInputSlicer handle, Directory
dir, String name) in z:\Builds\work\bcdbe6b8cc677a49\src\Lucene.Net.Core\Store\CompoundFileDirectory.cs:line
165
   at Lucene.Net.Store.CompoundFileDirectory..ctor(Directory directory, String fileName, IOContext
context, Boolean openForWrite) in z:\Builds\work\bcdbe6b8cc677a49\src\Lucene.Net.Core\Store\CompoundFileDirectory.cs:line
110
   at Lucene.Net.Index.SegmentReader.ReadFieldInfos(SegmentCommitInfo info) in z:\Builds\work\bcdbe6b8cc677a49\src\Lucene.Net.Core\Index\SegmentReader.cs:line
245
   at Lucene.Net.Index.SegmentReader..ctor(SegmentCommitInfo si, Int32 termInfosIndexDivisor,
IOContext context) in z:\Builds\work\bcdbe6b8cc677a49\src\Lucene.Net.Core\Index\SegmentReader.cs:line
110
   at Lucene.Net.Index.ReadersAndUpdates.GetReader(IOContext context) in z:\Builds\work\bcdbe6b8cc677a49\src\Lucene.Net.Core\Index\ReadersAndUpdates.cs:line
167
   at Lucene.Net.Index.ReadersAndUpdates.GetReadOnlyClone(IOContext context) in z:\Builds\work\bcdbe6b8cc677a49\src\Lucene.Net.Core\Index\ReadersAndUpdates.cs:line
298
   at Lucene.Net.Index.StandardDirectoryReader.Open(IndexWriter writer, SegmentInfos infos,
Boolean applyAllDeletes) in z:\Builds\work\bcdbe6b8cc677a49\src\Lucene.Net.Core\Index\StandardDirectoryReader.cs:line
126
   at Lucene.Net.Index.IndexWriter.GetReader(Boolean applyAllDeletes) in z:\Builds\work\bcdbe6b8cc677a49\src\Lucene.Net.Core\Index\IndexWriter.cs:line
413
   at Lucene.Net.Index.DirectoryReader.Open(IndexWriter writer, Boolean applyAllDeletes) in
z:\Builds\work\bcdbe6b8cc677a49\src\Lucene.Net.Core\Index\DirectoryReader.cs:line 115
   at Lucene.Net.Index.TestIndexWriter.IndexerThreadInterrupt.Run() in z:\Builds\work\bcdbe6b8cc677a49\src\Lucene.Net.Tests\core\Index\TestIndexWriter.cs:line
1253
TEST: got interrupt
   at Lucene.Net.Index.IndexWriter.DoWait() in z:\Builds\work\bcdbe6b8cc677a49\src\Lucene.Net.Core\Index\IndexWriter.cs:line
5366
   at Lucene.Net.Index.IndexWriter.ForceMerge(Int32 maxNumSegments, Boolean doWait) in z:\Builds\work\bcdbe6b8cc677a49\src\Lucene.Net.Core\Index\IndexWriter.cs:line
2192
   at Lucene.Net.Index.IndexWriter.ForceMerge(Int32 maxNumSegments) in z:\Builds\work\bcdbe6b8cc677a49\src\Lucene.Net.Core\Index\IndexWriter.cs:line
2100
   at Lucene.Net.Index.TestIndexWriter.IndexerThreadInterrupt.Run() in z:\Builds\work\bcdbe6b8cc677a49\src\Lucene.Net.Tests\core\Index\TestIndexWriter.cs:line
1274
TEST: got interrupt
   at Lucene.Net.Store.SlowOpeningMockIndexInputWrapper..ctor(MockDirectoryWrapper dir, String
name, IndexInput delegate) in z:\Builds\work\bcdbe6b8cc677a49\src\Lucene.Net.TestFramework\Store\SlowOpeningMockIndexInputWrapper.cs:line
45
   at Lucene.Net.Store.MockDirectoryWrapper.OpenInput(String name, IOContext context) in z:\Builds\work\bcdbe6b8cc677a49\src\Lucene.Net.TestFramework\Store\MockDirectoryWrapper.cs:line
805
   at Lucene.Net.Store.FilterDirectory.OpenChecksumInput(String name, IOContext context) in
z:\Builds\work\bcdbe6b8cc677a49\src\Lucene.Net.Core\Store\FilterDirectory.cs:line 132
   at Lucene.Net.Index.SegmentInfos.FindSegmentsFile.Run(IndexCommit commit) in z:\Builds\work\bcdbe6b8cc677a49\src\Lucene.Net.Core\Index\SegmentInfos.cs:line
913
   at Lucene.Net.Index.SegmentInfos.FindSegmentsFile.Run() in z:\Builds\work\bcdbe6b8cc677a49\src\Lucene.Net.Core\Index\SegmentInfos.cs:line
838
   at Lucene.Net.Index.SegmentInfos.Read(Directory directory) in z:\Builds\work\bcdbe6b8cc677a49\src\Lucene.Net.Core\Index\SegmentInfos.cs:line
469
   at Lucene.Net.Index.IndexWriter.AddIndexes(Directory[] dirs) in z:\Builds\work\bcdbe6b8cc677a49\src\Lucene.Net.Core\Index\IndexWriter.cs:line
3067
   at Lucene.Net.Index.TestIndexWriter.IndexerThreadInterrupt.Run() in z:\Builds\work\bcdbe6b8cc677a49\src\Lucene.Net.Tests\core\Index\TestIndexWriter.cs:line
1237
TEST: got interrupt
   at Lucene.Net.Store.SlowOpeningMockIndexInputWrapper..ctor(MockDirectoryWrapper dir, String
name, IndexInput delegate) in z:\Builds\work\bcdbe6b8cc677a49\src\Lucene.Net.TestFramework\Store\SlowOpeningMockIndexInputWrapper.cs:line
45
   at Lucene.Net.Store.MockDirectoryWrapper.OpenInput(String name, IOContext context) in z:\Builds\work\bcdbe6b8cc677a49\src\Lucene.Net.TestFramework\Store\MockDirectoryWrapper.cs:line
805
   at Lucene.Net.Codecs.BlockTreeTermsReader..ctor(Directory dir, FieldInfos fieldInfos, SegmentInfo
info, PostingsReaderBase postingsReader, IOContext ioContext, String segmentSuffix, Int32
indexDivisor) in z:\Builds\work\bcdbe6b8cc677a49\src\Lucene.Net.Core\Codecs\BlockTreeTermsReader.cs:line
128
   at Lucene.Net.Codecs.Lucene41.Lucene41PostingsFormat.FieldsProducer(SegmentReadState state)
in z:\Builds\work\bcdbe6b8cc677a49\src\Lucene.Net.Core\Codecs\Lucene41\Lucene41PostingsFormat.cs:line
432
   at Lucene.Net.Codecs.Perfield.PerFieldPostingsFormat.FieldsReader..ctor(PerFieldPostingsFormat
outerInstance, SegmentReadState readState) in z:\Builds\work\bcdbe6b8cc677a49\src\Lucene.Net.Core\Codecs\Perfield\PerFieldPostingsFormat.cs:line
216
   at Lucene.Net.Codecs.Perfield.PerFieldPostingsFormat.FieldsProducer(SegmentReadState state)
in z:\Builds\work\bcdbe6b8cc677a49\src\Lucene.Net.Core\Codecs\Perfield\PerFieldPostingsFormat.cs:line
277
   at Lucene.Net.Index.SegmentCoreReaders..ctor(SegmentReader owner, Directory dir, SegmentCommitInfo
si, IOContext context, Int32 termsIndexDivisor) in z:\Builds\work\bcdbe6b8cc677a49\src\Lucene.Net.Core\Index\SegmentCoreReaders.cs:line
151
   at Lucene.Net.Index.SegmentReader..ctor(SegmentCommitInfo si, Int32 termInfosIndexDivisor,
IOContext context) in z:\Builds\work\bcdbe6b8cc677a49\src\Lucene.Net.Core\Index\SegmentReader.cs:line
111
   at Lucene.Net.Index.ReadersAndUpdates.GetReader(IOContext context) in z:\Builds\work\bcdbe6b8cc677a49\src\Lucene.Net.Core\Index\ReadersAndUpdates.cs:line
167
   at Lucene.Net.Index.ReadersAndUpdates.GetReadOnlyClone(IOContext context) in z:\Builds\work\bcdbe6b8cc677a49\src\Lucene.Net.Core\Index\ReadersAndUpdates.cs:line
298
   at Lucene.Net.Index.StandardDirectoryReader.Open(IndexWriter writer, SegmentInfos infos,
Boolean applyAllDeletes) in z:\Builds\work\bcdbe6b8cc677a49\src\Lucene.Net.Core\Index\StandardDirectoryReader.cs:line
126
   at Lucene.Net.Index.IndexWriter.GetReader(Boolean applyAllDeletes) in z:\Builds\work\bcdbe6b8cc677a49\src\Lucene.Net.Core\Index\IndexWriter.cs:line
413
   at Lucene.Net.Index.DirectoryReader.Open(IndexWriter writer, Boolean applyAllDeletes) in
z:\Builds\work\bcdbe6b8cc677a49\src\Lucene.Net.Core\Index\DirectoryReader.cs:line 115
   at Lucene.Net.Index.TestIndexWriter.IndexerThreadInterrupt.Run() in z:\Builds\work\bcdbe6b8cc677a49\src\Lucene.Net.Tests\core\Index\TestIndexWriter.cs:line
1253
FAILED; unexpected exception
   at Lucene.Net.Util.IOUtils.ReThrowUnchecked(Exception th) in z:\Builds\work\bcdbe6b8cc677a49\src\Lucene.Net.Core\Util\IOUtils.cs:line
435
   at Lucene.Net.Util.IOUtils.ReThrow(Exception th) in z:\Builds\work\bcdbe6b8cc677a49\src\Lucene.Net.Core\Util\IOUtils.cs:line
418
   at Lucene.Net.Index.IndexWriter.HandleMergeException(Exception t, OneMerge merge) in z:\Builds\work\bcdbe6b8cc677a49\src\Lucene.Net.Core\Index\IndexWriter.cs:line
4526
   at Lucene.Net.Index.IndexWriter.Merge(OneMerge merge) in z:\Builds\work\bcdbe6b8cc677a49\src\Lucene.Net.Core\Index\IndexWriter.cs:line
4564
   at Lucene.Net.Index.SerialMergeScheduler.Merge(IndexWriter writer, MergeTrigger trigger,
Boolean newMergesFound) in z:\Builds\work\bcdbe6b8cc677a49\src\Lucene.Net.Core\Index\SerialMergeScheduler.cs:line
48
   at Lucene.Net.Index.IndexWriter.MaybeMerge(MergeTrigger trigger, Int32 maxNumSegments)
in z:\Builds\work\bcdbe6b8cc677a49\src\Lucene.Net.Core\Index\IndexWriter.cs:line 2384
   at Lucene.Net.Index.IndexWriter.ForceMerge(Int32 maxNumSegments, Boolean doWait) in z:\Builds\work\bcdbe6b8cc677a49\src\Lucene.Net.Core\Index\IndexWriter.cs:line
2156
   at Lucene.Net.Index.IndexWriter.ForceMerge(Int32 maxNumSegments) in z:\Builds\work\bcdbe6b8cc677a49\src\Lucene.Net.Core\Index\IndexWriter.cs:line
2100
   at Lucene.Net.Index.TestIndexWriter.IndexerThreadInterrupt.Run() in z:\Builds\work\bcdbe6b8cc677a49\src\Lucene.Net.Tests\core\Index\TestIndexWriter.cs:line
1274
Unhandled exception in remote appdomain: System.Exception: System.Exception: MockDirectoryWrapper:
cannot close: there are still open files: _bu.fdt ,_bu_Lucene41_0.pos ,_bw_Lucene41_0.doc
,_bu_Lucene45_0.dvd ,_c5.cfs ,_c4.cfs ,_bw.nvd ,_bu_Lucene41_0.tim ,_cb.cfs ,_bv_Lucene41_0.pos
,_ca.cfs ,_bu.nvd ,_bw_Lucene41_0.tim ,_c8.cfs ,_c0.cfs ,_c2.cfs ,_bw_Lucene41_0.pos ,_bw.fdt
,_bv_Lucene41_0.doc ,_bv_Lucene41_0.tim ,_bu_Lucene41_0.doc ,_c3.cfs ,_bv_Lucene45_0.dvd ,_cc.cfs
,_c7.cfs ,_c9.cfs ,_bv.fdt ,_c1.cfs ,_c6.cfs ,_bv.nvd ,_bw_Lucene45_0.dvd ,_by.cfs --->
System.Exception: unclosed IndexSlice: _b8.cfs
   --- End of inner exception stack trace ---
   at Lucene.Net.Store.MockDirectoryWrapper.Dispose() in z:\Builds\work\bcdbe6b8cc677a49\src\Lucene.Net.TestFramework\Store\MockDirectoryWrapper.cs:line
918
   at Lucene.Net.Util.IOUtils.Close(IDisposable[] objects) in z:\Builds\work\bcdbe6b8cc677a49\src\Lucene.Net.Core\Util\IOUtils.cs:line
163 ---> System.Exception: MockDirectoryWrapper: cannot close: there are still open files:
_bu.fdt ,_bu_Lucene41_0.pos ,_bw_Lucene41_0.doc ,_bu_Lucene45_0.dvd ,_c5.cfs ,_c4.cfs ,_bw.nvd
,_bu_Lucene41_0.tim ,_cb.cfs ,_bv_Lucene41_0.pos ,_ca.cfs ,_bu.nvd ,_bw_Lucene41_0.tim ,_c8.cfs
,_c0.cfs ,_c2.cfs ,_bw_Lucene41_0.pos ,_bw.fdt ,_bv_Lucene41_0.doc ,_bv_Lucene41_0.tim ,_bu_Lucene41_0.doc
,_c3.cfs ,_bv_Lucene45_0.dvd ,_cc.cfs ,_c7.cfs ,_c9.cfs ,_bv.fdt ,_c1.cfs ,_c6.cfs ,_bv.nvd
,_bw_Lucene45_0.dvd ,_by.cfs ---> System.Exception: unclosed IndexSlice: _b8.cfs
   --- End of inner exception stack trace ---
   at Lucene.Net.Store.MockDirectoryWrapper.Dispose() in z:\Builds\work\bcdbe6b8cc677a49\src\Lucene.Net.TestFramework\Store\MockDirectoryWrapper.cs:line
918
   at Lucene.Net.Util.IOUtils.Close(IDisposable[] objects) in z:\Builds\work\bcdbe6b8cc677a49\src\Lucene.Net.Core\Util\IOUtils.cs:line
163
   --- End of inner exception stack trace ---
   at Lucene.Net.Util.IOUtils.ReThrowUnchecked(Exception th) in z:\Builds\work\bcdbe6b8cc677a49\src\Lucene.Net.Core\Util\IOUtils.cs:line
435
   at Lucene.Net.Util.IOUtils.ReThrow(Exception th) in z:\Builds\work\bcdbe6b8cc677a49\src\Lucene.Net.Core\Util\IOUtils.cs:line
418
   at Lucene.Net.Util.IOUtils.Close(IDisposable[] objects) in z:\Builds\work\bcdbe6b8cc677a49\src\Lucene.Net.Core\Util\IOUtils.cs:line
176
   at Lucene.Net.Index.TestIndexWriter.IndexerThreadInterrupt.Run() in z:\Builds\work\bcdbe6b8cc677a49\src\Lucene.Net.Tests\core\Index\TestIndexWriter.cs:line
1362
   at System.Threading.ThreadHelper.ThreadStart_Context(Object state)
   at System.Threading.ExecutionContext.RunInternal(ExecutionContext executionContext, ContextCallback
callback, Object state, Boolean preserveSyncCtx)
   at System.Threading.ExecutionContext.Run(ExecutionContext executionContext, ContextCallback
callback, Object state, Boolean preserveSyncCtx)
   at System.Threading.ExecutionContext.Run(ExecutionContext executionContext, ContextCallback
callback, Object state)
   at System.Threading.ThreadHelper.ThreadStart()
Lucene.Net.Tests.dll: Lucene.Net.Index.TestIndexWriterWithThreads.TestIOExceptionDuringWriteSegmentWithThreadsOnlyOnce
(new) =================
Test(s) failed. Test exceeded Timeout value of 20000ms

see all newly failed tests: http://teamcity.codebetter.com/viewLog.html?buildId=188622&buildTypeId=LuceneNet_LuceneNetNightly



Other failed tests details (only first 3 failures shown here)
==================================================================
Lucene.Net.Tests.dll: Lucene.Net.Codecs.Lucene41.TestBlockPostingsFormat2 =================
TearDown method failed. CheckIndex failed
   at Lucene.Net.Util.TestUtil.CheckIndex(Directory dir, Boolean crossCheckTermVectors) in
z:\Builds\work\bcdbe6b8cc677a49\src\Lucene.Net.TestFramework\Util\TestUtil.cs:line 257
   at Lucene.Net.Codecs.Lucene41.TestBlockPostingsFormat2.TearDown() in z:\Builds\work\bcdbe6b8cc677a49\src\Lucene.Net.Tests\core\Codecs\Lucene41\TestBlockPostingsFormat2.cs:line
65
Lucene.Net.Tests.dll: Lucene.Net.Codecs.Lucene41.TestBlockPostingsFormat3.Test =================
Test(s) failed. Test exceeded Timeout value of 20000ms

Lucene.Net.Tests.dll: Lucene.Net.Index.TestAtomicUpdate.TestAtomicUpdates =================
Test(s) failed. Test exceeded Timeout value of 20000ms

------- Stdout: -------
WARNING: Leftover undeleted temporary files The process cannot access the file 'write.lock'
because it is being used by another process.
------- Stderr: -------
: exc
: exc
   at Lucene.Net.Index.SegmentInfos.FindSegmentsFile.Run(IndexCommit commit) in z:\Builds\work\bcdbe6b8cc677a49\src\Lucene.Net.Core\Index\SegmentInfos.cs:line
980
   at Lucene.Net.Index.StandardDirectoryReader.Open(Directory directory, IndexCommit commit,
Int32 termInfosIndexDivisor) in z:\Builds\work\bcdbe6b8cc677a49\src\Lucene.Net.Core\Index\StandardDirectoryReader.cs:line
53
   at Lucene.Net.Index.TestAtomicUpdate.SearcherThread.DoWork() in z:\Builds\work\bcdbe6b8cc677a49\src\Lucene.Net.Tests\core\Index\TestAtomicUpdate.cs:line
124
   at Lucene.Net.Index.TestAtomicUpdate.TimedThread.Run() in z:\Builds\work\bcdbe6b8cc677a49\src\Lucene.Net.Tests\core\Index\TestAtomicUpdate.cs:line
64
   at Lucene.Net.Index.SegmentInfos.FindSegmentsFile.Run(IndexCommit commit) in z:\Builds\work\bcdbe6b8cc677a49\src\Lucene.Net.Core\Index\SegmentInfos.cs:line
980
   at Lucene.Net.Index.StandardDirectoryReader.Open(Directory directory, IndexCommit commit,
Int32 termInfosIndexDivisor) in z:\Builds\work\bcdbe6b8cc677a49\src\Lucene.Net.Core\Index\StandardDirectoryReader.cs:line
53
   at Lucene.Net.Index.TestAtomicUpdate.SearcherThread.DoWork() in z:\Builds\work\bcdbe6b8cc677a49\src\Lucene.Net.Tests\core\Index\TestAtomicUpdate.cs:line
124
   at Lucene.Net.Index.TestAtomicUpdate.TimedThread.Run() in z:\Builds\work\bcdbe6b8cc677a49\src\Lucene.Net.Tests\core\Index\TestAtomicUpdate.cs:line
64
Changes included (3 changes)
====================================================
Change c0aa821d4edde76bcc8fc4a504ce9feaa04e2e30 by itamar (10 files):
More porting work


Change 8b9ae9cbb7d77e04924d4df260ce09372f47e3e6 by laimis (3 files):
fix reverse byte reader


Change b61e2b904f70c2328b7fb1d6d051261f3e90cad3 by laimis (4 files):
make sure to init new instance of bytresref when enumerating


see more information about changed files: http://teamcity.codebetter.com/viewLog.html?tab=buildChangesDiv&buildId=188622&buildTypeId=LuceneNet_LuceneNetNightly

============================================================================
Configure email notifications: http://teamcity.codebetter.com/profile.html?init=1&tab=userNotifications

Mime
  • Unnamed multipart/alternative (inline, None, 0 bytes)
View raw message