lucenenet-dev mailing list archives

Site index · List index
Message view « Date » · « Thread »
Top « Date » · « Thread »
From t.@codebetter.com
Subject [TeamCity, FAILED] Build Lucene.NET :: Lucene.NET Core [master] #374
Date Wed, 08 Apr 2015 17:23:46 GMT
Build Lucene.NET :: Lucene.NET Core [master] #374 failed (Tests failed: 28 (4 new), passed:
2426, ignored: 112).
Agent: JetBrains-dotnet-agent02
Build results: http://teamcity.codebetter.com/viewLog.html?buildId=187977&buildTypeId=LuceneNet_Core

Failed Tests Summary:
Newly failed tests (4 tests, alphabetically ordered)
==================================================================
Lucene.Net.Tests.dll: Lucene.Net.Index.TestDirectoryReader.TestNoDir
Lucene.Net.Tests.dll: Lucene.Net.Index.TestIndexWriterExceptions.TestExceptionDuringRollback
Lucene.Net.Tests.dll: Lucene.Net.Search.TestFilteredQuery.TestFilteredQuery_Mem
Lucene.Net.Tests.dll: Lucene.Net.Store.TestFileSwitchDirectory.TestNoDir

Other failed tests (24 tests, alphabetically ordered)
==================================================================
Lucene.Net.Tests.dll: Lucene.Net.Codecs.Lucene40.TestLucene40DocValuesFormat.BaseDocValuesFormatTestCase.TestBinaryVariableLengthVsStoredFields
Lucene.Net.Tests.dll: Lucene.Net.Codecs.Lucene40.TestLucene40DocValuesFormat.BaseDocValuesFormatTestCase.TestEmptyBinaryValueOnPageSizes
Lucene.Net.Tests.dll: Lucene.Net.Codecs.Lucene40.TestLucene40DocValuesFormat.BaseDocValuesFormatTestCase.TestThreads
Lucene.Net.Tests.dll: Lucene.Net.Codecs.Lucene40.TestLucene40DocValuesFormat.BaseIndexFileFormatTestCase.TestMergeStability
Lucene.Net.Tests.dll: Lucene.Net.Codecs.Lucene41.TestBlockPostingsFormat2
Lucene.Net.Tests.dll: Lucene.Net.Codecs.Lucene42.TestLucene42DocValuesFormat.BaseDocValuesFormatTestCase.TestVeryLargeButLegalSortedBytes
Lucene.Net.Tests.dll: Lucene.Net.Index.TestDocumentsWriterStallControl.TestSimpleStall
Lucene.Net.Tests.dll: Lucene.Net.Index.TestDuelingCodecs.TestEquals
Lucene.Net.Tests.dll: Lucene.Net.Index.TestIndexWriter.TestTwoThreadsInterruptDeadlock
Lucene.Net.Tests.dll: Lucene.Net.Index.TestIndexWriterExceptions.TestExceptionOnMergeInit
Lucene.Net.Tests.dll: Lucene.Net.Search.Spans.TestSpanMultiTermQueryWrapper.TestFuzzy2
Lucene.Net.Tests.dll: Lucene.Net.Search.TestFuzzyQuery.TestTieBreaker
Lucene.Net.Tests.dll: Lucene.Net.Search.TestNumericRangeQuery32.TestInfiniteValues
Lucene.Net.Tests.dll: Lucene.Net.Search.TestNumericRangeQuery64.TestInfiniteValues
Lucene.Net.Tests.dll: Lucene.Net.Search.TestShardSearching.TestSimple
Lucene.Net.Tests.dll: Lucene.Net.Search.TestSimpleExplanations.TestDMQ8
Lucene.Net.Tests.dll: Lucene.Net.Search.TestTermVectors
Lucene.Net.Tests.dll: Lucene.Net.Search.TestTermVectors.TestMixedVectrosVectors
Lucene.Net.Tests.dll: Lucene.Net.Search.TestTopDocsMerge.TestSort_1
Lucene.Net.Tests.dll: Lucene.Net.Search.TestTopDocsMerge.TestSort_2
Lucene.Net.Tests.dll: Lucene.Net.Store.TestBufferedIndexInput.TestSetBufferSize
Lucene.Net.Tests.dll: Lucene.Net.Store.TestDirectory.TestDontCreate
Lucene.Net.Tests.dll: Lucene.Net.Tests.TestAssertions.TestTokenStreams
Lucene.Net.Tests.dll: Lucene.Net.Util.TestIndexableBinaryStringTools.TestEncodedSortability



Newly failed tests details (only first 3 failures shown here)
==================================================================
Lucene.Net.Tests.dll: Lucene.Net.Index.TestDirectoryReader.TestNoDir (new) =================
Test(s) failed. Lucene.Net.Store.NoSuchDirectoryException : directory 'Z:\Builds\temp\buildTmp\LuceneTemp\doesnotexist-1'
does not exist
   at Lucene.Net.Store.FSDirectory.ListAll(DirectoryInfo dir) in z:\Builds\work\bcdbe6b8cc677a49\src\Lucene.Net.Core\Store\FSDirectory.cs:line
238
   at Lucene.Net.Store.FSDirectory.ListAll() in z:\Builds\work\bcdbe6b8cc677a49\src\Lucene.Net.Core\Store\FSDirectory.cs:line
284
   at Lucene.Net.Store.MockDirectoryWrapper.ListAll() in z:\Builds\work\bcdbe6b8cc677a49\src\Lucene.Net.TestFramework\Store\MockDirectoryWrapper.cs:line
1207
   at Lucene.Net.Index.SegmentInfos.FindSegmentsFile.Run(IndexCommit commit) in z:\Builds\work\bcdbe6b8cc677a49\src\Lucene.Net.Core\Index\SegmentInfos.cs:line
892
   at Lucene.Net.Index.StandardDirectoryReader.Open(Directory directory, IndexCommit commit,
Int32 termInfosIndexDivisor) in z:\Builds\work\bcdbe6b8cc677a49\src\Lucene.Net.Core\Index\StandardDirectoryReader.cs:line
53
   at Lucene.Net.Index.TestDirectoryReader.TestNoDir() in z:\Builds\work\bcdbe6b8cc677a49\src\Lucene.Net.Tests\core\Index\TestDirectoryReader.cs:line
739
Lucene.Net.Tests.dll: Lucene.Net.Index.TestIndexWriterExceptions.TestExceptionDuringRollback
(new) =================
Test(s) failed.   Expected string length 5 but was 0. Strings differ at index 0.
  Expected: "BOOM!"
  But was:  <string.Empty>
  -----------^

   at NUnit.Framework.Assert.That(Object actual, IResolveConstraint expression, String message,
Object[] args)
   at NUnit.Framework.Assert.AreEqual(Object expected, Object actual)
   at Lucene.Net.Index.TestIndexWriterExceptions.TestExceptionDuringRollback() in z:\Builds\work\bcdbe6b8cc677a49\src\Lucene.Net.Tests\core\Index\TestIndexWriterExceptions.cs:line
2474
Lucene.Net.Tests.dll: Lucene.Net.Search.TestFilteredQuery.TestFilteredQuery_Mem (new) =================
Test(s) failed. System.ArgumentOutOfRangeException : Index was out of range. Must be non-negative
and less than the size of the collection.
Parameter name: index
   at System.Collections.BitArray.Get(Int32 index)
   at Lucene.Net.Util.DocIdBitSet.Get(Int32 index) in z:\Builds\work\bcdbe6b8cc677a49\src\Lucene.Net.Core\Util\DocIdBitSet.cs:line
71
   at Lucene.Net.Search.FilteredQuery.QueryFirstBulkScorer.Score(Collector collector, Int32
maxDoc) in z:\Builds\work\bcdbe6b8cc677a49\src\Lucene.Net.Core\Search\FilteredQuery.cs:line
281
   at Lucene.Net.Search.BulkScorer.Score(Collector collector) in z:\Builds\work\bcdbe6b8cc677a49\src\Lucene.Net.Core\Search\BulkScorer.cs:line
36
   at Lucene.Net.Search.AssertingBulkScorer.Score(Collector collector) in z:\Builds\work\bcdbe6b8cc677a49\src\Lucene.Net.TestFramework\Search\AssertingBulkScorer.cs:line
81
   at Lucene.Net.Search.IndexSearcher.Search(IList`1 leaves, Weight weight, Collector collector)
in z:\Builds\work\bcdbe6b8cc677a49\src\Lucene.Net.Core\Search\IndexSearcher.cs:line 658
   at Lucene.Net.Search.AssertingIndexSearcher.Search(IList`1 leaves, Weight weight, Collector
collector) in z:\Builds\work\bcdbe6b8cc677a49\src\Lucene.Net.TestFramework\Search\AssertingIndexSearcher.cs:line
116
   at Lucene.Net.Search.IndexSearcher.Search(Query query, Collector results) in z:\Builds\work\bcdbe6b8cc677a49\src\Lucene.Net.Core\Search\IndexSearcher.cs:line
329
   at Lucene.Net.Search.QueryUtils.CheckFirstSkipTo(Query q, IndexSearcher s) in z:\Builds\work\bcdbe6b8cc677a49\src\Lucene.Net.TestFramework\Search\QueryUtils.cs:line
418
   at Lucene.Net.Search.QueryUtils.Check(Random random, Query q1, IndexSearcher s, Boolean
wrap) in z:\Builds\work\bcdbe6b8cc677a49\src\Lucene.Net.TestFramework\Search\QueryUtils.cs:line
137
   at Lucene.Net.Search.QueryUtils.Check(Random random, Query q1, IndexSearcher s, Boolean
wrap) in z:\Builds\work\bcdbe6b8cc677a49\src\Lucene.Net.TestFramework\Search\QueryUtils.cs:line
141
   at Lucene.Net.Search.TestFilteredQuery.TFilteredQuery(Boolean useRandomAccess) in z:\Builds\work\bcdbe6b8cc677a49\src\Lucene.Net.Tests\core\Search\TestFilteredQuery.cs:line
172
   at Lucene.Net.Search.TestFilteredQuery.TestFilteredQuery_Mem() in z:\Builds\work\bcdbe6b8cc677a49\src\Lucene.Net.Tests\core\Search\TestFilteredQuery.cs:line
150
see all newly failed tests: http://teamcity.codebetter.com/viewLog.html?buildId=187977&buildTypeId=LuceneNet_Core



Other failed tests details (only first 3 failures shown here)
==================================================================
Lucene.Net.Tests.dll: Lucene.Net.Codecs.Lucene40.TestLucene40DocValuesFormat.BaseDocValuesFormatTestCase.TestBinaryVariableLengthVsStoredFields
=================
Test(s) failed. System.IO.EndOfStreamException : read past EOF: SlicedIndexInput(SlicedIndexInput(_0_2_dv.dat
in RAMInputStream(name=_0_dv.cfs)) in RAMInputStream(name=_0_dv.cfs) slice=31:172)
   at Lucene.Net.Store.BufferedIndexInput.ReadBytes(Byte[] b, Int32 offset, Int32 len, Boolean
useBuffer) in z:\Builds\work\bcdbe6b8cc677a49\src\Lucene.Net.Core\Store\BufferedIndexInput.cs:line
192
   at Lucene.Net.Store.MockIndexInputWrapper.ReadBytes(Byte[] b, Int32 offset, Int32 len,
Boolean useBuffer) in z:\Builds\work\bcdbe6b8cc677a49\src\Lucene.Net.TestFramework\Store\MockIndexInputWrapper.cs:line
140
   at Lucene.Net.Util.PagedBytes.Copy(IndexInput in, Int64 byteCount) in z:\Builds\work\bcdbe6b8cc677a49\src\Lucene.Net.Core\Util\PagedBytes.cs:line
202
   at Lucene.Net.Codecs.Lucene40.Lucene40DocValuesReader.LoadBytesFixedDeref(FieldInfo field)
in z:\Builds\work\bcdbe6b8cc677a49\src\Lucene.Net.Core\Codecs\Lucene40\Lucene40DocValuesReader.cs:line
562
   at Lucene.Net.Codecs.Lucene40.Lucene40DocValuesReader.GetBinary(FieldInfo field) in z:\Builds\work\bcdbe6b8cc677a49\src\Lucene.Net.Core\Codecs\Lucene40\Lucene40DocValuesReader.cs:line
426
   at Lucene.Net.Index.SegmentReader.GetBinaryDocValues(String field) in z:\Builds\work\bcdbe6b8cc677a49\src\Lucene.Net.Core\Index\SegmentReader.cs:line
590
   at Lucene.Net.Index.BaseDocValuesFormatTestCase.DoTestBinaryVsStoredFields(Int32 minLength,
Int32 maxLength) in z:\Builds\work\bcdbe6b8cc677a49\src\Lucene.Net.TestFramework\Index\BaseDocValuesFormatTestCase.cs:line
1633
   at Lucene.Net.Index.BaseDocValuesFormatTestCase.TestBinaryVariableLengthVsStoredFields()
in z:\Builds\work\bcdbe6b8cc677a49\src\Lucene.Net.TestFramework\Index\BaseDocValuesFormatTestCase.cs:line
1663
Lucene.Net.Tests.dll: Lucene.Net.Codecs.Lucene40.TestLucene40DocValuesFormat.BaseDocValuesFormatTestCase.TestEmptyBinaryValueOnPageSizes
=================
Test(s) failed. System.IO.IOException : did not read all bytes from file: read 31 vs size
32 (resource: MockIndexInputWrapper(SlicedIndexInput(SlicedIndexInput(_0_0_dv.dat in RAMInputStream(name=_0_dv.cfs))
in RAMInputStream(name=_0_dv.cfs) slice=31:63)))
   at Lucene.Net.Codecs.CodecUtil.CheckEOF(IndexInput in) in z:\Builds\work\bcdbe6b8cc677a49\src\Lucene.Net.Core\Codecs\CodecUtil.cs:line
255
   at Lucene.Net.Codecs.Lucene40.Lucene40DocValuesReader.LoadBytesFixedDeref(FieldInfo field)
in z:\Builds\work\bcdbe6b8cc677a49\src\Lucene.Net.Core\Codecs\Lucene40\Lucene40DocValuesReader.cs:line
565
   at Lucene.Net.Codecs.Lucene40.Lucene40DocValuesReader.GetBinary(FieldInfo field) in z:\Builds\work\bcdbe6b8cc677a49\src\Lucene.Net.Core\Codecs\Lucene40\Lucene40DocValuesReader.cs:line
426
   at Lucene.Net.Index.SegmentReader.GetBinaryDocValues(String field) in z:\Builds\work\bcdbe6b8cc677a49\src\Lucene.Net.Core\Index\SegmentReader.cs:line
590
   at Lucene.Net.Index.MultiDocValues.GetBinaryValues(IndexReader r, String field) in z:\Builds\work\bcdbe6b8cc677a49\src\Lucene.Net.Core\Index\MultiDocValues.cs:line
270
   at Lucene.Net.Index.SlowCompositeReaderWrapper.GetBinaryDocValues(String field) in z:\Builds\work\bcdbe6b8cc677a49\src\Lucene.Net.Core\Index\SlowCompositeReaderWrapper.cs:line
108
   at Lucene.Net.Index.BaseDocValuesFormatTestCase.TestEmptyBinaryValueOnPageSizes() in z:\Builds\work\bcdbe6b8cc677a49\src\Lucene.Net.TestFramework\Index\BaseDocValuesFormatTestCase.cs:line
3497
Lucene.Net.Tests.dll: Lucene.Net.Codecs.Lucene40.TestLucene40DocValuesFormat.BaseDocValuesFormatTestCase.TestThreads
=================
Test(s) failed. System.Exception : CheckIndex failed
   at Lucene.Net.Util.TestUtil.CheckIndex(Directory dir, Boolean crossCheckTermVectors) in
z:\Builds\work\bcdbe6b8cc677a49\src\Lucene.Net.TestFramework\Util\TestUtil.cs:line 257
   at Lucene.Net.Store.MockDirectoryWrapper.Dispose() in z:\Builds\work\bcdbe6b8cc677a49\src\Lucene.Net.TestFramework\Store\MockDirectoryWrapper.cs:line
943
   at Lucene.Net.Index.BaseDocValuesFormatTestCase.TestThreads() in z:\Builds\work\bcdbe6b8cc677a49\src\Lucene.Net.TestFramework\Index\BaseDocValuesFormatTestCase.cs:line
3225
------- Stderr: -------
Unhandled exception in remote appdomain: System.Exception: read past EOF: SlicedIndexInput(SlicedIndexInput(_0_2_dv.dat
in RAMInputStream(name=_0.cfs)) in RAMInputStream(name=_0.cfs) slice=601:708) ---> System.IO.EndOfStreamException:
read past EOF: SlicedIndexInput(SlicedIndexInput(_0_2_dv.dat in RAMInputStream(name=_0.cfs))
in RAMInputStream(name=_0.cfs) slice=601:708)
   at Lucene.Net.Store.BufferedIndexInput.ReadBytes(Byte[] b, Int32 offset, Int32 len, Boolean
useBuffer) in z:\Builds\work\bcdbe6b8cc677a49\src\Lucene.Net.Core\Store\BufferedIndexInput.cs:line
192
   at Lucene.Net.Store.MockIndexInputWrapper.ReadBytes(Byte[] b, Int32 offset, Int32 len,
Boolean useBuffer) in z:\Builds\work\bcdbe6b8cc677a49\src\Lucene.Net.TestFramework\Store\MockIndexInputWrapper.cs:line
140
   at Lucene.Net.Util.PagedBytes.Copy(IndexInput in, Int64 byteCount) in z:\Builds\work\bcdbe6b8cc677a49\src\Lucene.Net.Core\Util\PagedBytes.cs:line
202
   at Lucene.Net.Codecs.Lucene40.Lucene40DocValuesReader.LoadBytesFixedDeref(FieldInfo field)
in z:\Builds\work\bcdbe6b8cc677a49\src\Lucene.Net.Core\Codecs\Lucene40\Lucene40DocValuesReader.cs:line
562
   at Lucene.Net.Codecs.Lucene40.Lucene40DocValuesReader.GetBinary(FieldInfo field) in z:\Builds\work\bcdbe6b8cc677a49\src\Lucene.Net.Core\Codecs\Lucene40\Lucene40DocValuesReader.cs:line
426
   at Lucene.Net.Index.SegmentReader.GetBinaryDocValues(String field) in z:\Builds\work\bcdbe6b8cc677a49\src\Lucene.Net.Core\Index\SegmentReader.cs:line
590
   at Lucene.Net.Index.BaseDocValuesFormatTestCase.ThreadAnonymousInnerClassHelper.Run() in
z:\Builds\work\bcdbe6b8cc677a49\src\Lucene.Net.TestFramework\Index\BaseDocValuesFormatTestCase.cs:line
3250
   --- End of inner exception stack trace ---
   at Lucene.Net.Index.BaseDocValuesFormatTestCase.ThreadAnonymousInnerClassHelper.Run() in
z:\Builds\work\bcdbe6b8cc677a49\src\Lucene.Net.TestFramework\Index\BaseDocValuesFormatTestCase.cs:line
3269
   at System.Threading.ThreadHelper.ThreadStart_Context(Object state)
   at System.Threading.ExecutionContext.RunInternal(ExecutionContext executionContext, ContextCallback
callback, Object state, Boolean preserveSyncCtx)
   at System.Threading.ExecutionContext.Run(ExecutionContext executionContext, ContextCallback
callback, Object state, Boolean preserveSyncCtx)
   at System.Threading.ExecutionContext.Run(ExecutionContext executionContext, ContextCallback
callback, Object state)
   at System.Threading.ThreadHelper.ThreadStart()
Unhandled exception in remote appdomain: System.Exception: read past EOF: SlicedIndexInput(SlicedIndexInput(_0_2_dv.dat
in RAMInputStream(name=_0.cfs)) in RAMInputStream(name=_0.cfs) slice=601:708) ---> System.IO.EndOfStreamException:
read past EOF: SlicedIndexInput(SlicedIndexInput(_0_2_dv.dat in RAMInputStream(name=_0.cfs))
in RAMInputStream(name=_0.cfs) slice=601:708)
   at Lucene.Net.Store.BufferedIndexInput.ReadBytes(Byte[] b, Int32 offset, Int32 len, Boolean
useBuffer) in z:\Builds\work\bcdbe6b8cc677a49\src\Lucene.Net.Core\Store\BufferedIndexInput.cs:line
192
   at Lucene.Net.Store.MockIndexInputWrapper.ReadBytes(Byte[] b, Int32 offset, Int32 len,
Boolean useBuffer) in z:\Builds\work\bcdbe6b8cc677a49\src\Lucene.Net.TestFramework\Store\MockIndexInputWrapper.cs:line
140
   at Lucene.Net.Util.PagedBytes.Copy(IndexInput in, Int64 byteCount) in z:\Builds\work\bcdbe6b8cc677a49\src\Lucene.Net.Core\Util\PagedBytes.cs:line
202
   at Lucene.Net.Codecs.Lucene40.Lucene40DocValuesReader.LoadBytesFixedDeref(FieldInfo field)
in z:\Builds\work\bcdbe6b8cc677a49\src\Lucene.Net.Core\Codecs\Lucene40\Lucene40DocValuesReader.cs:line
562
   at Lucene.Net.Codecs.Lucene40.Lucene40DocValuesReader.GetBinary(FieldInfo field) in z:\Builds\work\bcdbe6b8cc677a49\src\Lucene.Net.Core\Codecs\Lucene40\Lucene40DocValuesReader.cs:line
426
   at Lucene.Net.Index.SegmentReader.GetBinaryDocValues(String field) in z:\Builds\work\bcdbe6b8cc677a49\src\Lucene.Net.Core\Index\SegmentReader.cs:line
590
   at Lucene.Net.Index.BaseDocValuesFormatTestCase.ThreadAnonymousInnerClassHelper.Run() in
z:\Builds\work\bcdbe6b8cc677a49\src\Lucene.Net.TestFramework\Index\BaseDocValuesFormatTestCase.cs:line
3250
   --- End of inner exception stack trace ---
   at Lucene.Net.Index.BaseDocValuesFormatTestCase.ThreadAnonymousInnerClassHelper.Run() in
z:\Builds\work\bcdbe6b8cc677a49\src\Lucene.Net.TestFramework\Index\BaseDocValuesFormatTestCase.cs:line
3269
   at System.Threading.ThreadHelper.ThreadStart_Context(Object state)
   at System.Threading.ExecutionContext.RunInternal(ExecutionContext executionContext, ContextCallback
callback, Object state, Boolean preserveSyncCtx)
   at System.Threading.ExecutionContext.Run(ExecutionContext executionContext, ContextCallback
callback, Object state, Boolean preserveSyncCtx)
   at System.Threading.ExecutionContext.Run(ExecutionContext executionContext, ContextCallback
callback, Object state)
   at System.Threading.ThreadHelper.ThreadStart()
CheckIndex failed
´╗┐Segments file=segments_11 numSegments=11 version=4.8 format=
  1 of 11: name=_0 docCount=18
    codec=Lucene40
    compound=True
    numFiles=4
    size (MB)=0.00236988067626953
    diagnostics = System.Collections.Generic.Dictionary`2[System.String,System.String]
    has deletions [delGen=1]
    test: open reader.........OK
    test: check integrity.....OK
    test: check live docs.....OK [2 deleted docs]
    test: fields..............OK [6 fields]
    test: field norms.........OK [0 fields]
    test: terms, freq, prox...OK [16 terms; 16 terms/docs pairs; 0 tokens]
    test (ignoring deletes): terms, freq, prox...OK [18 terms; 18 terms/docs pairs; 0 tokens]
    test: stored fields.......OK [32 total field count; avg 2 fields per doc]
    test: term vectors........OK [0 total vector count; avg 0 term/freq vector fields per
doc]
    test: docvalues...........ERROR [read past EOF: SlicedIndexInput(SlicedIndexInput(_0_2_dv.dat
in RAMInputStream(name=_0.cfs)) in RAMInputStream(name=_0.cfs) slice=601:708)]
   at Lucene.Net.Store.BufferedIndexInput.ReadBytes(Byte[] b, Int32 offset, Int32 len, Boolean
useBuffer) in z:\Builds\work\bcdbe6b8cc677a49\src\Lucene.Net.Core\Store\BufferedIndexInput.cs:line
192
   at Lucene.Net.Store.MockIndexInputWrapper.ReadBytes(Byte[] b, Int32 offset, Int32 len,
Boolean useBuffer) in z:\Builds\work\bcdbe6b8cc677a49\src\Lucene.Net.TestFramework\Store\MockIndexInputWrapper.cs:line
140
   at Lucene.Net.Util.PagedBytes.Copy(IndexInput in, Int64 byteCount) in z:\Builds\work\bcdbe6b8cc677a49\src\Lucene.Net.Core\Util\PagedBytes.cs:line
202
   at Lucene.Net.Codecs.Lucene40.Lucene40DocValuesReader.LoadBytesFixedDeref(FieldInfo field)
in z:\Builds\work\bcdbe6b8cc677a49\src\Lucene.Net.Core\Codecs\Lucene40\Lucene40DocValuesReader.cs:line
562
   at Lucene.Net.Codecs.Lucene40.Lucene40DocValuesReader.GetBinary(FieldInfo field) in z:\Builds\work\bcdbe6b8cc677a49\src\Lucene.Net.Core\Codecs\Lucene40\Lucene40DocValuesReader.cs:line
426
   at Lucene.Net.Index.SegmentReader.GetBinaryDocValues(String field) in z:\Builds\work\bcdbe6b8cc677a49\src\Lucene.Net.Core\Index\SegmentReader.cs:line
590
   at Lucene.Net.Index.CheckIndex.CheckDocValues(FieldInfo fi, AtomicReader reader, DocValuesStatus
status) in z:\Builds\work\bcdbe6b8cc677a49\src\Lucene.Net.Core\Index\CheckIndex.cs:line 1937
   at Lucene.Net.Index.CheckIndex.TestDocValues(AtomicReader reader, StreamWriter infoStream)
in z:\Builds\work\bcdbe6b8cc677a49\src\Lucene.Net.Core\Index\CheckIndex.cs:line 1706
FAILED
    WARNING: fixIndex() would remove reference to this segment; full exception:
   at Lucene.Net.Index.CheckIndex.DoCheckIndex(IList`1 onlySegments) in z:\Builds\work\bcdbe6b8cc677a49\src\Lucene.Net.Core\Index\CheckIndex.cs:line
828
  2 of 11: name=_1 docCount=34
    codec=Lucene40
    compound=True
    numFiles=4
    size (MB)=0.00299835205078125
    diagnostics = System.Collections.Generic.Dictionary`2[System.String,System.String]
    has deletions [delGen=1]
    test: open reader.........OK
    test: check integrity.....OK
    test: check live docs.....OK [2 deleted docs]
    test: fields..............OK [6 fields]
    test: field norms.........OK [0 fields]
    test: terms, freq, prox...OK [32 terms; 32 terms/docs pairs; 0 tokens]
    test (ignoring deletes): terms, freq, prox...OK [34 terms; 34 terms/docs pairs; 0 tokens]
    test: stored fields.......OK [64 total field count; avg 2 fields per doc]
    test: term vectors........OK [0 total vector count; avg 0 term/freq vector fields per
doc]
    test: docvalues...........ERROR [read past EOF: SlicedIndexInput(SlicedIndexInput(_1_2_dv.dat
in RAMInputStream(name=_1.cfs)) in RAMInputStream(name=_1.cfs) slice=988:1130)]
   at Lucene.Net.Store.BufferedIndexInput.ReadBytes(Byte[] b, Int32 offset, Int32 len, Boolean
useBuffer) in z:\Builds\work\bcdbe6b8cc677a49\src\Lucene.Net.Core\Store\BufferedIndexInput.cs:line
192
   at Lucene.Net.Store.MockIndexInputWrapper.ReadBytes(Byte[] b, Int32 offset, Int32 len,
Boolean useBuffer) in z:\Builds\work\bcdbe6b8cc677a49\src\Lucene.Net.TestFramework\Store\MockIndexInputWrapper.cs:line
140
   at Lucene.Net.Util.PagedBytes.Copy(IndexInput in, Int64 byteCount) in z:\Builds\work\bcdbe6b8cc677a49\src\Lucene.Net.Core\Util\PagedBytes.cs:line
202
   at Lucene.Net.Codecs.Lucene40.Lucene40DocValuesReader.LoadBytesFixedDeref(FieldInfo field)
in z:\Builds\work\bcdbe6b8cc677a49\src\Lucene.Net.Core\Codecs\Lucene40\Lucene40DocValuesReader.cs:line
562
   at Lucene.Net.Codecs.Lucene40.Lucene40DocValuesReader.GetBinary(FieldInfo field) in z:\Builds\work\bcdbe6b8cc677a49\src\Lucene.Net.Core\Codecs\Lucene40\Lucene40DocValuesReader.cs:line
426
   at Lucene.Net.Index.SegmentReader.GetBinaryDocValues(String field) in z:\Builds\work\bcdbe6b8cc677a49\src\Lucene.Net.Core\Index\SegmentReader.cs:line
590
   at Lucene.Net.Index.CheckIndex.CheckDocValues(FieldInfo fi, AtomicReader reader, DocValuesStatus
status) in z:\Builds\work\bcdbe6b8cc677a49\src\Lucene.Net.Core\Index\CheckIndex.cs:line 1937
   at Lucene.Net.Index.CheckIndex.TestDocValues(AtomicReader reader, StreamWriter infoStream)
in z:\Builds\work\bcdbe6b8cc677a49\src\Lucene.Net.Core\Index\CheckIndex.cs:line 1706
FAILED
    WARNING: fixIndex() would remove reference to this segment; full exception:
   at Lucene.Net.Index.CheckIndex.DoCheckIndex(IList`1 onlySegments) in z:\Builds\work\bcdbe6b8cc677a49\src\Lucene.Net.Core\Index\CheckIndex.cs:line
828
  3 of 11: name=_2 docCount=153
    codec=Lucene40
    compound=True
    numFiles=3
    size (MB)=0.00853061676025391
    diagnostics = System.Collections.Generic.Dictionary`2[System.String,System.String]
    no deletions
    test: open reader.........OK
    test: check integrity.....OK
    test: check live docs.....OK
    test: fields..............OK [6 fields]
    test: field norms.........OK [0 fields]
    test: terms, freq, prox...OK [153 terms; 153 terms/docs pairs; 0 tokens]
    test: stored fields.......OK [306 total field count; avg 2 fields per doc]
    test: term vectors........OK [0 total vector count; avg 0 term/freq vector fields per
doc]
    test: docvalues...........ERROR [did not read all bytes from file: read 168 vs size 663
(resource: MockIndexInputWrapper(SlicedIndexInput(SlicedIndexInput(_2_2_dv.dat in RAMInputStream(name=_2.cfs))
in RAMInputStream(name=_2.cfs) slice=4127:4790)))]
   at Lucene.Net.Codecs.CodecUtil.CheckEOF(IndexInput in) in z:\Builds\work\bcdbe6b8cc677a49\src\Lucene.Net.Core\Codecs\CodecUtil.cs:line
255
   at Lucene.Net.Codecs.Lucene40.Lucene40DocValuesReader.LoadBytesFixedDeref(FieldInfo field)
in z:\Builds\work\bcdbe6b8cc677a49\src\Lucene.Net.Core\Codecs\Lucene40\Lucene40DocValuesReader.cs:line
565
   at Lucene.Net.Codecs.Lucene40.Lucene40DocValuesReader.GetBinary(FieldInfo field) in z:\Builds\work\bcdbe6b8cc677a49\src\Lucene.Net.Core\Codecs\Lucene40\Lucene40DocValuesReader.cs:line
426
   at Lucene.Net.Index.SegmentReader.GetBinaryDocValues(String field) in z:\Builds\work\bcdbe6b8cc677a49\src\Lucene.Net.Core\Index\SegmentReader.cs:line
590
   at Lucene.Net.Index.CheckIndex.CheckDocValues(FieldInfo fi, AtomicReader reader, DocValuesStatus
status) in z:\Builds\work\bcdbe6b8cc677a49\src\Lucene.Net.Core\Index\CheckIndex.cs:line 1937
   at Lucene.Net.Index.CheckIndex.TestDocValues(AtomicReader reader, StreamWriter infoStream)
in z:\Builds\work\bcdbe6b8cc677a49\src\Lucene.Net.Core\Index\CheckIndex.cs:line 1706
FAILED
    WARNING: fixIndex() would remove reference to this segment; full exception:
   at Lucene.Net.Index.CheckIndex.DoCheckIndex(IList`1 onlySegments) in z:\Builds\work\bcdbe6b8cc677a49\src\Lucene.Net.Core\Index\CheckIndex.cs:line
828
  4 of 11: name=_3 docCount=3
    codec=Lucene40
    compound=True
    numFiles=3
    size (MB)=0.00167179107666016
    diagnostics = System.Collections.Generic.Dictionary`2[System.String,System.String]
    no deletions
    test: open reader.........OK
    test: check integrity.....OK
    test: check live docs.....OK
    test: fields..............OK [6 fields]
    test: field norms.........OK [0 fields]
    test: terms, freq, prox...OK [3 terms; 3 terms/docs pairs; 0 tokens]
    test: stored fields.......OK [6 total field count; avg 2 fields per doc]
    test: term vectors........OK [0 total vector count; avg 0 term/freq vector fields per
doc]
    test: docvalues...........ERROR [did not read all bytes from file: read 40 vs size 43
(resource: MockIndexInputWrapper(SlicedIndexInput(SlicedIndexInput(_3_2_dv.dat in RAMInputStream(name=_3.cfs))
in RAMInputStream(name=_3.cfs) slice=207:250)))]
   at Lucene.Net.Codecs.CodecUtil.CheckEOF(IndexInput in) in z:\Builds\work\bcdbe6b8cc677a49\src\Lucene.Net.Core\Codecs\CodecUtil.cs:line
255
   at Lucene.Net.Codecs.Lucene40.Lucene40DocValuesReader.LoadBytesFixedDeref(FieldInfo field)
in z:\Builds\work\bcdbe6b8cc677a49\src\Lucene.Net.Core\Codecs\Lucene40\Lucene40DocValuesReader.cs:line
565
   at Lucene.Net.Codecs.Lucene40.Lucene40DocValuesReader.GetBinary(FieldInfo field) in z:\Builds\work\bcdbe6b8cc677a49\src\Lucene.Net.Core\Codecs\Lucene40\Lucene40DocValuesReader.cs:line
426
   at Lucene.Net.Index.SegmentReader.GetBinaryDocValues(String field) in z:\Builds\work\bcdbe6b8cc677a49\src\Lucene.Net.Core\Index\SegmentReader.cs:line
590
   at Lucene.Net.Index.CheckIndex.CheckDocValues(FieldInfo fi, AtomicReader reader, DocValuesStatus
status) in z:\Builds\work\bcdbe6b8cc677a49\src\Lucene.Net.Core\Index\CheckIndex.cs:line 1937
   at Lucene.Net.Index.CheckIndex.TestDocValues(AtomicReader reader, StreamWriter infoStream)
in z:\Builds\work\bcdbe6b8cc677a49\src\Lucene.Net.Core\Index\CheckIndex.cs:line 1706
FAILED
    WARNING: fixIndex() would remove reference to this segment; full exception:
   at Lucene.Net.Index.CheckIndex.DoCheckIndex(IList`1 onlySegments) in z:\Builds\work\bcdbe6b8cc677a49\src\Lucene.Net.Core\Index\CheckIndex.cs:line
828
  5 of 11: name=_4 docCount=3
    codec=Lucene40
    compound=True
    numFiles=3
    size (MB)=0.00164031982421875
    diagnostics = System.Collections.Generic.Dictionary`2[System.String,System.String]
    no deletions
    test: open reader.........OK
    test: check integrity.....OK
    test: check live docs.....OK
    test: fields..............OK [6 fields]
    test: field norms.........OK [0 fields]
    test: terms, freq, prox...OK [3 terms; 3 terms/docs pairs; 0 tokens]
    test: stored fields.......OK [6 total field count; avg 2 fields per doc]
    test: term vectors........OK [0 total vector count; avg 0 term/freq vector fields per
doc]
    test: docvalues...........ERROR [read past EOF: SlicedIndexInput(SlicedIndexInput(_4_2_dv.dat
in RAMInputStream(name=_4.cfs)) in RAMInputStream(name=_4.cfs) slice=196:228)]
   at Lucene.Net.Store.BufferedIndexInput.ReadBytes(Byte[] b, Int32 offset, Int32 len, Boolean
useBuffer) in z:\Builds\work\bcdbe6b8cc677a49\src\Lucene.Net.Core\Store\BufferedIndexInput.cs:line
192
   at Lucene.Net.Store.MockIndexInputWrapper.ReadBytes(Byte[] b, Int32 offset, Int32 len,
Boolean useBuffer) in z:\Builds\work\bcdbe6b8cc677a49\src\Lucene.Net.TestFramework\Store\MockIndexInputWrapper.cs:line
140
   at Lucene.Net.Util.PagedBytes.Copy(IndexInput in, Int64 byteCount) in z:\Builds\work\bcdbe6b8cc677a49\src\Lucene.Net.Core\Util\PagedBytes.cs:line
202
   at Lucene.Net.Codecs.Lucene40.Lucene40DocValuesReader.LoadBytesFixedDeref(FieldInfo field)
in z:\Builds\work\bcdbe6b8cc677a49\src\Lucene.Net.Core\Codecs\Lucene40\Lucene40DocValuesReader.cs:line
562
   at Lucene.Net.Codecs.Lucene40.Lucene40DocValuesReader.GetBinary(FieldInfo field) in z:\Builds\work\bcdbe6b8cc677a49\src\Lucene.Net.Core\Codecs\Lucene40\Lucene40DocValuesReader.cs:line
426
   at Lucene.Net.Index.SegmentReader.GetBinaryDocValues(String field) in z:\Builds\work\bcdbe6b8cc677a49\src\Lucene.Net.Core\Index\SegmentReader.cs:line
590
   at Lucene.Net.Index.CheckIndex.CheckDocValues(FieldInfo fi, AtomicReader reader, DocValuesStatus
status) in z:\Builds\work\bcdbe6b8cc677a49\src\Lucene.Net.Core\Index\CheckIndex.cs:line 1937
   at Lucene.Net.Index.CheckIndex.TestDocValues(AtomicReader reader, StreamWriter infoStream)
in z:\Builds\work\bcdbe6b8cc677a49\src\Lucene.Net.Core\Index\CheckIndex.cs:line 1706
FAILED
    WARNING: fixIndex() would remove reference to this segment; full exception:
   at Lucene.Net.Index.CheckIndex.DoCheckIndex(IList`1 onlySegments) in z:\Builds\work\bcdbe6b8cc677a49\src\Lucene.Net.Core\Index\CheckIndex.cs:line
828
  6 of 11: name=_5 docCount=48
    codec=Lucene40
    compound=True
    numFiles=3
    size (MB)=0.00368785858154297
    diagnostics = System.Collections.Generic.Dictionary`2[System.String,System.String]
    no deletions
    test: open reader.........OK
    test: check integrity.....OK
    test: check live docs.....OK
    test: fields..............OK [6 fields]
    test: field norms.........OK [0 fields]
    test: terms, freq, prox...OK [48 terms; 48 terms/docs pairs; 0 tokens]
    test: stored fields.......OK [96 total field count; avg 2 fields per doc]
    test: term vectors........OK [0 total vector count; avg 0 term/freq vector fields per
doc]
    test: docvalues...........ERROR [read past EOF: SlicedIndexInput(SlicedIndexInput(_5_2_dv.dat
in RAMInputStream(name=_5.cfs)) in RAMInputStream(name=_5.cfs) slice=1384:1614)]
   at Lucene.Net.Store.BufferedIndexInput.ReadBytes(Byte[] b, Int32 offset, Int32 len, Boolean
useBuffer) in z:\Builds\work\bcdbe6b8cc677a49\src\Lucene.Net.Core\Store\BufferedIndexInput.cs:line
192
   at Lucene.Net.Store.MockIndexInputWrapper.ReadBytes(Byte[] b, Int32 offset, Int32 len,
Boolean useBuffer) in z:\Builds\work\bcdbe6b8cc677a49\src\Lucene.Net.TestFramework\Store\MockIndexInputWrapper.cs:line
140
   at Lucene.Net.Util.PagedBytes.Copy(IndexInput in, Int64 byteCount) in z:\Builds\work\bcdbe6b8cc677a49\src\Lucene.Net.Core\Util\PagedBytes.cs:line
202
   at Lucene.Net.Codecs.Lucene40.Lucene40DocValuesReader.LoadBytesFixedDeref(FieldInfo field)
in z:\Builds\work\bcdbe6b8cc677a49\src\Lucene.Net.Core\Codecs\Lucene40\Lucene40DocValuesReader.cs:line
562
   at Lucene.Net.Codecs.Lucene40.Lucene40DocValuesReader.GetBinary(FieldInfo field) in z:\Builds\work\bcdbe6b8cc677a49\src\Lucene.Net.Core\Codecs\Lucene40\Lucene40DocValuesReader.cs:line
426
   at Lucene.Net.Index.SegmentReader.GetBinaryDocValues(String field) in z:\Builds\work\bcdbe6b8cc677a49\src\Lucene.Net.Core\Index\SegmentReader.cs:line
590
   at Lucene.Net.Index.CheckIndex.CheckDocValues(FieldInfo fi, AtomicReader reader, DocValuesStatus
status) in z:\Builds\work\bcdbe6b8cc677a49\src\Lucene.Net.Core\Index\CheckIndex.cs:line 1937
   at Lucene.Net.Index.CheckIndex.TestDocValues(AtomicReader reader, StreamWriter infoStream)
in z:\Builds\work\bcdbe6b8cc677a49\src\Lucene.Net.Core\Index\CheckIndex.cs:line 1706
FAILED
    WARNING: fixIndex() would remove reference to this segment; full exception:
   at Lucene.Net.Index.CheckIndex.DoCheckIndex(IList`1 onlySegments) in z:\Builds\work\bcdbe6b8cc677a49\src\Lucene.Net.Core\Index\CheckIndex.cs:line
828
  7 of 11: name=_6 docCount=55
    codec=Lucene40
    compound=True
    numFiles=4
    size (MB)=0.00400161743164063
    diagnostics = System.Collections.Generic.Dictionary`2[System.String,System.String]
    has deletions [delGen=1]
    test: open reader.........OK
    test: check integrity.....OK
    test: check live docs.....OK [2 deleted docs]
    test: fields..............OK [6 fields]
    test: field norms.........OK [0 fields]
    test: terms, freq, prox...OK [53 terms; 53 terms/docs pairs; 0 tokens]
    test (ignoring deletes): terms, freq, prox...OK [55 terms; 55 terms/docs pairs; 0 tokens]
    test: stored fields.......OK [106 total field count; avg 2 fields per doc]
    test: term vectors........OK [0 total vector count; avg 0 term/freq vector fields per
doc]
    test: docvalues...........ERROR [read past EOF: SlicedIndexInput(SlicedIndexInput(_6_2_dv.dat
in RAMInputStream(name=_6.cfs)) in RAMInputStream(name=_6.cfs) slice=1544:1780)]
   at Lucene.Net.Store.BufferedIndexInput.ReadBytes(Byte[] b, Int32 offset, Int32 len, Boolean
useBuffer) in z:\Builds\work\bcdbe6b8cc677a49\src\Lucene.Net.Core\Store\BufferedIndexInput.cs:line
192
   at Lucene.Net.Store.MockIndexInputWrapper.ReadBytes(Byte[] b, Int32 offset, Int32 len,
Boolean useBuffer) in z:\Builds\work\bcdbe6b8cc677a49\src\Lucene.Net.TestFramework\Store\MockIndexInputWrapper.cs:line
140
   at Lucene.Net.Util.PagedBytes.Copy(IndexInput in, Int64 byteCount) in z:\Builds\work\bcdbe6b8cc677a49\src\Lucene.Net.Core\Util\PagedBytes.cs:line
202
   at Lucene.Net.Codecs.Lucene40.Lucene40DocValuesReader.LoadBytesFixedDeref(FieldInfo field)
in z:\Builds\work\bcdbe6b8cc677a49\src\Lucene.Net.Core\Codecs\Lucene40\Lucene40DocValuesReader.cs:line
562
   at Lucene.Net.Codecs.Lucene40.Lucene40DocValuesReader.GetBinary(FieldInfo field) in z:\Builds\work\bcdbe6b8cc677a49\src\Lucene.Net.Core\Codecs\Lucene40\Lucene40DocValuesReader.cs:line
426
   at Lucene.Net.Index.SegmentReader.GetBinaryDocValues(String field) in z:\Builds\work\bcdbe6b8cc677a49\src\Lucene.Net.Core\Index\SegmentReader.cs:line
590
   at Lucene.Net.Index.CheckIndex.CheckDocValues(FieldInfo fi, AtomicReader reader, DocValuesStatus
status) in z:\Builds\work\bcdbe6b8cc677a49\src\Lucene.Net.Core\Index\CheckIndex.cs:line 1937
   at Lucene.Net.Index.CheckIndex.TestDocValues(AtomicReader reader, StreamWriter infoStream)
in z:\Builds\work\bcdbe6b8cc677a49\src\Lucene.Net.Core\Index\CheckIndex.cs:line 1706
FAILED
    WARNING: fixIndex() would remove reference to this segment; full exception:
   at Lucene.Net.Index.CheckIndex.DoCheckIndex(IList`1 onlySegments) in z:\Builds\work\bcdbe6b8cc677a49\src\Lucene.Net.Core\Index\CheckIndex.cs:line
828
  8 of 11: name=_7 docCount=29
    codec=Lucene40
    compound=True
    numFiles=4
    size (MB)=0.00296688079833984
    diagnostics = System.Collections.Generic.Dictionary`2[System.String,System.String]
    has deletions [delGen=1]
    test: open reader.........OK
    test: check integrity.....OK
    test: check live docs.....OK [2 deleted docs]
    test: fields..............OK [6 fields]
    test: field norms.........OK [0 fields]
    test: terms, freq, prox...OK [27 terms; 27 terms/docs pairs; 0 tokens]
    test (ignoring deletes): terms, freq, prox...OK [29 terms; 29 terms/docs pairs; 0 tokens]
    test: stored fields.......OK [54 total field count; avg 2 fields per doc]
    test: term vectors........OK [0 total vector count; avg 0 term/freq vector fields per
doc]
    test: docvalues...........ERROR [read past EOF: SlicedIndexInput(SlicedIndexInput(_7_2_dv.dat
in RAMInputStream(name=_7.cfs)) in RAMInputStream(name=_7.cfs) slice=916:1096)]
   at Lucene.Net.Store.BufferedIndexInput.ReadBytes(Byte[] b, Int32 offset, Int32 len, Boolean
useBuffer) in z:\Builds\work\bcdbe6b8cc677a49\src\Lucene.Net.Core\Store\BufferedIndexInput.cs:line
192
   at Lucene.Net.Store.MockIndexInputWrapper.ReadBytes(Byte[] b, Int32 offset, Int32 len,
Boolean useBuffer) in z:\Builds\work\bcdbe6b8cc677a49\src\Lucene.Net.TestFramework\Store\MockIndexInputWrapper.cs:line
140
   at Lucene.Net.Util.PagedBytes.Copy(IndexInput in, Int64 byteCount) in z:\Builds\work\bcdbe6b8cc677a49\src\Lucene.Net.Core\Util\PagedBytes.cs:line
202
   at Lucene.Net.Codecs.Lucene40.Lucene40DocValuesReader.LoadBytesFixedDeref(FieldInfo field)
in z:\Builds\work\bcdbe6b8cc677a49\src\Lucene.Net.Core\Codecs\Lucene40\Lucene40DocValuesReader.cs:line
562
   at Lucene.Net.Codecs.Lucene40.Lucene40DocValuesReader.GetBinary(FieldInfo field) in z:\Builds\work\bcdbe6b8cc677a49\src\Lucene.Net.Core\Codecs\Lucene40\Lucene40DocValuesReader.cs:line
426
   at Lucene.Net.Index.SegmentReader.GetBinaryDocValues(String field) in z:\Builds\work\bcdbe6b8cc677a49\src\Lucene.Net.Core\Index\SegmentReader.cs:line
590
   at Lucene.Net.Index.CheckIndex.CheckDocValues(FieldInfo fi, AtomicReader reader, DocValuesStatus
status) in z:\Builds\work\bcdbe6b8cc677a49\src\Lucene.Net.Core\Index\CheckIndex.cs:line 1937
   at Lucene.Net.Index.CheckIndex.TestDocValues(AtomicReader reader, StreamWriter infoStream)
in z:\Builds\work\bcdbe6b8cc677a49\src\Lucene.Net.Core\Index\CheckIndex.cs:line 1706
FAILED
    WARNING: fixIndex() would remove reference to this segment; full exception:
   at Lucene.Net.Index.CheckIndex.DoCheckIndex(IList`1 onlySegments) in z:\Builds\work\bcdbe6b8cc677a49\src\Lucene.Net.Core\Index\CheckIndex.cs:line
828
  9 of 11: name=_8 docCount=12
    codec=Lucene40
    compound=True
    numFiles=3
    size (MB)=0.00200080871582031
    diagnostics = System.Collections.Generic.Dictionary`2[System.String,System.String]
    no deletions
    test: open reader.........OK
    test: check integrity.....OK
    test: check live docs.....OK
    test: fields..............OK [6 fields]
    test: field norms.........OK [0 fields]
    test: terms, freq, prox...OK [12 terms; 12 terms/docs pairs; 0 tokens]
    test: stored fields.......OK [24 total field count; avg 2 fields per doc]
    test: term vectors........OK [0 total vector count; avg 0 term/freq vector fields per
doc]
    test: docvalues...........ERROR [did not read all bytes from file: read 49 vs size 59
(resource: MockIndexInputWrapper(SlicedIndexInput(SlicedIndexInput(_8_2_dv.dat in RAMInputStream(name=_8.cfs))
in RAMInputStream(name=_8.cfs) slice=421:480)))]
   at Lucene.Net.Codecs.CodecUtil.CheckEOF(IndexInput in) in z:\Builds\work\bcdbe6b8cc677a49\src\Lucene.Net.Core\Codecs\CodecUtil.cs:line
255
   at Lucene.Net.Codecs.Lucene40.Lucene40DocValuesReader.LoadBytesFixedDeref(FieldInfo field)
in z:\Builds\work\bcdbe6b8cc677a49\src\Lucene.Net.Core\Codecs\Lucene40\Lucene40DocValuesReader.cs:line
565
   at Lucene.Net.Codecs.Lucene40.Lucene40DocValuesReader.GetBinary(FieldInfo field) in z:\Builds\work\bcdbe6b8cc677a49\src\Lucene.Net.Core\Codecs\Lucene40\Lucene40DocValuesReader.cs:line
426
   at Lucene.Net.Index.SegmentReader.GetBinaryDocValues(String field) in z:\Builds\work\bcdbe6b8cc677a49\src\Lucene.Net.Core\Index\SegmentReader.cs:line
590
   at Lucene.Net.Index.CheckIndex.CheckDocValues(FieldInfo fi, AtomicReader reader, DocValuesStatus
status) in z:\Builds\work\bcdbe6b8cc677a49\src\Lucene.Net.Core\Index\CheckIndex.cs:line 1937
   at Lucene.Net.Index.CheckIndex.TestDocValues(AtomicReader reader, StreamWriter infoStream)
in z:\Builds\work\bcdbe6b8cc677a49\src\Lucene.Net.Core\Index\CheckIndex.cs:line 1706
FAILED
    WARNING: fixIndex() would remove reference to this segment; full exception:
   at Lucene.Net.Index.CheckIndex.DoCheckIndex(IList`1 onlySegments) in z:\Builds\work\bcdbe6b8cc677a49\src\Lucene.Net.Core\Index\CheckIndex.cs:line
828
  10 of 11: name=_9 docCount=22
    codec=Lucene40
    compound=True
    numFiles=3
    size (MB)=0.00255393981933594
    diagnostics = System.Collections.Generic.Dictionary`2[System.String,System.String]
    no deletions
    test: open reader.........OK
    test: check integrity.....OK
    test: check live docs.....OK
    test: fields..............OK [6 fields]
    test: field norms.........OK [0 fields]
    test: terms, freq, prox...OK [22 terms; 22 terms/docs pairs; 0 tokens]
    test: stored fields.......OK [44 total field count; avg 2 fields per doc]
    test: term vectors........OK [0 total vector count; avg 0 term/freq vector fields per
doc]
    test: docvalues...........ERROR [read past EOF: SlicedIndexInput(SlicedIndexInput(_9_2_dv.dat
in RAMInputStream(name=_9.cfs)) in RAMInputStream(name=_9.cfs) slice=714:846)]
   at Lucene.Net.Store.BufferedIndexInput.ReadBytes(Byte[] b, Int32 offset, Int32 len, Boolean
useBuffer) in z:\Builds\work\bcdbe6b8cc677a49\src\Lucene.Net.Core\Store\BufferedIndexInput.cs:line
192
   at Lucene.Net.Store.MockIndexInputWrapper.ReadBytes(Byte[] b, Int32 offset, Int32 len,
Boolean useBuffer) in z:\Builds\work\bcdbe6b8cc677a49\src\Lucene.Net.TestFramework\Store\MockIndexInputWrapper.cs:line
140
   at Lucene.Net.Util.PagedBytes.Copy(IndexInput in, Int64 byteCount) in z:\Builds\work\bcdbe6b8cc677a49\src\Lucene.Net.Core\Util\PagedBytes.cs:line
202
   at Lucene.Net.Codecs.Lucene40.Lucene40DocValuesReader.LoadBytesFixedDeref(FieldInfo field)
in z:\Builds\work\bcdbe6b8cc677a49\src\Lucene.Net.Core\Codecs\Lucene40\Lucene40DocValuesReader.cs:line
562
   at Lucene.Net.Codecs.Lucene40.Lucene40DocValuesReader.GetBinary(FieldInfo field) in z:\Builds\work\bcdbe6b8cc677a49\src\Lucene.Net.Core\Codecs\Lucene40\Lucene40DocValuesReader.cs:line
426
   at Lucene.Net.Index.SegmentReader.GetBinaryDocValues(String field) in z:\Builds\work\bcdbe6b8cc677a49\src\Lucene.Net.Core\Index\SegmentReader.cs:line
590
   at Lucene.Net.Index.CheckIndex.CheckDocValues(FieldInfo fi, AtomicReader reader, DocValuesStatus
status) in z:\Builds\work\bcdbe6b8cc677a49\src\Lucene.Net.Core\Index\CheckIndex.cs:line 1937
   at Lucene.Net.Index.CheckIndex.TestDocValues(AtomicReader reader, StreamWriter infoStream)
in z:\Builds\work\bcdbe6b8cc677a49\src\Lucene.Net.Core\Index\CheckIndex.cs:line 1706
FAILED
    WARNING: fixIndex() would remove reference to this segment; full exception:
   at Lucene.Net.Index.CheckIndex.DoCheckIndex(IList`1 onlySegments) in z:\Builds\work\bcdbe6b8cc677a49\src\Lucene.Net.Core\Index\CheckIndex.cs:line
828
  11 of 11: name=_a docCount=3
    codec=Lucene40
    compound=True
    numFiles=3
    size (MB)=0.00168323516845703
    diagnostics = System.Collections.Generic.Dictionary`2[System.String,System.String]
    no deletions
    test: open reader.........OK
    test: check integrity.....OK
    test: check live docs.....OK
    test: fields..............OK [6 fields]
    test: field norms.........OK [0 fields]
    test: terms, freq, prox...OK [3 terms; 3 terms/docs pairs; 0 tokens]
    test: stored fields.......OK [6 total field count; avg 2 fields per doc]
    test: term vectors........OK [0 total vector count; avg 0 term/freq vector fields per
doc]
    test: docvalues...........ERROR [did not read all bytes from file: read 37 vs size 47
(resource: MockIndexInputWrapper(SlicedIndexInput(SlicedIndexInput(_a_2_dv.dat in RAMInputStream(name=_a.cfs))
in RAMInputStream(name=_a.cfs) slice=211:258)))]
   at Lucene.Net.Codecs.CodecUtil.CheckEOF(IndexInput in) in z:\Builds\work\bcdbe6b8cc677a49\src\Lucene.Net.Core\Codecs\CodecUtil.cs:line
255
   at Lucene.Net.Codecs.Lucene40.Lucene40DocValuesReader.LoadBytesFixedDeref(FieldInfo field)
in z:\Builds\work\bcdbe6b8cc677a49\src\Lucene.Net.Core\Codecs\Lucene40\Lucene40DocValuesReader.cs:line
565
   at Lucene.Net.Codecs.Lucene40.Lucene40DocValuesReader.GetBinary(FieldInfo field) in z:\Builds\work\bcdbe6b8cc677a49\src\Lucene.Net.Core\Codecs\Lucene40\Lucene40DocValuesReader.cs:line
426
   at Lucene.Net.Index.SegmentReader.GetBinaryDocValues(String field) in z:\Builds\work\bcdbe6b8cc677a49\src\Lucene.Net.Core\Index\SegmentReader.cs:line
590
   at Lucene.Net.Index.CheckIndex.CheckDocValues(FieldInfo fi, AtomicReader reader, DocValuesStatus
status) in z:\Builds\work\bcdbe6b8cc677a49\src\Lucene.Net.Core\Index\CheckIndex.cs:line 1937
   at Lucene.Net.Index.CheckIndex.TestDocValues(AtomicReader reader, StreamWriter infoStream)
in z:\Builds\work\bcdbe6b8cc677a49\src\Lucene.Net.Core\Index\CheckIndex.cs:line 1706
FAILED
    WARNING: fixIndex() would remove reference to this segment; full exception:
   at Lucene.Net.Index.CheckIndex.DoCheckIndex(IList`1 onlySegments) in z:\Builds\work\bcdbe6b8cc677a49\src\Lucene.Net.Core\Index\CheckIndex.cs:line
828
WARNING: 11 broken segments (containing 372 documents) detected
Changes included (4 changes)
====================================================
Change 31a43f02a9dd9bbffaa5d728d0e942642a74dd79 by itamar (2 files):
Fixing tests by catching the right exception


Change 443636026b5a7ecd8cac3ac27362e30b3799d8a5 by itamar (2 files):
Minor code cleanup


Change 626bb65d669fa70751f3fb1f465395d031d09942 by itamar (3 files):
Marking some more long running tests


Change ea7cfe6972972f91090d995c729689fff9a0f54c by itamar (1 file):
Bringing code to be inline with the Java version

Source: https://github.com/apache/lucene-solr/blob/lucene_solr_4_8_0/lucene/core/src/java/org/apache/lucene/util/fst/NodeHash.java


see more information about changed files: http://teamcity.codebetter.com/viewLog.html?tab=buildChangesDiv&buildId=187977&buildTypeId=LuceneNet_Core

============================================================================
Configure email notifications: http://teamcity.codebetter.com/profile.html?init=1&tab=userNotifications

Mime
  • Unnamed multipart/alternative (inline, None, 0 bytes)
View raw message