lucenenet-dev mailing list archives

Site index · List index
Message view « Date » · « Thread »
Top « Date » · « Thread »
From t.@codebetter.com
Subject [TeamCity, FAILED] Build Lucene.NET :: Lucene.NET Nightly [master] #377
Date Sun, 12 Apr 2015 09:34:53 GMT
Build Lucene.NET :: Lucene.NET Nightly [master] #377 failed (Tests failed: 104 (7 new), passed:
2667, ignored: 122; snapshot dependency failed: Lucene.NET :: Lucene.NET Core).
Agent: JetBrains-dotnet-agent02
Build results: http://teamcity.codebetter.com/viewLog.html?buildId=188141&buildTypeId=LuceneNet_LuceneNetNightly

Failed Tests Summary:
Newly failed tests (7 tests, alphabetically ordered)
==================================================================
Lucene.Net.Tests.Facet.dll: Lucene.Net.Facet.Taxonomy.Directory.TestAddTaxonomy.TestBig
Lucene.Net.Tests.dll: Lucene.Net.Index.TestIndexWriterReader.TestDuringAddDelete
Lucene.Net.Tests.dll: Lucene.Net.Index.TestNRTThreads.TestNRTThreads_Mem
Lucene.Net.Tests.dll: Lucene.Net.Index.TestStoredFieldsFormat.BaseStoredFieldsFormatTestCase.TestConcurrentReads
Lucene.Net.Tests.dll: Lucene.Net.Search.TestMinShouldMatch2.TestAdvanceAllTerms
Lucene.Net.Tests.dll: Lucene.Net.Util.TestDocIdBitSet.BaseDocIdSetTestCase`1.TestAgainstBitSet
Lucene.Net.Tests.dll: Lucene.Net.Util.TestPagedBytes.TestDataInputOutput

Other failed tests (97 tests, alphabetically ordered)
==================================================================
Lucene.Net.Tests.Facet.dll: Lucene.Net.Facet.Range.TestRangeFacetCounts.TestMixedRangeAndNonRangeTaxonomy
Lucene.Net.Tests.Facet.dll: Lucene.Net.Facet.SortedSet.TestSortedSetDocValuesFacets.TestRandom
Lucene.Net.Tests.Facet.dll: Lucene.Net.Facet.SortedSet.TestSortedSetDocValuesFacets.TestStaleState
Lucene.Net.Tests.Facet.dll: Lucene.Net.Facet.Taxonomy.Directory.TestAddTaxonomy.TestConcurrency
Lucene.Net.Tests.Facet.dll: Lucene.Net.Facet.Taxonomy.Directory.TestAddTaxonomy.TestSimple
Lucene.Net.Tests.Facet.dll: Lucene.Net.Facet.Taxonomy.Directory.TestConcurrentFacetedIndexing.TestConcurrency
Lucene.Net.Tests.Facet.dll: Lucene.Net.Facet.Taxonomy.Directory.TestDirectoryTaxonomyReader.TestFreshReadRecreatedTaxonomy
Lucene.Net.Tests.Facet.dll: Lucene.Net.Facet.Taxonomy.Directory.TestDirectoryTaxonomyReader.TestGetChildren
Lucene.Net.Tests.Facet.dll: Lucene.Net.Facet.Taxonomy.Directory.TestDirectoryTaxonomyReader.TestOpenIfChangedManySegments
Lucene.Net.Tests.Facet.dll: Lucene.Net.Facet.Taxonomy.Directory.TestDirectoryTaxonomyReader.TestOpenIfChangedMergedSegment
Lucene.Net.Tests.Facet.dll: Lucene.Net.Facet.Taxonomy.Directory.TestDirectoryTaxonomyReader.TestOpenIfChangedNoChangesButSegmentMerges
Lucene.Net.Tests.Facet.dll: Lucene.Net.Facet.Taxonomy.Directory.TestDirectoryTaxonomyReader.TestOpenIfChangedReadRecreatedTaxonomy
Lucene.Net.Tests.Facet.dll: Lucene.Net.Facet.Taxonomy.Directory.TestDirectoryTaxonomyWriter.TestConcurrency
Lucene.Net.Tests.Facet.dll: Lucene.Net.Facet.Taxonomy.Directory.TestDirectoryTaxonomyWriter.TestHugeLabel
Lucene.Net.Tests.Facet.dll: Lucene.Net.Facet.Taxonomy.TestLRUHashMap.TestLru
Lucene.Net.Tests.Facet.dll: Lucene.Net.Facet.Taxonomy.TestSearcherTaxonomyManager.TestReplaceTaxonomyNrt
Lucene.Net.Tests.Facet.dll: Lucene.Net.Facet.Taxonomy.TestTaxonomyCombined.TestChildrenArrays
Lucene.Net.Tests.Facet.dll: Lucene.Net.Facet.Taxonomy.TestTaxonomyCombined.TestChildrenArraysGrowth
Lucene.Net.Tests.Facet.dll: Lucene.Net.Facet.Taxonomy.TestTaxonomyCombined.TestChildrenArraysInvariants
Lucene.Net.Tests.Facet.dll: Lucene.Net.Facet.Taxonomy.TestTaxonomyCombined.TestReaderBasic
Lucene.Net.Tests.Facet.dll: Lucene.Net.Facet.Taxonomy.TestTaxonomyCombined.TestReaderParent
Lucene.Net.Tests.Facet.dll: Lucene.Net.Facet.Taxonomy.TestTaxonomyCombined.TestSeparateReaderAndWriter
Lucene.Net.Tests.Facet.dll: Lucene.Net.Facet.Taxonomy.TestTaxonomyCombined.TestWriter
Lucene.Net.Tests.Facet.dll: Lucene.Net.Facet.Taxonomy.TestTaxonomyCombined.TestWriterCheckPaths
Lucene.Net.Tests.Facet.dll: Lucene.Net.Facet.Taxonomy.TestTaxonomyCombined.TestWriterCheckPaths2
Lucene.Net.Tests.Facet.dll: Lucene.Net.Facet.Taxonomy.TestTaxonomyCombined.TestWriterParent1
Lucene.Net.Tests.Facet.dll: Lucene.Net.Facet.Taxonomy.TestTaxonomyCombined.TestWriterParent2
Lucene.Net.Tests.Facet.dll: Lucene.Net.Facet.Taxonomy.TestTaxonomyCombined.TestWriterSimpler
Lucene.Net.Tests.Facet.dll: Lucene.Net.Facet.Taxonomy.TestTaxonomyCombined.TestWriterTwice
Lucene.Net.Tests.Facet.dll: Lucene.Net.Facet.Taxonomy.TestTaxonomyCombined.TestWriterTwice2
Lucene.Net.Tests.Facet.dll: Lucene.Net.Facet.Taxonomy.TestTaxonomyCombined.TestWriterTwice3
Lucene.Net.Tests.Facet.dll: Lucene.Net.Facet.Taxonomy.TestTaxonomyFacetAssociations.TestFloatSumAssociation
Lucene.Net.Tests.Facet.dll: Lucene.Net.Facet.Taxonomy.TestTaxonomyFacetAssociations.TestIntAndFloatAssocation
Lucene.Net.Tests.Facet.dll: Lucene.Net.Facet.Taxonomy.TestTaxonomyFacetAssociations.TestIntSumAssociation
Lucene.Net.Tests.Facet.dll: Lucene.Net.Facet.Taxonomy.TestTaxonomyFacetAssociations.TestIntSumAssociationDrillDown
Lucene.Net.Tests.Facet.dll: Lucene.Net.Facet.Taxonomy.TestTaxonomyFacetCounts.TestBasic
Lucene.Net.Tests.Facet.dll: Lucene.Net.Facet.Taxonomy.TestTaxonomyFacetCounts.TestChildCount
Lucene.Net.Tests.Facet.dll: Lucene.Net.Facet.Taxonomy.TestTaxonomyFacetCounts.TestCountRoot
Lucene.Net.Tests.Facet.dll: Lucene.Net.Facet.Taxonomy.TestTaxonomyFacetCounts.TestLabelWithDelimiter
Lucene.Net.Tests.Facet.dll: Lucene.Net.Facet.Taxonomy.TestTaxonomyFacetCounts.TestManyFacetsInOneDocument
Lucene.Net.Tests.Facet.dll: Lucene.Net.Facet.Taxonomy.TestTaxonomyFacetCounts.TestRandom
Lucene.Net.Tests.Facet.dll: Lucene.Net.Facet.Taxonomy.TestTaxonomyFacetCounts.TestSegmentsWithoutCategoriesOrResults
Lucene.Net.Tests.Facet.dll: Lucene.Net.Facet.Taxonomy.TestTaxonomyFacetCounts.TestSeparateIndexedFields
Lucene.Net.Tests.Facet.dll: Lucene.Net.Facet.Taxonomy.TestTaxonomyFacetCounts.TestSparseFacets
Lucene.Net.Tests.Facet.dll: Lucene.Net.Facet.Taxonomy.TestTaxonomyFacetCounts2
Lucene.Net.Tests.Facet.dll: Lucene.Net.Facet.Taxonomy.TestTaxonomyFacetCounts2.TestAllCounts
Lucene.Net.Tests.Facet.dll: Lucene.Net.Facet.Taxonomy.TestTaxonomyFacetCounts2.TestBigNumResults
Lucene.Net.Tests.Facet.dll: Lucene.Net.Facet.Taxonomy.TestTaxonomyFacetCounts2.TestDifferentNumResults
Lucene.Net.Tests.Facet.dll: Lucene.Net.Facet.Taxonomy.TestTaxonomyFacetCounts2.TestNoParents
Lucene.Net.Tests.Facet.dll: Lucene.Net.Facet.Taxonomy.TestTaxonomyFacetSumValueSource.TestBasic
Lucene.Net.Tests.Facet.dll: Lucene.Net.Facet.Taxonomy.TestTaxonomyFacetSumValueSource.TestCountAndSumScore
Lucene.Net.Tests.Facet.dll: Lucene.Net.Facet.Taxonomy.TestTaxonomyFacetSumValueSource.TestNoScore
Lucene.Net.Tests.Facet.dll: Lucene.Net.Facet.Taxonomy.TestTaxonomyFacetSumValueSource.TestRandom
Lucene.Net.Tests.Facet.dll: Lucene.Net.Facet.Taxonomy.TestTaxonomyFacetSumValueSource.TestRollupValues
Lucene.Net.Tests.Facet.dll: Lucene.Net.Facet.Taxonomy.TestTaxonomyFacetSumValueSource.TestSparseFacets
Lucene.Net.Tests.Facet.dll: Lucene.Net.Facet.Taxonomy.TestTaxonomyFacetSumValueSource.TestSumScoreAggregator
Lucene.Net.Tests.Facet.dll: Lucene.Net.Facet.Taxonomy.TestTaxonomyFacetSumValueSource.TestWithScore
Lucene.Net.Tests.Facet.dll: Lucene.Net.Facet.TestDrillSideways.TestBasic
Lucene.Net.Tests.Facet.dll: Lucene.Net.Facet.TestDrillSideways.TestMultipleRequestsPerDim
Lucene.Net.Tests.Facet.dll: Lucene.Net.Facet.TestDrillSideways.TestRandom
Lucene.Net.Tests.Facet.dll: Lucene.Net.Facet.TestDrillSideways.TestSometimesInvalidDrillDown
Lucene.Net.Tests.Facet.dll: Lucene.Net.Facet.TestMultipleIndexFields.TestCustom
Lucene.Net.Tests.Facet.dll: Lucene.Net.Facet.TestMultipleIndexFields.TestDefault
Lucene.Net.Tests.Queries.dll: Lucene.Net.Tests.Queries.CommonTermsQueryTest.TestEqualsHashCode
Lucene.Net.Tests.dll: Lucene.Net.Codecs.Lucene41.TestBlockPostingsFormat2
Lucene.Net.Tests.dll: Lucene.Net.Codecs.Lucene41.TestBlockPostingsFormat3.Test
Lucene.Net.Tests.dll: Lucene.Net.Codecs.Lucene42.TestLucene42DocValuesFormat.BaseDocValuesFormatTestCase.TestVeryLargeButLegalSortedBytes
Lucene.Net.Tests.dll: Lucene.Net.Index.TestAtomicUpdate.TestAtomicUpdates
Lucene.Net.Tests.dll: Lucene.Net.Index.TestDirectoryReader.TestNoDir
Lucene.Net.Tests.dll: Lucene.Net.Index.TestDocumentsWriterStallControl.TestSimpleStall
Lucene.Net.Tests.dll: Lucene.Net.Index.TestDuelingCodecs.TestEquals
Lucene.Net.Tests.dll: Lucene.Net.Index.TestIndexWriterExceptions.TestExceptionOnMergeInit
Lucene.Net.Tests.dll: Lucene.Net.Index.TestStressIndexing.TestStressIndexAndSearching
Lucene.Net.Tests.dll: Lucene.Net.Index.TestTermdocPerf.TestTermDocPerf
Lucene.Net.Tests.dll: Lucene.Net.Index.TestTransactions.TestTransactions_Mem
Lucene.Net.Tests.dll: Lucene.Net.Search.Spans.TestSpanMultiTermQueryWrapper.TestFuzzy2
Lucene.Net.Tests.dll: Lucene.Net.Search.TestFuzzyQuery.TestTieBreaker
Lucene.Net.Tests.dll: Lucene.Net.Search.TestNumericRangeQuery32.TestInfiniteValues
Lucene.Net.Tests.dll: Lucene.Net.Search.TestNumericRangeQuery64.TestInfiniteValues
Lucene.Net.Tests.dll: Lucene.Net.Search.TestSearchAfter.TestQueries
Lucene.Net.Tests.dll: Lucene.Net.Search.TestSimpleExplanations.TestDMQ8
Lucene.Net.Tests.dll: Lucene.Net.Search.TestTermVectors
Lucene.Net.Tests.dll: Lucene.Net.Search.TestTermVectors.TestMixedVectrosVectors
Lucene.Net.Tests.dll: Lucene.Net.Search.TestTopDocsMerge.TestSort_1
Lucene.Net.Tests.dll: Lucene.Net.Search.TestTopDocsMerge.TestSort_2
Lucene.Net.Tests.dll: Lucene.Net.Store.TestBufferedIndexInput.TestSetBufferSize
Lucene.Net.Tests.dll: Lucene.Net.Store.TestDirectory.TestDontCreate
Lucene.Net.Tests.dll: Lucene.Net.Store.TestFileSwitchDirectory.TestNoDir
Lucene.Net.Tests.dll: Lucene.Net.Tests.TestAssertions.TestTokenStreams
Lucene.Net.Tests.dll: Lucene.Net.Util.Packed.TestEliasFanoSequence.TestMonotoneSequencesLonger
Lucene.Net.Tests.dll: Lucene.Net.Util.Packed.TestEliasFanoSequence.TestStrictMonotoneSequencesLonger
Lucene.Net.Tests.dll: Lucene.Net.Util.TestIndexableBinaryStringTools.TestEncodedSortability
Lucene.Net.Tests.dll: Lucene.Net.Util.TestPagedBytes.TestOverflow



Newly failed tests details (only first 3 failures shown here)
==================================================================
Lucene.Net.Tests.dll: Lucene.Net.Index.TestIndexWriterReader.TestDuringAddDelete (new) =================
Test(s) failed. Test exceeded Timeout value of 20000ms

Lucene.Net.Tests.dll: Lucene.Net.Index.TestNRTThreads.TestNRTThreads_Mem (new) =================
Test(s) failed.   Expected: False
  But was:  True

   at NUnit.Framework.Assert.That(Object actual, IResolveConstraint expression, String message,
Object[] args)
   at NUnit.Framework.Assert.IsFalse(Boolean condition)
   at Lucene.Net.Index.ThreadedIndexingAndSearchingTestCase.RunTest(String testName) in z:\Builds\work\bcdbe6b8cc677a49\src\Lucene.Net.TestFramework\Index\ThreadedIndexingAndSearchingTestCase.cs:line
639
   at Lucene.Net.Index.TestNRTThreads.TestNRTThreads_Mem() in z:\Builds\work\bcdbe6b8cc677a49\src\Lucene.Net.Tests\core\Index\TestNRTThreads.cs:line
182
------- Stdout: -------
WARNING: Leftover undeleted temporary files The process cannot access the file 'write.lock'
because it is being used by another process.
------- Stderr: -------
: hit exc
   at Lucene.Net.Store.BufferedIndexInput.ReadBytes(Byte[] b, Int32 offset, Int32 len, Boolean
useBuffer) in z:\Builds\work\bcdbe6b8cc677a49\src\Lucene.Net.Core\Store\BufferedIndexInput.cs:line
192
   at Lucene.Net.Store.BufferedIndexInput.ReadBytes(Byte[] b, Int32 offset, Int32 len) in
z:\Builds\work\bcdbe6b8cc677a49\src\Lucene.Net.Core\Store\BufferedIndexInput.cs:line 136
   at Lucene.Net.Store.MockIndexInputWrapper.ReadBytes(Byte[] b, Int32 offset, Int32 len)
in z:\Builds\work\bcdbe6b8cc677a49\src\Lucene.Net.TestFramework\Store\MockIndexInputWrapper.cs:line
134
   at Lucene.Net.Codecs.BlockTreeTermsReader.FieldReader.SegmentTermsEnum.Frame.LoadBlock()
in z:\Builds\work\bcdbe6b8cc677a49\src\Lucene.Net.Core\Codecs\BlockTreeTermsReader.cs:line
2819
   at Lucene.Net.Codecs.BlockTreeTermsReader.FieldReader.SegmentTermsEnum.SeekExact(BytesRef
target) in z:\Builds\work\bcdbe6b8cc677a49\src\Lucene.Net.Core\Codecs\BlockTreeTermsReader.cs:line
2034
   at Lucene.Net.Index.TermContext.Build(IndexReaderContext context, Term term) in z:\Builds\work\bcdbe6b8cc677a49\src\Lucene.Net.Core\Index\TermContext.cs:line
107
   at Lucene.Net.Search.TermQuery.CreateWeight(IndexSearcher searcher) in z:\Builds\work\bcdbe6b8cc677a49\src\Lucene.Net.Core\Search\TermQuery.cs:line
203
   at Lucene.Net.Search.IndexSearcher.CreateNormalizedWeight(Query query) in z:\Builds\work\bcdbe6b8cc677a49\src\Lucene.Net.Core\Search\IndexSearcher.cs:line
728
   at Lucene.Net.Search.IndexSearcher.Search(Query query, Filter filter, Int32 n) in z:\Builds\work\bcdbe6b8cc677a49\src\Lucene.Net.Core\Search\IndexSearcher.cs:line
301
   at Lucene.Net.Search.IndexSearcher.Search(Query query, Int32 n) in z:\Builds\work\bcdbe6b8cc677a49\src\Lucene.Net.Core\Search\IndexSearcher.cs:line
290
   at Lucene.Net.Index.ThreadedIndexingAndSearchingTestCase.RunQuery(IndexSearcher s, Query
q) in z:\Builds\work\bcdbe6b8cc677a49\src\Lucene.Net.TestFramework\Index\ThreadedIndexingAndSearchingTestCase.cs:line
836
   at Lucene.Net.Index.ThreadedIndexingAndSearchingTestCase.SmokeTestSearcher(IndexSearcher
s) in z:\Builds\work\bcdbe6b8cc677a49\src\Lucene.Net.TestFramework\Index\ThreadedIndexingAndSearchingTestCase.cs:line
849
   at Lucene.Net.Index.ThreadedIndexingAndSearchingTestCase.ThreadAnonymousInnerClassHelper2.Run()
in z:\Builds\work\bcdbe6b8cc677a49\src\Lucene.Net.TestFramework\Index\ThreadedIndexingAndSearchingTestCase.cs:line
467
Unhandled exception in remote appdomain: System.Exception: read past EOF: NIOFSIndexInput(path="Z:\Builds\temp\buildTmp\LuceneTemp\TestNRTThreads-1\_5_Lucene41_0.tim")
---> System.IO.EndOfStreamException: read past EOF: NIOFSIndexInput(path="Z:\Builds\temp\buildTmp\LuceneTemp\TestNRTThreads-1\_5_Lucene41_0.tim")
   at Lucene.Net.Store.BufferedIndexInput.ReadBytes(Byte[] b, Int32 offset, Int32 len, Boolean
useBuffer) in z:\Builds\work\bcdbe6b8cc677a49\src\Lucene.Net.Core\Store\BufferedIndexInput.cs:line
192
   at Lucene.Net.Store.BufferedIndexInput.ReadBytes(Byte[] b, Int32 offset, Int32 len) in
z:\Builds\work\bcdbe6b8cc677a49\src\Lucene.Net.Core\Store\BufferedIndexInput.cs:line 136
   at Lucene.Net.Store.MockIndexInputWrapper.ReadBytes(Byte[] b, Int32 offset, Int32 len)
in z:\Builds\work\bcdbe6b8cc677a49\src\Lucene.Net.TestFramework\Store\MockIndexInputWrapper.cs:line
134
   at Lucene.Net.Codecs.BlockTreeTermsReader.FieldReader.SegmentTermsEnum.Frame.LoadBlock()
in z:\Builds\work\bcdbe6b8cc677a49\src\Lucene.Net.Core\Codecs\BlockTreeTermsReader.cs:line
2819
   at Lucene.Net.Codecs.BlockTreeTermsReader.FieldReader.SegmentTermsEnum.SeekExact(BytesRef
target) in z:\Builds\work\bcdbe6b8cc677a49\src\Lucene.Net.Core\Codecs\BlockTreeTermsReader.cs:line
2034
   at Lucene.Net.Index.TermContext.Build(IndexReaderContext context, Term term) in z:\Builds\work\bcdbe6b8cc677a49\src\Lucene.Net.Core\Index\TermContext.cs:line
107
   at Lucene.Net.Search.TermQuery.CreateWeight(IndexSearcher searcher) in z:\Builds\work\bcdbe6b8cc677a49\src\Lucene.Net.Core\Search\TermQuery.cs:line
203
   at Lucene.Net.Search.IndexSearcher.CreateNormalizedWeight(Query query) in z:\Builds\work\bcdbe6b8cc677a49\src\Lucene.Net.Core\Search\IndexSearcher.cs:line
728
   at Lucene.Net.Search.IndexSearcher.Search(Query query, Filter filter, Int32 n) in z:\Builds\work\bcdbe6b8cc677a49\src\Lucene.Net.Core\Search\IndexSearcher.cs:line
301
   at Lucene.Net.Search.IndexSearcher.Search(Query query, Int32 n) in z:\Builds\work\bcdbe6b8cc677a49\src\Lucene.Net.Core\Search\IndexSearcher.cs:line
290
   at Lucene.Net.Index.ThreadedIndexingAndSearchingTestCase.RunQuery(IndexSearcher s, Query
q) in z:\Builds\work\bcdbe6b8cc677a49\src\Lucene.Net.TestFramework\Index\ThreadedIndexingAndSearchingTestCase.cs:line
836
   at Lucene.Net.Index.ThreadedIndexingAndSearchingTestCase.SmokeTestSearcher(IndexSearcher
s) in z:\Builds\work\bcdbe6b8cc677a49\src\Lucene.Net.TestFramework\Index\ThreadedIndexingAndSearchingTestCase.cs:line
849
   at Lucene.Net.Index.ThreadedIndexingAndSearchingTestCase.ThreadAnonymousInnerClassHelper2.Run()
in z:\Builds\work\bcdbe6b8cc677a49\src\Lucene.Net.TestFramework\Index\ThreadedIndexingAndSearchingTestCase.cs:line
467
   --- End of inner exception stack trace ---
   at Lucene.Net.Index.ThreadedIndexingAndSearchingTestCase.ThreadAnonymousInnerClassHelper2.Run()
in z:\Builds\work\bcdbe6b8cc677a49\src\Lucene.Net.TestFramework\Index\ThreadedIndexingAndSearchingTestCase.cs:line
525
   at System.Threading.ThreadHelper.ThreadStart_Context(Object state)
   at System.Threading.ExecutionContext.RunInternal(ExecutionContext executionContext, ContextCallback
callback, Object state, Boolean preserveSyncCtx)
   at System.Threading.ExecutionContext.Run(ExecutionContext executionContext, ContextCallback
callback, Object state, Boolean preserveSyncCtx)
   at System.Threading.ExecutionContext.Run(ExecutionContext executionContext, ContextCallback
callback, Object state)
   at System.Threading.ThreadHelper.ThreadStart()
: hit exc
: hit exc
   at Lucene.Net.Store.NIOFSDirectory.NIOFSIndexInput.ReadInternal(Byte[] b, Int32 offset,
Int32 len) in z:\Builds\work\bcdbe6b8cc677a49\src\Lucene.Net.Core\Store\NIOFSDirectory.cs:line
256
   at Lucene.Net.Store.BufferedIndexInput.Refill() in z:\Builds\work\bcdbe6b8cc677a49\src\Lucene.Net.Core\Store\BufferedIndexInput.cs:line
368
   at Lucene.Net.Store.BufferedIndexInput.ReadBytes(Byte[] b, Int32 offset, Int32 len, Boolean
useBuffer) in z:\Builds\work\bcdbe6b8cc677a49\src\Lucene.Net.Core\Store\BufferedIndexInput.cs:line
167
   at Lucene.Net.Store.BufferedIndexInput.ReadBytes(Byte[] b, Int32 offset, Int32 len) in
z:\Builds\work\bcdbe6b8cc677a49\src\Lucene.Net.Core\Store\BufferedIndexInput.cs:line 136
   at Lucene.Net.Store.MockIndexInputWrapper.ReadBytes(Byte[] b, Int32 offset, Int32 len)
in z:\Builds\work\bcdbe6b8cc677a49\src\Lucene.Net.TestFramework\Store\MockIndexInputWrapper.cs:line
134
   at Lucene.Net.Codecs.BlockTreeTermsReader.FieldReader.SegmentTermsEnum.Frame.LoadBlock()
in z:\Builds\work\bcdbe6b8cc677a49\src\Lucene.Net.Core\Codecs\BlockTreeTermsReader.cs:line
2836
   at Lucene.Net.Codecs.BlockTreeTermsReader.FieldReader.SegmentTermsEnum.SeekExact(BytesRef
target) in z:\Builds\work\bcdbe6b8cc677a49\src\Lucene.Net.Core\Codecs\BlockTreeTermsReader.cs:line
2034
   at Lucene.Net.Index.TermContext.Build(IndexReaderContext context, Term term) in z:\Builds\work\bcdbe6b8cc677a49\src\Lucene.Net.Core\Index\TermContext.cs:line
107
   at Lucene.Net.Search.TermQuery.CreateWeight(IndexSearcher searcher) in z:\Builds\work\bcdbe6b8cc677a49\src\Lucene.Net.Core\Search\TermQuery.cs:line
203
   at Lucene.Net.Search.IndexSearcher.CreateNormalizedWeight(Query query) in z:\Builds\work\bcdbe6b8cc677a49\src\Lucene.Net.Core\Search\IndexSearcher.cs:line
728
   at Lucene.Net.Search.IndexSearcher.Search(Query query, Filter filter, Int32 n, Sort sort)
in z:\Builds\work\bcdbe6b8cc677a49\src\Lucene.Net.Core\Search\IndexSearcher.cs:line 346
   at Lucene.Net.Index.ThreadedIndexingAndSearchingTestCase.RunQuery(IndexSearcher s, Query
q) in z:\Builds\work\bcdbe6b8cc677a49\src\Lucene.Net.TestFramework\Index\ThreadedIndexingAndSearchingTestCase.cs:line
837
   at Lucene.Net.Index.ThreadedIndexingAndSearchingTestCase.ThreadAnonymousInnerClassHelper2.Run()
in z:\Builds\work\bcdbe6b8cc677a49\src\Lucene.Net.TestFramework\Index\ThreadedIndexingAndSearchingTestCase.cs:line
507
Unhandled exception in remote appdomain: System.Exception: read past EOF: NIOFSIndexInput(path="Z:\Builds\temp\buildTmp\LuceneTemp\TestNRTThreads-1\_5_Lucene41_0.tim")
off: 0 len: 1024 pos: 6002 chunkLen: 348 end: 7165 ---> System.Exception: read past EOF:
NIOFSIndexInput(path="Z:\Builds\temp\buildTmp\LuceneTemp\TestNRTThreads-1\_5_Lucene41_0.tim")
off: 0 len: 1024 pos: 6002 chunkLen: 348 end: 7165
   at Lucene.Net.Store.NIOFSDirectory.NIOFSIndexInput.ReadInternal(Byte[] b, Int32 offset,
Int32 len) in z:\Builds\work\bcdbe6b8cc677a49\src\Lucene.Net.Core\Store\NIOFSDirectory.cs:line
256
   at Lucene.Net.Store.BufferedIndexInput.Refill() in z:\Builds\work\bcdbe6b8cc677a49\src\Lucene.Net.Core\Store\BufferedIndexInput.cs:line
368
   at Lucene.Net.Store.BufferedIndexInput.ReadBytes(Byte[] b, Int32 offset, Int32 len, Boolean
useBuffer) in z:\Builds\work\bcdbe6b8cc677a49\src\Lucene.Net.Core\Store\BufferedIndexInput.cs:line
167
   at Lucene.Net.Store.BufferedIndexInput.ReadBytes(Byte[] b, Int32 offset, Int32 len) in
z:\Builds\work\bcdbe6b8cc677a49\src\Lucene.Net.Core\Store\BufferedIndexInput.cs:line 136
   at Lucene.Net.Store.MockIndexInputWrapper.ReadBytes(Byte[] b, Int32 offset, Int32 len)
in z:\Builds\work\bcdbe6b8cc677a49\src\Lucene.Net.TestFramework\Store\MockIndexInputWrapper.cs:line
134
   at Lucene.Net.Codecs.BlockTreeTermsReader.FieldReader.SegmentTermsEnum.Frame.LoadBlock()
in z:\Builds\work\bcdbe6b8cc677a49\src\Lucene.Net.Core\Codecs\BlockTreeTermsReader.cs:line
2836
   at Lucene.Net.Codecs.BlockTreeTermsReader.FieldReader.SegmentTermsEnum.SeekExact(BytesRef
target) in z:\Builds\work\bcdbe6b8cc677a49\src\Lucene.Net.Core\Codecs\BlockTreeTermsReader.cs:line
2034
   at Lucene.Net.Index.TermContext.Build(IndexReaderContext context, Term term) in z:\Builds\work\bcdbe6b8cc677a49\src\Lucene.Net.Core\Index\TermContext.cs:line
107
   at Lucene.Net.Search.TermQuery.CreateWeight(IndexSearcher searcher) in z:\Builds\work\bcdbe6b8cc677a49\src\Lucene.Net.Core\Search\TermQuery.cs:line
203
   at Lucene.Net.Search.IndexSearcher.CreateNormalizedWeight(Query query) in z:\Builds\work\bcdbe6b8cc677a49\src\Lucene.Net.Core\Search\IndexSearcher.cs:line
728
   at Lucene.Net.Search.IndexSearcher.Search(Query query, Filter filter, Int32 n, Sort sort)
in z:\Builds\work\bcdbe6b8cc677a49\src\Lucene.Net.Core\Search\IndexSearcher.cs:line 346
   at Lucene.Net.Index.ThreadedIndexingAndSearchingTestCase.RunQuery(IndexSearcher s, Query
q) in z:\Builds\work\bcdbe6b8cc677a49\src\Lucene.Net.TestFramework\Index\ThreadedIndexingAndSearchingTestCase.cs:line
837
   at Lucene.Net.Index.ThreadedIndexingAndSearchingTestCase.ThreadAnonymousInnerClassHelper2.Run()
in z:\Builds\work\bcdbe6b8cc677a49\src\Lucene.Net.TestFramework\Index\ThreadedIndexingAndSearchingTestCase.cs:line
507
   --- End of inner exception stack trace ---
   at Lucene.Net.Index.ThreadedIndexingAndSearchingTestCase.ThreadAnonymousInnerClassHelper2.Run()
in z:\Builds\work\bcdbe6b8cc677a49\src\Lucene.Net.TestFramework\Index\ThreadedIndexingAndSearchingTestCase.cs:line
525
   at System.Threading.ThreadHelper.ThreadStart_Context(Object state)
   at System.Threading.ExecutionContext.RunInternal(ExecutionContext executionContext, ContextCallback
callback, Object state, Boolean preserveSyncCtx)
   at System.Threading.ExecutionContext.Run(ExecutionContext executionContext, ContextCallback
callback, Object state, Boolean preserveSyncCtx)
   at System.Threading.ExecutionContext.Run(ExecutionContext executionContext, ContextCallback
callback, Object state)
   at System.Threading.ThreadHelper.ThreadStart()
   at NUnit.Framework.Assert.That(Object actual, IResolveConstraint expression, String message,
Object[] args)
   at NUnit.Framework.Assert.AreEqual(Int32 expected, Int32 actual)
   at Lucene.Net.Index.ThreadedIndexingAndSearchingTestCase.RunQuery(IndexSearcher s, Query
q) in z:\Builds\work\bcdbe6b8cc677a49\src\Lucene.Net.TestFramework\Index\ThreadedIndexingAndSearchingTestCase.cs:line
842
   at Lucene.Net.Index.ThreadedIndexingAndSearchingTestCase.ThreadAnonymousInnerClassHelper2.Run()
in z:\Builds\work\bcdbe6b8cc677a49\src\Lucene.Net.TestFramework\Index\ThreadedIndexingAndSearchingTestCase.cs:line
507
: hit exc
   at Lucene.Net.Store.BufferedIndexInput.ReadVInt() in z:\Builds\work\bcdbe6b8cc677a49\src\Lucene.Net.Core\Store\BufferedIndexInput.cs:line
275
   at Lucene.Net.Store.MockIndexInputWrapper.ReadVInt() in z:\Builds\work\bcdbe6b8cc677a49\src\Lucene.Net.TestFramework\Store\MockIndexInputWrapper.cs:line
176
   at Lucene.Net.Codecs.BlockTreeTermsReader.FieldReader.SegmentTermsEnum.Frame.LoadBlock()
in z:\Builds\work\bcdbe6b8cc677a49\src\Lucene.Net.Core\Codecs\BlockTreeTermsReader.cs:line
2831
   at Lucene.Net.Codecs.BlockTreeTermsReader.FieldReader.SegmentTermsEnum.SeekExact(BytesRef
target) in z:\Builds\work\bcdbe6b8cc677a49\src\Lucene.Net.Core\Codecs\BlockTreeTermsReader.cs:line
2034
   at Lucene.Net.Index.TermContext.Build(IndexReaderContext context, Term term) in z:\Builds\work\bcdbe6b8cc677a49\src\Lucene.Net.Core\Index\TermContext.cs:line
107
   at Lucene.Net.Search.TermQuery.CreateWeight(IndexSearcher searcher) in z:\Builds\work\bcdbe6b8cc677a49\src\Lucene.Net.Core\Search\TermQuery.cs:line
203
   at Lucene.Net.Search.IndexSearcher.CreateNormalizedWeight(Query query) in z:\Builds\work\bcdbe6b8cc677a49\src\Lucene.Net.Core\Search\IndexSearcher.cs:line
728
   at Lucene.Net.Search.IndexSearcher.Search(Query query, Filter filter, Int32 n, Sort sort)
in z:\Builds\work\bcdbe6b8cc677a49\src\Lucene.Net.Core\Search\IndexSearcher.cs:line 346
   at Lucene.Net.Index.ThreadedIndexingAndSearchingTestCase.RunQuery(IndexSearcher s, Query
q) in z:\Builds\work\bcdbe6b8cc677a49\src\Lucene.Net.TestFramework\Index\ThreadedIndexingAndSearchingTestCase.cs:line
837
   at Lucene.Net.Index.ThreadedIndexingAndSearchingTestCase.SmokeTestSearcher(IndexSearcher
s) in z:\Builds\work\bcdbe6b8cc677a49\src\Lucene.Net.TestFramework\Index\ThreadedIndexingAndSearchingTestCase.cs:line
849
   at Lucene.Net.Index.ThreadedIndexingAndSearchingTestCase.ThreadAnonymousInnerClassHelper2.Run()
in z:\Builds\work\bcdbe6b8cc677a49\src\Lucene.Net.TestFramework\Index\ThreadedIndexingAndSearchingTestCase.cs:line
467
Unhandled exception in remote appdomain: System.Exception:   Expected: 0
  But was:  1
 ---> NUnit.Framework.AssertionException:   Expected: 0
  But was:  1

   at NUnit.Framework.Assert.That(Object actual, IResolveConstraint expression, String message,
Object[] args)
   at NUnit.Framework.Assert.AreEqual(Int32 expected, Int32 actual)
   at Lucene.Net.Index.ThreadedIndexingAndSearchingTestCase.RunQuery(IndexSearcher s, Query
q) in z:\Builds\work\bcdbe6b8cc677a49\src\Lucene.Net.TestFramework\Index\ThreadedIndexingAndSearchingTestCase.cs:line
842
   at Lucene.Net.Index.ThreadedIndexingAndSearchingTestCase.ThreadAnonymousInnerClassHelper2.Run()
in z:\Builds\work\bcdbe6b8cc677a49\src\Lucene.Net.TestFramework\Index\ThreadedIndexingAndSearchingTestCase.cs:line
507
   --- End of inner exception stack trace ---
   at Lucene.Net.Index.ThreadedIndexingAndSearchingTestCase.ThreadAnonymousInnerClassHelper2.Run()
in z:\Builds\work\bcdbe6b8cc677a49\src\Lucene.Net.TestFramework\Index\ThreadedIndexingAndSearchingTestCase.cs:line
525
   at System.Threading.ThreadHelper.ThreadStart_Context(Object state)
   at System.Threading.ExecutionContext.RunInternal(ExecutionContext executionContext, ContextCallback
callback, Object state, Boolean preserveSyncCtx)
   at System.Threading.ExecutionContext.Run(ExecutionContext executionContext, ContextCallback
callback, Object state, Boolean preserveSyncCtx)
   at System.Threading.ExecutionContext.Run(ExecutionContext executionContext, ContextCallback
callback, Object state)
   at System.Threading.ThreadHelper.ThreadStart()
Unhandled exception in remote appdomain: System.Exception: Invalid vInt detected (too many
bits) ---> System.IO.IOException: Invalid vInt detected (too many bits)
   at Lucene.Net.Store.BufferedIndexInput.ReadVInt() in z:\Builds\work\bcdbe6b8cc677a49\src\Lucene.Net.Core\Store\BufferedIndexInput.cs:line
275
   at Lucene.Net.Store.MockIndexInputWrapper.ReadVInt() in z:\Builds\work\bcdbe6b8cc677a49\src\Lucene.Net.TestFramework\Store\MockIndexInputWrapper.cs:line
176
   at Lucene.Net.Codecs.BlockTreeTermsReader.FieldReader.SegmentTermsEnum.Frame.LoadBlock()
in z:\Builds\work\bcdbe6b8cc677a49\src\Lucene.Net.Core\Codecs\BlockTreeTermsReader.cs:line
2831
   at Lucene.Net.Codecs.BlockTreeTermsReader.FieldReader.SegmentTermsEnum.SeekExact(BytesRef
target) in z:\Builds\work\bcdbe6b8cc677a49\src\Lucene.Net.Core\Codecs\BlockTreeTermsReader.cs:line
2034
   at Lucene.Net.Index.TermContext.Build(IndexReaderContext context, Term term) in z:\Builds\work\bcdbe6b8cc677a49\src\Lucene.Net.Core\Index\TermContext.cs:line
107
   at Lucene.Net.Search.TermQuery.CreateWeight(IndexSearcher searcher) in z:\Builds\work\bcdbe6b8cc677a49\src\Lucene.Net.Core\Search\TermQuery.cs:line
203
   at Lucene.Net.Search.IndexSearcher.CreateNormalizedWeight(Query query) in z:\Builds\work\bcdbe6b8cc677a49\src\Lucene.Net.Core\Search\IndexSearcher.cs:line
728
   at Lucene.Net.Search.IndexSearcher.Search(Query query, Filter filter, Int32 n, Sort sort)
in z:\Builds\work\bcdbe6b8cc677a49\src\Lucene.Net.Core\Search\IndexSearcher.cs:line 346
   at Lucene.Net.Index.ThreadedIndexingAndSearchingTestCase.RunQuery(IndexSearcher s, Query
q) in z:\Builds\work\bcdbe6b8cc677a49\src\Lucene.Net.TestFramework\Index\ThreadedIndexingAndSearchingTestCase.cs:line
837
   at Lucene.Net.Index.ThreadedIndexingAndSearchingTestCase.SmokeTestSearcher(IndexSearcher
s) in z:\Builds\work\bcdbe6b8cc677a49\src\Lucene.Net.TestFramework\Index\ThreadedIndexingAndSearchingTestCase.cs:line
849
   at Lucene.Net.Index.ThreadedIndexingAndSearchingTestCase.ThreadAnonymousInnerClassHelper2.Run()
in z:\Builds\work\bcdbe6b8cc677a49\src\Lucene.Net.TestFramework\Index\ThreadedIndexingAndSearchingTestCase.cs:line
467
   --- End of inner exception stack trace ---
   at Lucene.Net.Index.ThreadedIndexingAndSearchingTestCase.ThreadAnonymousInnerClassHelper2.Run()
in z:\Builds\work\bcdbe6b8cc677a49\src\Lucene.Net.TestFramework\Index\ThreadedIndexingAndSearchingTestCase.cs:line
525
   at System.Threading.ThreadHelper.ThreadStart_Context(Object state)
   at System.Threading.ExecutionContext.RunInternal(ExecutionContext executionContext, ContextCallback
callback, Object state, Boolean preserveSyncCtx)
   at System.Threading.ExecutionContext.Run(ExecutionContext executionContext, ContextCallback
callback, Object state, Boolean preserveSyncCtx)
   at System.Threading.ExecutionContext.Run(ExecutionContext executionContext, ContextCallback
callback, Object state)
   at System.Threading.ThreadHelper.ThreadStart()
Lucene.Net.Tests.dll: Lucene.Net.Index.TestStoredFieldsFormat.BaseStoredFieldsFormatTestCase.TestConcurrentReads
(new) =================
Test(s) failed. System.InvalidOperationException : Expected 1 hit, got 0
   at Lucene.Net.Index.BaseStoredFieldsFormatTestCase.TestConcurrentReads() in z:\Builds\work\bcdbe6b8cc677a49\src\Lucene.Net.TestFramework\Index\BaseStoredFieldsFormatTestCase.cs:line
453
see all newly failed tests: http://teamcity.codebetter.com/viewLog.html?buildId=188141&buildTypeId=LuceneNet_LuceneNetNightly



Other failed tests details (only first 3 failures shown here)
==================================================================
Lucene.Net.Tests.dll: Lucene.Net.Codecs.Lucene41.TestBlockPostingsFormat2 =================
TearDown method failed. CheckIndex failed
   at Lucene.Net.Util.TestUtil.CheckIndex(Directory dir, Boolean crossCheckTermVectors) in
z:\Builds\work\bcdbe6b8cc677a49\src\Lucene.Net.TestFramework\Util\TestUtil.cs:line 257
   at Lucene.Net.Codecs.Lucene41.TestBlockPostingsFormat2.TearDown() in z:\Builds\work\bcdbe6b8cc677a49\src\Lucene.Net.Tests\core\Codecs\Lucene41\TestBlockPostingsFormat2.cs:line
65
Lucene.Net.Tests.dll: Lucene.Net.Codecs.Lucene41.TestBlockPostingsFormat3.Test =================
Test(s) failed. Test exceeded Timeout value of 20000ms

Lucene.Net.Tests.dll: Lucene.Net.Codecs.Lucene42.TestLucene42DocValuesFormat.BaseDocValuesFormatTestCase.TestVeryLargeButLegalSortedBytes
=================
Test(s) failed. System.ArgumentOutOfRangeException : Index was out of range. Must be non-negative
and less than the size of the collection.
Parameter name: index
   at System.ThrowHelper.ThrowArgumentOutOfRangeException()
   at Lucene.Net.Util.Fst.BytesStore.ReverseBytesReaderAnonymousInner.ReadByte() in z:\Builds\work\bcdbe6b8cc677a49\src\Lucene.Net.Core\Util\Fst\BytesStore.cs:line
534
   at Lucene.Net.Store.DataInput.ReadVLong() in z:\Builds\work\bcdbe6b8cc677a49\src\Lucene.Net.Core\Store\DataInput.cs:line
182
   at Lucene.Net.Util.Fst.FST`1.ReadUnpackedNodeTarget(BytesReader in) in z:\Builds\work\bcdbe6b8cc677a49\src\Lucene.Net.Core\Util\Fst\FST.cs:line
1003
   at Lucene.Net.Util.Fst.FST`1.ReadNextRealArc(Arc`1 arc, BytesReader in) in z:\Builds\work\bcdbe6b8cc677a49\src\Lucene.Net.Core\Util\Fst\FST.cs:line
1280
   at Lucene.Net.Util.Fst.FST`1.ReadFirstRealTargetArc(Int64 node, Arc`1 arc, BytesReader
in) in z:\Builds\work\bcdbe6b8cc677a49\src\Lucene.Net.Core\Util\Fst\FST.cs:line 1077
   at Lucene.Net.Util.Fst.NodeHash`1.Hash(Int64 node) in z:\Builds\work\bcdbe6b8cc677a49\src\Lucene.Net.Core\Util\Fst\NodeHash.cs:line
106
   at Lucene.Net.Util.Fst.NodeHash`1.AddNew(Int64 address) in z:\Builds\work\bcdbe6b8cc677a49\src\Lucene.Net.Core\Util\Fst\NodeHash.cs:line
167
   at Lucene.Net.Util.Fst.NodeHash`1.Rehash() in z:\Builds\work\bcdbe6b8cc677a49\src\Lucene.Net.Core\Util\Fst\NodeHash.cs:line
193
   at Lucene.Net.Util.Fst.NodeHash`1.Add(UnCompiledNode`1 nodeIn) in z:\Builds\work\bcdbe6b8cc677a49\src\Lucene.Net.Core\Util\Fst\NodeHash.cs:line
149
   at Lucene.Net.Util.Fst.Builder`1.CompileNode(UnCompiledNode`1 nodeIn, Int32 tailLength)
in z:\Builds\work\bcdbe6b8cc677a49\src\Lucene.Net.Core\Util\Fst\Builder.cs:line 218
   at Lucene.Net.Util.Fst.Builder`1.DoFreezeTail(Int32 prefixLenPlus1) in z:\Builds\work\bcdbe6b8cc677a49\src\Lucene.Net.Core\Util\Fst\Builder.cs:line
329
   at Lucene.Net.Util.Fst.Builder`1.Finish() in z:\Builds\work\bcdbe6b8cc677a49\src\Lucene.Net.Core\Util\Fst\Builder.cs:line
518
   at Lucene.Net.Codecs.Lucene42.Lucene42DocValuesConsumer.WriteFST(FieldInfo field, IEnumerable`1
values) in z:\Builds\work\bcdbe6b8cc677a49\src\Lucene.Net.TestFramework\Codecs\lucene42\Lucene42DocValuesConsumer.cs:line
299
   at Lucene.Net.Codecs.Lucene42.Lucene42DocValuesConsumer.AddSortedField(FieldInfo field,
IEnumerable`1 values, IEnumerable`1 docToOrd) in z:\Builds\work\bcdbe6b8cc677a49\src\Lucene.Net.TestFramework\Codecs\lucene42\Lucene42DocValuesConsumer.cs:line
348
   at Lucene.Net.Codecs.Perfield.PerFieldDocValuesFormat.FieldsWriter.AddSortedField(FieldInfo
field, IEnumerable`1 values, IEnumerable`1 docToOrd) in z:\Builds\work\bcdbe6b8cc677a49\src\Lucene.Net.Core\Codecs\Perfield\PerFieldDocValuesFormat.cs:line
122
   at Lucene.Net.Index.SortedDocValuesWriter.Flush(SegmentWriteState state, DocValuesConsumer
dvConsumer) in z:\Builds\work\bcdbe6b8cc677a49\src\Lucene.Net.Core\Index\SortedDocValuesWriter.cs:line
125
   at Lucene.Net.Index.DocValuesProcessor.Flush(SegmentWriteState state) in z:\Builds\work\bcdbe6b8cc677a49\src\Lucene.Net.Core\Index\DocValuesProcessor.cs:line
99
   at Lucene.Net.Index.TwoStoredFieldsConsumers.Flush(SegmentWriteState state) in z:\Builds\work\bcdbe6b8cc677a49\src\Lucene.Net.Core\Index\TwoStoredFieldsConsumers.cs:line
45
   at Lucene.Net.Index.DocFieldProcessor.Flush(SegmentWriteState state) in z:\Builds\work\bcdbe6b8cc677a49\src\Lucene.Net.Core\Index\DocFieldProcessor.cs:line
81
   at Lucene.Net.Index.DocumentsWriterPerThread.Flush() in z:\Builds\work\bcdbe6b8cc677a49\src\Lucene.Net.Core\Index\DocumentsWriterPerThread.cs:line
550
   at Lucene.Net.Index.DocumentsWriter.DoFlush(DocumentsWriterPerThread flushingDWPT) in z:\Builds\work\bcdbe6b8cc677a49\src\Lucene.Net.Core\Index\DocumentsWriter.cs:line
635
   at Lucene.Net.Index.DocumentsWriter.FlushAllThreads(IndexWriter indexWriter) in z:\Builds\work\bcdbe6b8cc677a49\src\Lucene.Net.Core\Index\DocumentsWriter.cs:line
769
   at Lucene.Net.Index.IndexWriter.DoFlush(Boolean applyAllDeletes) in z:\Builds\work\bcdbe6b8cc677a49\src\Lucene.Net.Core\Index\IndexWriter.cs:line
3882
   at Lucene.Net.Index.IndexWriter.CloseInternal(Boolean waitForMerges, Boolean doFlush) in
z:\Builds\work\bcdbe6b8cc677a49\src\Lucene.Net.Core\Index\IndexWriter.cs:line 1177
   at Lucene.Net.Index.IndexWriter.Dispose(Boolean waitForMerges) in z:\Builds\work\bcdbe6b8cc677a49\src\Lucene.Net.Core\Index\IndexWriter.cs:line
1102
   at Lucene.Net.Index.RandomIndexWriter.Dispose() in z:\Builds\work\bcdbe6b8cc677a49\src\Lucene.Net.TestFramework\Index\RandomIndexWriter.cs:line
499
   at Lucene.Net.Index.BaseDocValuesFormatTestCase.TestVeryLargeButLegalSortedBytes() in z:\Builds\work\bcdbe6b8cc677a49\src\Lucene.Net.TestFramework\Index\BaseDocValuesFormatTestCase.cs:line
1027
Changes included (3 changes)
====================================================
Change c83d8e80a78ca236c1c20197cdc03188aab139c3 by itamar (0 file):
Merge remote-tracking branch 'laimis/binarydocvalueswriter_fixes'


Change 5091a1d333b4ff1e6efe3339e4415c83b1301447 by itamar (5 files):
Cleanup


Change 07648a3b20ea9055bbae91cc5cf529c8fe1fc3f3 by laimis (1 file):
init bytesref on each iteration


see more information about changed files: http://teamcity.codebetter.com/viewLog.html?tab=buildChangesDiv&buildId=188141&buildTypeId=LuceneNet_LuceneNetNightly

============================================================================
Configure email notifications: http://teamcity.codebetter.com/profile.html?init=1&tab=userNotifications

Mime
  • Unnamed multipart/alternative (inline, None, 0 bytes)
View raw message