lucenenet-dev mailing list archives

Site index · List index
Message view « Date » · « Thread »
Top « Date » · « Thread »
From t.@codebetter.com
Subject [TeamCity, FAILED] Build Lucene.NET :: Lucene.NET Nightly [master] #400
Date Mon, 27 Apr 2015 09:38:31 GMT
Build Lucene.NET :: Lucene.NET Nightly [master] #400 failed (Tests failed: 98 (6 new), passed:
2673, ignored: 122; snapshot dependency failed: Lucene.NET :: Lucene.NET Core).
Agent: JetBrains-dotnet-agent01
Build results: http://teamcity.codebetter.com/viewLog.html?buildId=189434&buildTypeId=LuceneNet_LuceneNetNightly

Failed Tests Summary:
Newly failed tests (6 tests, alphabetically ordered)
==================================================================
Lucene.Net.Tests.dll: Lucene.Net.Codecs.Lucene40.TestLucene40StoredFieldsFormat.BaseStoredFieldsFormatTestCase.TestConcurrentReads
Lucene.Net.Tests.dll: Lucene.Net.Index.TestIndexWriter.TestThreadInterruptDeadlock
Lucene.Net.Tests.dll: Lucene.Net.Index.TestIndexWriter.TestTwoThreadsInterruptDeadlock
Lucene.Net.Tests.dll: Lucene.Net.Index.TestIndexWriterExceptions.TestExceptionDuringRollback
Lucene.Net.Tests.dll: Lucene.Net.Search.TestFieldCacheRewriteMethod.TestRegexpRandom2.TestRegexps
Lucene.Net.Tests.dll: Lucene.Net.Util.TestNumericUtils.TestRandomSplit

Other failed tests (92 tests, alphabetically ordered)
==================================================================
Lucene.Net.Tests.Facet.dll: Lucene.Net.Facet.Range.TestRangeFacetCounts.TestMixedRangeAndNonRangeTaxonomy
Lucene.Net.Tests.Facet.dll: Lucene.Net.Facet.SortedSet.TestSortedSetDocValuesFacets.TestRandom
Lucene.Net.Tests.Facet.dll: Lucene.Net.Facet.SortedSet.TestSortedSetDocValuesFacets.TestStaleState
Lucene.Net.Tests.Facet.dll: Lucene.Net.Facet.Taxonomy.Directory.TestAddTaxonomy.TestConcurrency
Lucene.Net.Tests.Facet.dll: Lucene.Net.Facet.Taxonomy.Directory.TestAddTaxonomy.TestSimple
Lucene.Net.Tests.Facet.dll: Lucene.Net.Facet.Taxonomy.Directory.TestConcurrentFacetedIndexing.TestConcurrency
Lucene.Net.Tests.Facet.dll: Lucene.Net.Facet.Taxonomy.Directory.TestDirectoryTaxonomyReader.TestFreshReadRecreatedTaxonomy
Lucene.Net.Tests.Facet.dll: Lucene.Net.Facet.Taxonomy.Directory.TestDirectoryTaxonomyReader.TestGetChildren
Lucene.Net.Tests.Facet.dll: Lucene.Net.Facet.Taxonomy.Directory.TestDirectoryTaxonomyReader.TestOpenIfChangedManySegments
Lucene.Net.Tests.Facet.dll: Lucene.Net.Facet.Taxonomy.Directory.TestDirectoryTaxonomyReader.TestOpenIfChangedMergedSegment
Lucene.Net.Tests.Facet.dll: Lucene.Net.Facet.Taxonomy.Directory.TestDirectoryTaxonomyReader.TestOpenIfChangedNoChangesButSegmentMerges
Lucene.Net.Tests.Facet.dll: Lucene.Net.Facet.Taxonomy.Directory.TestDirectoryTaxonomyReader.TestOpenIfChangedReadRecreatedTaxonomy
Lucene.Net.Tests.Facet.dll: Lucene.Net.Facet.Taxonomy.Directory.TestDirectoryTaxonomyWriter.TestConcurrency
Lucene.Net.Tests.Facet.dll: Lucene.Net.Facet.Taxonomy.Directory.TestDirectoryTaxonomyWriter.TestHugeLabel
Lucene.Net.Tests.Facet.dll: Lucene.Net.Facet.Taxonomy.TestLRUHashMap.TestLru
Lucene.Net.Tests.Facet.dll: Lucene.Net.Facet.Taxonomy.TestSearcherTaxonomyManager.TestReplaceTaxonomyNrt
Lucene.Net.Tests.Facet.dll: Lucene.Net.Facet.Taxonomy.TestTaxonomyCombined.TestChildrenArrays
Lucene.Net.Tests.Facet.dll: Lucene.Net.Facet.Taxonomy.TestTaxonomyCombined.TestChildrenArraysGrowth
Lucene.Net.Tests.Facet.dll: Lucene.Net.Facet.Taxonomy.TestTaxonomyCombined.TestChildrenArraysInvariants
Lucene.Net.Tests.Facet.dll: Lucene.Net.Facet.Taxonomy.TestTaxonomyCombined.TestReaderBasic
Lucene.Net.Tests.Facet.dll: Lucene.Net.Facet.Taxonomy.TestTaxonomyCombined.TestReaderParent
Lucene.Net.Tests.Facet.dll: Lucene.Net.Facet.Taxonomy.TestTaxonomyCombined.TestSeparateReaderAndWriter
Lucene.Net.Tests.Facet.dll: Lucene.Net.Facet.Taxonomy.TestTaxonomyCombined.TestWriter
Lucene.Net.Tests.Facet.dll: Lucene.Net.Facet.Taxonomy.TestTaxonomyCombined.TestWriterCheckPaths
Lucene.Net.Tests.Facet.dll: Lucene.Net.Facet.Taxonomy.TestTaxonomyCombined.TestWriterCheckPaths2
Lucene.Net.Tests.Facet.dll: Lucene.Net.Facet.Taxonomy.TestTaxonomyCombined.TestWriterParent1
Lucene.Net.Tests.Facet.dll: Lucene.Net.Facet.Taxonomy.TestTaxonomyCombined.TestWriterParent2
Lucene.Net.Tests.Facet.dll: Lucene.Net.Facet.Taxonomy.TestTaxonomyCombined.TestWriterSimpler
Lucene.Net.Tests.Facet.dll: Lucene.Net.Facet.Taxonomy.TestTaxonomyCombined.TestWriterTwice
Lucene.Net.Tests.Facet.dll: Lucene.Net.Facet.Taxonomy.TestTaxonomyCombined.TestWriterTwice2
Lucene.Net.Tests.Facet.dll: Lucene.Net.Facet.Taxonomy.TestTaxonomyCombined.TestWriterTwice3
Lucene.Net.Tests.Facet.dll: Lucene.Net.Facet.Taxonomy.TestTaxonomyFacetAssociations.TestFloatSumAssociation
Lucene.Net.Tests.Facet.dll: Lucene.Net.Facet.Taxonomy.TestTaxonomyFacetAssociations.TestIntAndFloatAssocation
Lucene.Net.Tests.Facet.dll: Lucene.Net.Facet.Taxonomy.TestTaxonomyFacetAssociations.TestIntSumAssociation
Lucene.Net.Tests.Facet.dll: Lucene.Net.Facet.Taxonomy.TestTaxonomyFacetAssociations.TestIntSumAssociationDrillDown
Lucene.Net.Tests.Facet.dll: Lucene.Net.Facet.Taxonomy.TestTaxonomyFacetCounts.TestBasic
Lucene.Net.Tests.Facet.dll: Lucene.Net.Facet.Taxonomy.TestTaxonomyFacetCounts.TestChildCount
Lucene.Net.Tests.Facet.dll: Lucene.Net.Facet.Taxonomy.TestTaxonomyFacetCounts.TestCountRoot
Lucene.Net.Tests.Facet.dll: Lucene.Net.Facet.Taxonomy.TestTaxonomyFacetCounts.TestLabelWithDelimiter
Lucene.Net.Tests.Facet.dll: Lucene.Net.Facet.Taxonomy.TestTaxonomyFacetCounts.TestManyFacetsInOneDocument
Lucene.Net.Tests.Facet.dll: Lucene.Net.Facet.Taxonomy.TestTaxonomyFacetCounts.TestRandom
Lucene.Net.Tests.Facet.dll: Lucene.Net.Facet.Taxonomy.TestTaxonomyFacetCounts.TestSegmentsWithoutCategoriesOrResults
Lucene.Net.Tests.Facet.dll: Lucene.Net.Facet.Taxonomy.TestTaxonomyFacetCounts.TestSeparateIndexedFields
Lucene.Net.Tests.Facet.dll: Lucene.Net.Facet.Taxonomy.TestTaxonomyFacetCounts.TestSparseFacets
Lucene.Net.Tests.Facet.dll: Lucene.Net.Facet.Taxonomy.TestTaxonomyFacetCounts2
Lucene.Net.Tests.Facet.dll: Lucene.Net.Facet.Taxonomy.TestTaxonomyFacetCounts2.TestAllCounts
Lucene.Net.Tests.Facet.dll: Lucene.Net.Facet.Taxonomy.TestTaxonomyFacetCounts2.TestBigNumResults
Lucene.Net.Tests.Facet.dll: Lucene.Net.Facet.Taxonomy.TestTaxonomyFacetCounts2.TestDifferentNumResults
Lucene.Net.Tests.Facet.dll: Lucene.Net.Facet.Taxonomy.TestTaxonomyFacetCounts2.TestNoParents
Lucene.Net.Tests.Facet.dll: Lucene.Net.Facet.Taxonomy.TestTaxonomyFacetSumValueSource.TestBasic
Lucene.Net.Tests.Facet.dll: Lucene.Net.Facet.Taxonomy.TestTaxonomyFacetSumValueSource.TestCountAndSumScore
Lucene.Net.Tests.Facet.dll: Lucene.Net.Facet.Taxonomy.TestTaxonomyFacetSumValueSource.TestNoScore
Lucene.Net.Tests.Facet.dll: Lucene.Net.Facet.Taxonomy.TestTaxonomyFacetSumValueSource.TestRandom
Lucene.Net.Tests.Facet.dll: Lucene.Net.Facet.Taxonomy.TestTaxonomyFacetSumValueSource.TestRollupValues
Lucene.Net.Tests.Facet.dll: Lucene.Net.Facet.Taxonomy.TestTaxonomyFacetSumValueSource.TestSparseFacets
Lucene.Net.Tests.Facet.dll: Lucene.Net.Facet.Taxonomy.TestTaxonomyFacetSumValueSource.TestSumScoreAggregator
Lucene.Net.Tests.Facet.dll: Lucene.Net.Facet.Taxonomy.TestTaxonomyFacetSumValueSource.TestWithScore
Lucene.Net.Tests.Facet.dll: Lucene.Net.Facet.TestDrillSideways.TestBasic
Lucene.Net.Tests.Facet.dll: Lucene.Net.Facet.TestDrillSideways.TestMultipleRequestsPerDim
Lucene.Net.Tests.Facet.dll: Lucene.Net.Facet.TestDrillSideways.TestRandom
Lucene.Net.Tests.Facet.dll: Lucene.Net.Facet.TestDrillSideways.TestSometimesInvalidDrillDown
Lucene.Net.Tests.Facet.dll: Lucene.Net.Facet.TestMultipleIndexFields.TestCustom
Lucene.Net.Tests.Facet.dll: Lucene.Net.Facet.TestMultipleIndexFields.TestDefault
Lucene.Net.Tests.Facet.dll: Lucene.Net.Facet.TestMultipleIndexFields.TestDifferentFieldsAndText
Lucene.Net.Tests.Facet.dll: Lucene.Net.Facet.TestMultipleIndexFields.TestSomeSameSomeDifferent
Lucene.Net.Tests.Facet.dll: Lucene.Net.Facet.TestMultipleIndexFields.TestTwoCustomsSameField
Lucene.Net.Tests.Facet.dll: Lucene.Net.Facet.TestRandomSamplingFacetsCollector.TestRandomSampling
Lucene.Net.Tests.Queries.dll: Lucene.Net.Tests.Queries.CommonTermsQueryTest.TestEqualsHashCode
Lucene.Net.Tests.dll: Lucene.Net.Codecs.Lucene41.TestBlockPostingsFormat2
Lucene.Net.Tests.dll: Lucene.Net.Codecs.Lucene41.TestBlockPostingsFormat3.Test
Lucene.Net.Tests.dll: Lucene.Net.Index.TestAtomicUpdate.TestAtomicUpdates
Lucene.Net.Tests.dll: Lucene.Net.Index.TestDirectoryReader.TestNoDir
Lucene.Net.Tests.dll: Lucene.Net.Index.TestDocumentsWriterStallControl.TestSimpleStall
Lucene.Net.Tests.dll: Lucene.Net.Index.TestDuelingCodecs.TestEquals
Lucene.Net.Tests.dll: Lucene.Net.Index.TestIndexWriterExceptions.TestExceptionOnMergeInit
Lucene.Net.Tests.dll: Lucene.Net.Index.TestIndexWriterForceMerge.TestPartialMerge
Lucene.Net.Tests.dll: Lucene.Net.Index.TestIndexWriterReader.TestDuringAddIndexes
Lucene.Net.Tests.dll: Lucene.Net.Index.TestStressIndexing.TestStressIndexAndSearching
Lucene.Net.Tests.dll: Lucene.Net.Index.TestTermdocPerf.TestTermDocPerf
Lucene.Net.Tests.dll: Lucene.Net.Search.TestFuzzyQuery.TestTieBreaker
Lucene.Net.Tests.dll: Lucene.Net.Search.TestSimpleExplanations.TestDMQ8
Lucene.Net.Tests.dll: Lucene.Net.Search.TestTermVectors
Lucene.Net.Tests.dll: Lucene.Net.Search.TestTermVectors.TestMixedVectrosVectors
Lucene.Net.Tests.dll: Lucene.Net.Search.TestTopDocsMerge.TestSort_2
Lucene.Net.Tests.dll: Lucene.Net.Store.TestBufferedIndexInput.TestSetBufferSize
Lucene.Net.Tests.dll: Lucene.Net.Store.TestDirectory.TestDontCreate
Lucene.Net.Tests.dll: Lucene.Net.Store.TestFileSwitchDirectory.TestNoDir
Lucene.Net.Tests.dll: Lucene.Net.Tests.TestAssertions.TestTokenStreams
Lucene.Net.Tests.dll: Lucene.Net.Util.Packed.TestEliasFanoSequence.TestMonotoneSequencesLonger
Lucene.Net.Tests.dll: Lucene.Net.Util.Packed.TestEliasFanoSequence.TestStrictMonotoneSequencesLonger
Lucene.Net.Tests.dll: Lucene.Net.Util.TestOpenBitSet.BaseDocIdSetTestCase`1.TestAgainstBitSet
Lucene.Net.Tests.dll: Lucene.Net.Util.TestPagedBytes.TestOverflow



Newly failed tests details (only first 3 failures shown here)
==================================================================
Lucene.Net.Tests.dll: Lucene.Net.Codecs.Lucene40.TestLucene40StoredFieldsFormat.BaseStoredFieldsFormatTestCase.TestConcurrentReads
(new) =================
Test(s) failed. System.InvalidOperationException : Expected 1 hit, got 0
   at Lucene.Net.Index.BaseStoredFieldsFormatTestCase.TestConcurrentReads() in z:\Builds\work\bcdbe6b8cc677a49\src\Lucene.Net.TestFramework\Index\BaseStoredFieldsFormatTestCase.cs:line
453
Lucene.Net.Tests.dll: Lucene.Net.Index.TestIndexWriter.TestThreadInterruptDeadlock (new) =================
Test(s) failed.   Expected: False
  But was:  True

   at NUnit.Framework.Assert.That(Object actual, IResolveConstraint expression, String message,
Object[] args)
   at NUnit.Framework.Assert.IsFalse(Boolean condition)
   at Lucene.Net.Index.TestIndexWriter.TestThreadInterruptDeadlock() in z:\Builds\work\bcdbe6b8cc677a49\src\Lucene.Net.Tests\core\Index\TestIndexWriter.cs:line
1412
------- Stderr: -------
TEST: got interrupt
   at Lucene.Net.Store.SlowClosingMockIndexInputWrapper.Dispose() in z:\Builds\work\bcdbe6b8cc677a49\src\Lucene.Net.TestFramework\Store\SlowClosingMockIndexInputWrapper.cs:line
43
   at Lucene.Net.Codecs.BlockTreeTermsReader..ctor(Directory dir, FieldInfos fieldInfos, SegmentInfo
info, PostingsReaderBase postingsReader, IOContext ioContext, String segmentSuffix, Int32
indexDivisor) in z:\Builds\work\bcdbe6b8cc677a49\src\Lucene.Net.Core\Codecs\BlockTreeTermsReader.cs:line
208
   at Lucene.Net.Codecs.Lucene41.Lucene41PostingsFormat.FieldsProducer(SegmentReadState state)
in z:\Builds\work\bcdbe6b8cc677a49\src\Lucene.Net.Core\Codecs\Lucene41\Lucene41PostingsFormat.cs:line
432
   at Lucene.Net.Codecs.Perfield.PerFieldPostingsFormat.FieldsReader..ctor(PerFieldPostingsFormat
outerInstance, SegmentReadState readState) in z:\Builds\work\bcdbe6b8cc677a49\src\Lucene.Net.Core\Codecs\Perfield\PerFieldPostingsFormat.cs:line
216
   at Lucene.Net.Codecs.Perfield.PerFieldPostingsFormat.FieldsProducer(SegmentReadState state)
in z:\Builds\work\bcdbe6b8cc677a49\src\Lucene.Net.Core\Codecs\Perfield\PerFieldPostingsFormat.cs:line
277
   at Lucene.Net.Index.SegmentCoreReaders..ctor(SegmentReader owner, Directory dir, SegmentCommitInfo
si, IOContext context, Int32 termsIndexDivisor) in z:\Builds\work\bcdbe6b8cc677a49\src\Lucene.Net.Core\Index\SegmentCoreReaders.cs:line
151
   at Lucene.Net.Index.SegmentReader..ctor(SegmentCommitInfo si, Int32 termInfosIndexDivisor,
IOContext context) in z:\Builds\work\bcdbe6b8cc677a49\src\Lucene.Net.Core\Index\SegmentReader.cs:line
111
   at Lucene.Net.Index.ReadersAndUpdates.GetReader(IOContext context) in z:\Builds\work\bcdbe6b8cc677a49\src\Lucene.Net.Core\Index\ReadersAndUpdates.cs:line
167
   at Lucene.Net.Index.BufferedUpdatesStream.ApplyDeletesAndUpdates(ReaderPool readerPool,
IList`1 infos) in z:\Builds\work\bcdbe6b8cc677a49\src\Lucene.Net.Core\Index\BufferedUpdatesStream.cs:line
328
   at Lucene.Net.Index.IndexWriter.ApplyAllDeletesAndUpdates() in z:\Builds\work\bcdbe6b8cc677a49\src\Lucene.Net.Core\Index\IndexWriter.cs:line
3946
   at Lucene.Net.Index.IndexWriter.MaybeApplyDeletes(Boolean applyAllDeletes) in z:\Builds\work\bcdbe6b8cc677a49\src\Lucene.Net.Core\Index\IndexWriter.cs:line
3931
   at Lucene.Net.Index.IndexWriter.PrepareCommitInternal() in z:\Builds\work\bcdbe6b8cc677a49\src\Lucene.Net.Core\Index\IndexWriter.cs:line
3587
   at Lucene.Net.Index.IndexWriter.CommitInternal() in z:\Builds\work\bcdbe6b8cc677a49\src\Lucene.Net.Core\Index\IndexWriter.cs:line
3761
   at Lucene.Net.Index.TestIndexWriter.IndexerThreadInterrupt.Run() in z:\Builds\work\bcdbe6b8cc677a49\src\Lucene.Net.Tests\core\Index\TestIndexWriter.cs:line
1270
TEST: got interrupt
   at Lucene.Net.Store.SlowOpeningMockIndexInputWrapper..ctor(MockDirectoryWrapper dir, String
name, IndexInput delegate) in z:\Builds\work\bcdbe6b8cc677a49\src\Lucene.Net.TestFramework\Store\SlowOpeningMockIndexInputWrapper.cs:line
45
   at Lucene.Net.Store.MockDirectoryWrapper.OpenInput(String name, IOContext context) in z:\Builds\work\bcdbe6b8cc677a49\src\Lucene.Net.TestFramework\Store\MockDirectoryWrapper.cs:line
805
   at Lucene.Net.Store.FilterDirectory.OpenChecksumInput(String name, IOContext context) in
z:\Builds\work\bcdbe6b8cc677a49\src\Lucene.Net.Core\Store\FilterDirectory.cs:line 132
   at Lucene.Net.Codecs.Lucene46.Lucene46FieldInfosReader.Read(Directory directory, String
segmentName, String segmentSuffix, IOContext context) in z:\Builds\work\bcdbe6b8cc677a49\src\Lucene.Net.Core\Codecs\Lucene46\Lucene46FieldInfosReader.cs:line
50
   at Lucene.Net.Index.SegmentReader.ReadFieldInfos(SegmentCommitInfo info) in z:\Builds\work\bcdbe6b8cc677a49\src\Lucene.Net.Core\Index\SegmentReader.cs:line
258
   at Lucene.Net.Index.IndexWriter.get_FieldNumberMap() in z:\Builds\work\bcdbe6b8cc677a49\src\Lucene.Net.Core\Index\IndexWriter.cs:line
979
   at Lucene.Net.Index.IndexWriter..ctor(Directory d, IndexWriterConfig conf) in z:\Builds\work\bcdbe6b8cc677a49\src\Lucene.Net.Core\Index\IndexWriter.cs:line
923
   at Lucene.Net.Index.TestIndexWriter.IndexerThreadInterrupt.Run() in z:\Builds\work\bcdbe6b8cc677a49\src\Lucene.Net.Tests\core\Index\TestIndexWriter.cs:line
1201
FAILED; unexpected exception
   at Lucene.Net.Util.IOUtils.ReThrowUnchecked(Exception th) in z:\Builds\work\bcdbe6b8cc677a49\src\Lucene.Net.Core\Util\IOUtils.cs:line
435
   at Lucene.Net.Util.IOUtils.ReThrow(Exception th) in z:\Builds\work\bcdbe6b8cc677a49\src\Lucene.Net.Core\Util\IOUtils.cs:line
418
   at Lucene.Net.Index.IndexWriter.HandleMergeException(Exception t, OneMerge merge) in z:\Builds\work\bcdbe6b8cc677a49\src\Lucene.Net.Core\Index\IndexWriter.cs:line
4526
   at Lucene.Net.Index.IndexWriter.Merge(OneMerge merge) in z:\Builds\work\bcdbe6b8cc677a49\src\Lucene.Net.Core\Index\IndexWriter.cs:line
4564
   at Lucene.Net.Index.SerialMergeScheduler.Merge(IndexWriter writer, MergeTrigger trigger,
Boolean newMergesFound) in z:\Builds\work\bcdbe6b8cc677a49\src\Lucene.Net.Core\Index\SerialMergeScheduler.cs:line
48
   at Lucene.Net.Index.IndexWriter.MaybeMerge(MergeTrigger trigger, Int32 maxNumSegments)
in z:\Builds\work\bcdbe6b8cc677a49\src\Lucene.Net.Core\Index\IndexWriter.cs:line 2384
   at Lucene.Net.Index.IndexWriter.ForceMerge(Int32 maxNumSegments, Boolean doWait) in z:\Builds\work\bcdbe6b8cc677a49\src\Lucene.Net.Core\Index\IndexWriter.cs:line
2156
   at Lucene.Net.Index.IndexWriter.ForceMerge(Int32 maxNumSegments) in z:\Builds\work\bcdbe6b8cc677a49\src\Lucene.Net.Core\Index\IndexWriter.cs:line
2100
   at Lucene.Net.Index.TestIndexWriter.IndexerThreadInterrupt.Run() in z:\Builds\work\bcdbe6b8cc677a49\src\Lucene.Net.Tests\core\Index\TestIndexWriter.cs:line
1274
Unhandled exception in remote appdomain: System.Exception: System.Exception: MockDirectoryWrapper:
cannot close: there are still open locks: write.lock
   at Lucene.Net.Store.MockDirectoryWrapper.Dispose() in z:\Builds\work\bcdbe6b8cc677a49\src\Lucene.Net.TestFramework\Store\MockDirectoryWrapper.cs:line
923
   at Lucene.Net.Util.IOUtils.Close(IDisposable[] objects) in z:\Builds\work\bcdbe6b8cc677a49\src\Lucene.Net.Core\Util\IOUtils.cs:line
163 ---> System.Exception: MockDirectoryWrapper: cannot close: there are still open locks:
write.lock
   at Lucene.Net.Store.MockDirectoryWrapper.Dispose() in z:\Builds\work\bcdbe6b8cc677a49\src\Lucene.Net.TestFramework\Store\MockDirectoryWrapper.cs:line
923
   at Lucene.Net.Util.IOUtils.Close(IDisposable[] objects) in z:\Builds\work\bcdbe6b8cc677a49\src\Lucene.Net.Core\Util\IOUtils.cs:line
163
   --- End of inner exception stack trace ---
   at Lucene.Net.Util.IOUtils.ReThrowUnchecked(Exception th) in z:\Builds\work\bcdbe6b8cc677a49\src\Lucene.Net.Core\Util\IOUtils.cs:line
435
   at Lucene.Net.Util.IOUtils.ReThrow(Exception th) in z:\Builds\work\bcdbe6b8cc677a49\src\Lucene.Net.Core\Util\IOUtils.cs:line
418
   at Lucene.Net.Util.IOUtils.Close(IDisposable[] objects) in z:\Builds\work\bcdbe6b8cc677a49\src\Lucene.Net.Core\Util\IOUtils.cs:line
176
   at Lucene.Net.Index.TestIndexWriter.IndexerThreadInterrupt.Run() in z:\Builds\work\bcdbe6b8cc677a49\src\Lucene.Net.Tests\core\Index\TestIndexWriter.cs:line
1362
   at System.Threading.ThreadHelper.ThreadStart_Context(Object state)
   at System.Threading.ExecutionContext.RunInternal(ExecutionContext executionContext, ContextCallback
callback, Object state, Boolean preserveSyncCtx)
   at System.Threading.ExecutionContext.Run(ExecutionContext executionContext, ContextCallback
callback, Object state, Boolean preserveSyncCtx)
   at System.Threading.ExecutionContext.Run(ExecutionContext executionContext, ContextCallback
callback, Object state)
   at System.Threading.ThreadHelper.ThreadStart()
Lucene.Net.Tests.dll: Lucene.Net.Index.TestIndexWriter.TestTwoThreadsInterruptDeadlock (new)
=================
Test(s) failed.   Expected: False
  But was:  True

   at NUnit.Framework.Assert.That(Object actual, IResolveConstraint expression, String message,
Object[] args)
   at NUnit.Framework.Assert.IsFalse(Boolean condition)
   at Lucene.Net.Index.TestIndexWriter.TestTwoThreadsInterruptDeadlock() in z:\Builds\work\bcdbe6b8cc677a49\src\Lucene.Net.Tests\core\Index\TestIndexWriter.cs:line
1459
------- Stderr: -------
TEST: got interrupt
   at System.Threading.Monitor.ReliableEnter(Object obj, Boolean& lockTaken)
   at Lucene.Net.Store.MockDirectoryWrapper.CreateOutput(String name, IOContext context) in
z:\Builds\work\bcdbe6b8cc677a49\src\Lucene.Net.TestFramework\Store\MockDirectoryWrapper.cs:line
0
   at Lucene.Net.Store.TrackingDirectoryWrapper.CreateOutput(String name, IOContext context)
in z:\Builds\work\bcdbe6b8cc677a49\src\Lucene.Net.Core\Store\TrackingDirectoryWrapper.cs:line
44
   at Lucene.Net.Codecs.Compressing.CompressingStoredFieldsWriter..ctor(Directory directory,
SegmentInfo si, String segmentSuffix, IOContext context, String formatName, CompressionMode
compressionMode, Int32 chunkSize) in z:\Builds\work\bcdbe6b8cc677a49\src\Lucene.Net.Core\Codecs\Compressing\CompressingStoredFieldsWriter.cs:line
91
   at Lucene.Net.Codecs.Compressing.CompressingStoredFieldsFormat.FieldsWriter(Directory directory,
SegmentInfo si, IOContext context) in z:\Builds\work\bcdbe6b8cc677a49\src\Lucene.Net.Core\Codecs\Compressing\CompressingStoredFieldsFormat.cs:line
108
   at Lucene.Net.Index.StoredFieldsProcessor.InitFieldsWriter(IOContext context) in z:\Builds\work\bcdbe6b8cc677a49\src\Lucene.Net.Core\Index\StoredFieldsProcessor.cs:line
105
   at Lucene.Net.Index.StoredFieldsProcessor.FinishDocument() in z:\Builds\work\bcdbe6b8cc677a49\src\Lucene.Net.Core\Index\StoredFieldsProcessor.cs:line
141
   at Lucene.Net.Index.TwoStoredFieldsConsumers.FinishDocument() in z:\Builds\work\bcdbe6b8cc677a49\src\Lucene.Net.Core\Index\TwoStoredFieldsConsumers.cs:line
74
   at Lucene.Net.Index.DocFieldProcessor.FinishDocument() in z:\Builds\work\bcdbe6b8cc677a49\src\Lucene.Net.Core\Index\DocFieldProcessor.cs:line
301
   at Lucene.Net.Index.DocumentsWriterPerThread.UpdateDocument(IEnumerable`1 doc, Analyzer
analyzer, Term delTerm) in z:\Builds\work\bcdbe6b8cc677a49\src\Lucene.Net.Core\Index\DocumentsWriterPerThread.cs:line
314
   at Lucene.Net.Index.DocumentsWriter.UpdateDocument(IEnumerable`1 doc, Analyzer analyzer,
Term delTerm) in z:\Builds\work\bcdbe6b8cc677a49\src\Lucene.Net.Core\Index\DocumentsWriter.cs:line
574
   at Lucene.Net.Index.IndexWriter.UpdateDocument(Term term, IEnumerable`1 doc, Analyzer analyzer)
in z:\Builds\work\bcdbe6b8cc677a49\src\Lucene.Net.Core\Index\IndexWriter.cs:line 1831
   at Lucene.Net.Index.IndexWriter.UpdateDocument(Term term, IEnumerable`1 doc) in z:\Builds\work\bcdbe6b8cc677a49\src\Lucene.Net.Core\Index\IndexWriter.cs:line
1803
   at Lucene.Net.Index.TestIndexWriter.IndexerThreadInterrupt.Run() in z:\Builds\work\bcdbe6b8cc677a49\src\Lucene.Net.Tests\core\Index\TestIndexWriter.cs:line
1245
Unhandled exception in remote appdomain: NUnit.Framework.AssertionException:   Expected: True
  But was:  False

   at NUnit.Framework.Assert.That(Object actual, IResolveConstraint expression, String message,
Object[] args)
   at NUnit.Framework.Assert.IsTrue(Boolean condition)
   at Lucene.Net.Index.TestIndexWriter.IndexerThreadInterrupt.Run() in z:\Builds\work\bcdbe6b8cc677a49\src\Lucene.Net.Tests\core\Index\TestIndexWriter.cs:line
1302
   at System.Threading.ThreadHelper.ThreadStart_Context(Object state)
   at System.Threading.ExecutionContext.RunInternal(ExecutionContext executionContext, ContextCallback
callback, Object state, Boolean preserveSyncCtx)
   at System.Threading.ExecutionContext.Run(ExecutionContext executionContext, ContextCallback
callback, Object state, Boolean preserveSyncCtx)
   at System.Threading.ExecutionContext.Run(ExecutionContext executionContext, ContextCallback
callback, Object state)
   at System.Threading.ThreadHelper.ThreadStart()
FAILED; unexpected exception
   at Lucene.Net.Util.IOUtils.ReThrowUnchecked(Exception th) in z:\Builds\work\bcdbe6b8cc677a49\src\Lucene.Net.Core\Util\IOUtils.cs:line
435
   at Lucene.Net.Util.IOUtils.ReThrow(Exception th) in z:\Builds\work\bcdbe6b8cc677a49\src\Lucene.Net.Core\Util\IOUtils.cs:line
418
   at Lucene.Net.Index.IndexWriter.ReaderPool.DropAll(Boolean doSave) in z:\Builds\work\bcdbe6b8cc677a49\src\Lucene.Net.Core\Index\IndexWriter.cs:line
656
   at Lucene.Net.Index.IndexWriter.DeleteAll() in z:\Builds\work\bcdbe6b8cc677a49\src\Lucene.Net.Core\Index\IndexWriter.cs:line
2708
   at Lucene.Net.Index.TestIndexWriter.IndexerThreadInterrupt.Run() in z:\Builds\work\bcdbe6b8cc677a49\src\Lucene.Net.Tests\core\Index\TestIndexWriter.cs:line
1241
Unhandled exception in remote appdomain: System.Exception: System.Exception: MockDirectoryWrapper:
cannot close: there are still open locks: write.lock
   at Lucene.Net.Store.MockDirectoryWrapper.Dispose() in z:\Builds\work\bcdbe6b8cc677a49\src\Lucene.Net.TestFramework\Store\MockDirectoryWrapper.cs:line
923
   at Lucene.Net.Util.IOUtils.Close(IDisposable[] objects) in z:\Builds\work\bcdbe6b8cc677a49\src\Lucene.Net.Core\Util\IOUtils.cs:line
163 ---> System.Exception: MockDirectoryWrapper: cannot close: there are still open locks:
write.lock
   at Lucene.Net.Store.MockDirectoryWrapper.Dispose() in z:\Builds\work\bcdbe6b8cc677a49\src\Lucene.Net.TestFramework\Store\MockDirectoryWrapper.cs:line
923
   at Lucene.Net.Util.IOUtils.Close(IDisposable[] objects) in z:\Builds\work\bcdbe6b8cc677a49\src\Lucene.Net.Core\Util\IOUtils.cs:line
163
   --- End of inner exception stack trace ---
   at Lucene.Net.Util.IOUtils.ReThrowUnchecked(Exception th) in z:\Builds\work\bcdbe6b8cc677a49\src\Lucene.Net.Core\Util\IOUtils.cs:line
435
   at Lucene.Net.Util.IOUtils.ReThrow(Exception th) in z:\Builds\work\bcdbe6b8cc677a49\src\Lucene.Net.Core\Util\IOUtils.cs:line
418
   at Lucene.Net.Util.IOUtils.Close(IDisposable[] objects) in z:\Builds\work\bcdbe6b8cc677a49\src\Lucene.Net.Core\Util\IOUtils.cs:line
176
   at Lucene.Net.Index.TestIndexWriter.IndexerThreadInterrupt.Run() in z:\Builds\work\bcdbe6b8cc677a49\src\Lucene.Net.Tests\core\Index\TestIndexWriter.cs:line
1362
   at System.Threading.ThreadHelper.ThreadStart_Context(Object state)
   at System.Threading.ExecutionContext.RunInternal(ExecutionContext executionContext, ContextCallback
callback, Object state, Boolean preserveSyncCtx)
   at System.Threading.ExecutionContext.Run(ExecutionContext executionContext, ContextCallback
callback, Object state, Boolean preserveSyncCtx)
   at System.Threading.ExecutionContext.Run(ExecutionContext executionContext, ContextCallback
callback, Object state)
   at System.Threading.ThreadHelper.ThreadStart()
see all newly failed tests: http://teamcity.codebetter.com/viewLog.html?buildId=189434&buildTypeId=LuceneNet_LuceneNetNightly



Other failed tests details (only first 3 failures shown here)
==================================================================
Lucene.Net.Tests.dll: Lucene.Net.Codecs.Lucene41.TestBlockPostingsFormat2 =================
TearDown method failed. CheckIndex failed
   at Lucene.Net.Util.TestUtil.CheckIndex(Directory dir, Boolean crossCheckTermVectors) in
z:\Builds\work\bcdbe6b8cc677a49\src\Lucene.Net.TestFramework\Util\TestUtil.cs:line 257
   at Lucene.Net.Codecs.Lucene41.TestBlockPostingsFormat2.TearDown() in z:\Builds\work\bcdbe6b8cc677a49\src\Lucene.Net.Tests\core\Codecs\Lucene41\TestBlockPostingsFormat2.cs:line
65
Lucene.Net.Tests.dll: Lucene.Net.Codecs.Lucene41.TestBlockPostingsFormat3.Test =================
Test(s) failed. Test exceeded Timeout value of 20000ms

Lucene.Net.Tests.dll: Lucene.Net.Index.TestAtomicUpdate.TestAtomicUpdates =================
Test(s) failed. Test exceeded Timeout value of 20000ms

Changes included (2 changes)
====================================================
Change b692fc0d8156517b7625a37be7ffa3dce2a1c050 by laimis (1 file):
use CompareOrdinal vs CompareTo


Change 38139379ba44e582b014fe8a5817779fa112be0a by laimis (3 files):
make sure to invoke appropriate CompareValues via FieldComparator


see more information about changed files: http://teamcity.codebetter.com/viewLog.html?tab=buildChangesDiv&buildId=189434&buildTypeId=LuceneNet_LuceneNetNightly

============================================================================
Configure email notifications: http://teamcity.codebetter.com/profile.html?init=1&tab=userNotifications

Mime
  • Unnamed multipart/alternative (inline, None, 0 bytes)
View raw message