lucenenet-dev mailing list archives

Site index · List index
Message view « Date » · « Thread »
Top « Date » · « Thread »
From t.@codebetter.com
Subject [TeamCity, FAILED] Build Lucene.NET :: Lucene.NET Nightly [master] #346
Date Wed, 04 Mar 2015 10:35:30 GMT
Build Lucene.NET :: Lucene.NET Nightly [master] #346 failed (Tests failed: 129 (9 new), passed:
2641, ignored: 122; snapshot dependency failed: Lucene.NET :: Lucene.NET Core).
Agent: JetBrains-dotnet-agent01
Build results: http://teamcity.codebetter.com/viewLog.html?buildId=184907&buildTypeId=LuceneNet_LuceneNetNightly

Failed Tests Summary:
Newly failed tests (9 tests, alphabetically ordered)
==================================================================
Lucene.Net.Tests.dll: Lucene.Net.Index.TestBagOfPostings.Test
Lucene.Net.Tests.dll: Lucene.Net.Index.TestIndexWriter.TestThreadInterruptDeadlock
Lucene.Net.Tests.dll: Lucene.Net.Index.TestIndexWriter.TestTwoThreadsInterruptDeadlock
Lucene.Net.Tests.dll: Lucene.Net.Index.TestIndexWriterExceptions.TestExceptionDuringRollback
Lucene.Net.Tests.dll: Lucene.Net.Index.TestStoredFieldsFormat.BaseStoredFieldsFormatTestCase.TestConcurrentReads
Lucene.Net.Tests.dll: Lucene.Net.Search.TestBoolean2.TestQueries01
Lucene.Net.Tests.dll: Lucene.Net.Util.Automaton.TestUTF32ToUTF8.TestRandomRegexes
Lucene.Net.Tests.dll: Lucene.Net.Util.TestFixedBitSet.BaseDocIdSetTestCase`1.TestAgainstBitSet
Lucene.Net.Tests.dll: Lucene.Net.Util.TestOpenBitSet.TestSmall

Other failed tests (120 tests, alphabetically ordered, only first 100 shown)
==================================================================
Lucene.Net.Tests.Facet.dll: Lucene.Net.Facet.Range.TestRangeFacetCounts.TestMixedRangeAndNonRangeTaxonomy
Lucene.Net.Tests.Facet.dll: Lucene.Net.Facet.SortedSet.TestSortedSetDocValuesFacets.TestRandom
Lucene.Net.Tests.Facet.dll: Lucene.Net.Facet.SortedSet.TestSortedSetDocValuesFacets.TestStaleState
Lucene.Net.Tests.Facet.dll: Lucene.Net.Facet.Taxonomy.Directory.TestAddTaxonomy.TestConcurrency
Lucene.Net.Tests.Facet.dll: Lucene.Net.Facet.Taxonomy.Directory.TestAddTaxonomy.TestSimple
Lucene.Net.Tests.Facet.dll: Lucene.Net.Facet.Taxonomy.Directory.TestConcurrentFacetedIndexing.TestConcurrency
Lucene.Net.Tests.Facet.dll: Lucene.Net.Facet.Taxonomy.Directory.TestDirectoryTaxonomyReader.TestFreshReadRecreatedTaxonomy
Lucene.Net.Tests.Facet.dll: Lucene.Net.Facet.Taxonomy.Directory.TestDirectoryTaxonomyReader.TestGetChildren
Lucene.Net.Tests.Facet.dll: Lucene.Net.Facet.Taxonomy.Directory.TestDirectoryTaxonomyReader.TestOpenIfChangedManySegments
Lucene.Net.Tests.Facet.dll: Lucene.Net.Facet.Taxonomy.Directory.TestDirectoryTaxonomyReader.TestOpenIfChangedMergedSegment
Lucene.Net.Tests.Facet.dll: Lucene.Net.Facet.Taxonomy.Directory.TestDirectoryTaxonomyReader.TestOpenIfChangedNoChangesButSegmentMerges
Lucene.Net.Tests.Facet.dll: Lucene.Net.Facet.Taxonomy.Directory.TestDirectoryTaxonomyReader.TestOpenIfChangedReadRecreatedTaxonomy
Lucene.Net.Tests.Facet.dll: Lucene.Net.Facet.Taxonomy.Directory.TestDirectoryTaxonomyWriter.TestConcurrency
Lucene.Net.Tests.Facet.dll: Lucene.Net.Facet.Taxonomy.Directory.TestDirectoryTaxonomyWriter.TestHugeLabel
Lucene.Net.Tests.Facet.dll: Lucene.Net.Facet.Taxonomy.TestLRUHashMap.TestLru
Lucene.Net.Tests.Facet.dll: Lucene.Net.Facet.Taxonomy.TestSearcherTaxonomyManager.TestReplaceTaxonomyNrt
Lucene.Net.Tests.Facet.dll: Lucene.Net.Facet.Taxonomy.TestTaxonomyCombined.TestChildrenArrays
Lucene.Net.Tests.Facet.dll: Lucene.Net.Facet.Taxonomy.TestTaxonomyCombined.TestChildrenArraysGrowth
Lucene.Net.Tests.Facet.dll: Lucene.Net.Facet.Taxonomy.TestTaxonomyCombined.TestChildrenArraysInvariants
Lucene.Net.Tests.Facet.dll: Lucene.Net.Facet.Taxonomy.TestTaxonomyCombined.TestReaderBasic
Lucene.Net.Tests.Facet.dll: Lucene.Net.Facet.Taxonomy.TestTaxonomyCombined.TestReaderParent
Lucene.Net.Tests.Facet.dll: Lucene.Net.Facet.Taxonomy.TestTaxonomyCombined.TestSeparateReaderAndWriter
Lucene.Net.Tests.Facet.dll: Lucene.Net.Facet.Taxonomy.TestTaxonomyCombined.TestWriter
Lucene.Net.Tests.Facet.dll: Lucene.Net.Facet.Taxonomy.TestTaxonomyCombined.TestWriterCheckPaths
Lucene.Net.Tests.Facet.dll: Lucene.Net.Facet.Taxonomy.TestTaxonomyCombined.TestWriterCheckPaths2
Lucene.Net.Tests.Facet.dll: Lucene.Net.Facet.Taxonomy.TestTaxonomyCombined.TestWriterParent1
Lucene.Net.Tests.Facet.dll: Lucene.Net.Facet.Taxonomy.TestTaxonomyCombined.TestWriterParent2
Lucene.Net.Tests.Facet.dll: Lucene.Net.Facet.Taxonomy.TestTaxonomyCombined.TestWriterSimpler
Lucene.Net.Tests.Facet.dll: Lucene.Net.Facet.Taxonomy.TestTaxonomyCombined.TestWriterTwice
Lucene.Net.Tests.Facet.dll: Lucene.Net.Facet.Taxonomy.TestTaxonomyCombined.TestWriterTwice2
Lucene.Net.Tests.Facet.dll: Lucene.Net.Facet.Taxonomy.TestTaxonomyCombined.TestWriterTwice3
Lucene.Net.Tests.Facet.dll: Lucene.Net.Facet.Taxonomy.TestTaxonomyFacetAssociations.TestFloatSumAssociation
Lucene.Net.Tests.Facet.dll: Lucene.Net.Facet.Taxonomy.TestTaxonomyFacetAssociations.TestIntAndFloatAssocation
Lucene.Net.Tests.Facet.dll: Lucene.Net.Facet.Taxonomy.TestTaxonomyFacetAssociations.TestIntSumAssociation
Lucene.Net.Tests.Facet.dll: Lucene.Net.Facet.Taxonomy.TestTaxonomyFacetAssociations.TestIntSumAssociationDrillDown
Lucene.Net.Tests.Facet.dll: Lucene.Net.Facet.Taxonomy.TestTaxonomyFacetCounts.TestBasic
Lucene.Net.Tests.Facet.dll: Lucene.Net.Facet.Taxonomy.TestTaxonomyFacetCounts.TestChildCount
Lucene.Net.Tests.Facet.dll: Lucene.Net.Facet.Taxonomy.TestTaxonomyFacetCounts.TestCountRoot
Lucene.Net.Tests.Queries.dll: Lucene.Net.Tests.Queries.CommonTermsQueryTest.TestEqualsHashCode
Lucene.Net.Tests.dll: Lucene.Net.Codecs.Lucene40.TestLucene40DocValuesFormat.BaseDocValuesFormatTestCase.TestBinaryVariableLengthVsStoredFields
Lucene.Net.Tests.dll: Lucene.Net.Codecs.Lucene40.TestLucene40DocValuesFormat.BaseDocValuesFormatTestCase.TestEmptyBinaryValueOnPageSizes
Lucene.Net.Tests.dll: Lucene.Net.Codecs.Lucene40.TestLucene40DocValuesFormat.BaseDocValuesFormatTestCase.TestHugeBinaryValueLimit
Lucene.Net.Tests.dll: Lucene.Net.Codecs.Lucene40.TestLucene40DocValuesFormat.BaseDocValuesFormatTestCase.TestThreads
Lucene.Net.Tests.dll: Lucene.Net.Codecs.Lucene40.TestLucene40DocValuesFormat.BaseIndexFileFormatTestCase.TestMergeStability
Lucene.Net.Tests.dll: Lucene.Net.Codecs.Lucene41.TestBlockPostingsFormat2
Lucene.Net.Tests.dll: Lucene.Net.Codecs.Lucene41.TestBlockPostingsFormat3.Test
Lucene.Net.Tests.dll: Lucene.Net.Codecs.Lucene42.TestLucene42DocValuesFormat.BaseDocValuesFormatTestCase.TestVeryLargeButLegalSortedBytes
Lucene.Net.Tests.dll: Lucene.Net.Index.TestAtomicUpdate.TestAtomicUpdates
Lucene.Net.Tests.dll: Lucene.Net.Index.TestDirectoryReader.TestNoDir
Lucene.Net.Tests.dll: Lucene.Net.Index.TestDocumentsWriterStallControl.TestSimpleStall
Lucene.Net.Tests.dll: Lucene.Net.Index.TestDuelingCodecs.TestEquals
Lucene.Net.Tests.dll: Lucene.Net.Index.TestIndexWriterExceptions.TestExceptionOnMergeInit
Lucene.Net.Tests.dll: Lucene.Net.Index.TestNRTThreads.TestNRTThreads_Mem
Lucene.Net.Tests.dll: Lucene.Net.Index.TestStressIndexing.TestStressIndexAndSearching
Lucene.Net.Tests.dll: Lucene.Net.Index.TestTermdocPerf.TestTermDocPerf
Lucene.Net.Tests.dll: Lucene.Net.Index.TestTermsEnum.TestFloorBlocks
Lucene.Net.Tests.dll: Lucene.Net.Index.TestTermsEnum.TestRandomTerms
Lucene.Net.Tests.dll: Lucene.Net.Index.TestTransactions.TestTransactions_Mem
Lucene.Net.Tests.dll: Lucene.Net.Search.Payloads.TestPayloadNearQuery.Test
Lucene.Net.Tests.dll: Lucene.Net.Search.Payloads.TestPayloadNearQuery.TestAverageFunction
Lucene.Net.Tests.dll: Lucene.Net.Search.Payloads.TestPayloadNearQuery.TestComplexNested
Lucene.Net.Tests.dll: Lucene.Net.Search.Payloads.TestPayloadNearQuery.TestLongerSpan
Lucene.Net.Tests.dll: Lucene.Net.Search.Payloads.TestPayloadNearQuery.TestMaxFunction
Lucene.Net.Tests.dll: Lucene.Net.Search.Payloads.TestPayloadNearQuery.TestMinFunction
Lucene.Net.Tests.dll: Lucene.Net.Search.Payloads.TestPayloadNearQuery.TestPayloadNear
Lucene.Net.Tests.dll: Lucene.Net.Search.Spans.TestSpanMultiTermQueryWrapper.TestFuzzy2
Lucene.Net.Tests.dll: Lucene.Net.Search.TestFuzzyQuery.TestTieBreaker
Lucene.Net.Tests.dll: Lucene.Net.Search.TestMultiPhraseQuery.TestMultiSloppyWithRepeats
Lucene.Net.Tests.dll: Lucene.Net.Search.TestMultiValuedNumericRangeQuery.TestMultiValuedNRQ
Lucene.Net.Tests.dll: Lucene.Net.Search.TestNumericRangeQuery32.TestInfiniteValues
Lucene.Net.Tests.dll: Lucene.Net.Search.TestNumericRangeQuery64.TestInfiniteValues
Lucene.Net.Tests.dll: Lucene.Net.Search.TestRegexpQuery.TestBacktracking
Lucene.Net.Tests.dll: Lucene.Net.Search.TestRegexpQuery.TestRegexComplement
Lucene.Net.Tests.dll: Lucene.Net.Search.TestRegexpRandom.TestRegexps
Lucene.Net.Tests.dll: Lucene.Net.Search.TestSearchAfter.TestQueries
Lucene.Net.Tests.dll: Lucene.Net.Search.TestSearcherManager.TestSearcherManager_Mem
Lucene.Net.Tests.dll: Lucene.Net.Search.TestSimpleExplanations.TestDMQ8
Lucene.Net.Tests.dll: Lucene.Net.Search.TestTermVectors
Lucene.Net.Tests.dll: Lucene.Net.Search.TestTermVectors.TestMixedVectrosVectors
Lucene.Net.Tests.dll: Lucene.Net.Search.TestTopDocsMerge.TestSort_1
Lucene.Net.Tests.dll: Lucene.Net.Search.TestTopDocsMerge.TestSort_2
Lucene.Net.Tests.dll: Lucene.Net.Search.TestWildcardRandom.TestWildcards
Lucene.Net.Tests.dll: Lucene.Net.Store.TestBufferedIndexInput.TestSetBufferSize
Lucene.Net.Tests.dll: Lucene.Net.Store.TestFileSwitchDirectory.TestNoDir
Lucene.Net.Tests.dll: Lucene.Net.Store.TestNRTCachingDirectory.TestNoDir
Lucene.Net.Tests.dll: Lucene.Net.Tests.TestAssertions.TestTokenStreams
Lucene.Net.Tests.dll: Lucene.Net.Util.Packed.TestEliasFanoSequence.TestMonotoneSequences
Lucene.Net.Tests.dll: Lucene.Net.Util.Packed.TestEliasFanoSequence.TestStrictMonotoneSequencesLonger
Lucene.Net.Tests.dll: Lucene.Net.Util.TestIndexableBinaryStringTools.TestEncodedSortability
Lucene.Net.Tests.dll: Lucene.Net.Util.TestPagedBytes.TestDataInputOutput2
Lucene.Net.Tests.dll: Lucene.Net.Util.TestPagedBytes.TestOverflow



Newly failed tests details (only first 3 failures shown here)
==================================================================
Lucene.Net.Tests.dll: Lucene.Net.Index.TestBagOfPostings.Test (new) =================
TearDown method failed.   Expected: 101
  But was:  100

TearDown : System.IO.IOException : The process cannot access the file 'write.lock' because
it is being used by another process.
   at NUnit.Framework.Assert.That(Object actual, IResolveConstraint expression, String message,
Object[] args)
   at NUnit.Framework.Assert.AreEqual(Int32 expected, Int32 actual)
   at Lucene.Net.Index.TestBagOfPostings.Test() in z:\Builds\work\bcdbe6b8cc677a49\src\Lucene.Net.Tests\core\Index\TestBagOfPostings.cs:line
121
--TearDown
   at System.IO.Directory.DeleteHelper(String fullPath, String userPath, Boolean recursive,
Boolean throwOnTopLevelDirectoryNotFound)
   at System.IO.Directory.Delete(String fullPath, String userPath, Boolean recursive, Boolean
checkHost)
   at Lucene.Net.Util.LuceneTestCase.CleanupTemporaryFiles() in z:\Builds\work\bcdbe6b8cc677a49\src\Lucene.Net.TestFramework\Util\LuceneTestCase.cs:line
2667
   at Lucene.Net.Util.LuceneTestCase.TearDown() in z:\Builds\work\bcdbe6b8cc677a49\src\Lucene.Net.TestFramework\Util\LuceneTestCase.cs:line
581
------- Stderr: -------
Unhandled exception in remote appdomain: System.Exception: System.Exception: System.IndexOutOfRangeException:
Index was outside the bounds of the array.
   at System.Collections.Generic.HashSet`1.SetCapacity(Int32 newSize, Boolean forceNewHashCodes)
   at System.Collections.Generic.HashSet`1.AddIfNotPresent(T value)
   at System.Collections.Generic.HashSet`1.Add(T item)
   at Lucene.Net.Store.FSDirectory.OnIndexOutputClosed(FSIndexOutput io) in z:\Builds\work\bcdbe6b8cc677a49\src\Lucene.Net.Core\Store\FSDirectory.cs:line
384
   at Lucene.Net.Store.FSDirectory.FSIndexOutput.Dispose() in z:\Builds\work\bcdbe6b8cc677a49\src\Lucene.Net.Core\Store\FSDirectory.cs:line
514
   at Lucene.Net.Store.MockIndexOutputWrapper.Dispose() in z:\Builds\work\bcdbe6b8cc677a49\src\Lucene.Net.TestFramework\Store\MockIndexOutputWrapper.cs:line
111
   at Lucene.Net.Util.IOUtils.Close(IDisposable[] objects) in z:\Builds\work\bcdbe6b8cc677a49\src\Lucene.Net.Core\Util\IOUtils.cs:line
163 ---> System.IndexOutOfRangeException: Index was outside the bounds of the array.
   at System.Collections.Generic.HashSet`1.SetCapacity(Int32 newSize, Boolean forceNewHashCodes)
   at System.Collections.Generic.HashSet`1.AddIfNotPresent(T value)
   at System.Collections.Generic.HashSet`1.Add(T item)
   at Lucene.Net.Store.FSDirectory.OnIndexOutputClosed(FSIndexOutput io) in z:\Builds\work\bcdbe6b8cc677a49\src\Lucene.Net.Core\Store\FSDirectory.cs:line
384
   at Lucene.Net.Store.FSDirectory.FSIndexOutput.Dispose() in z:\Builds\work\bcdbe6b8cc677a49\src\Lucene.Net.Core\Store\FSDirectory.cs:line
514
   at Lucene.Net.Store.MockIndexOutputWrapper.Dispose() in z:\Builds\work\bcdbe6b8cc677a49\src\Lucene.Net.TestFramework\Store\MockIndexOutputWrapper.cs:line
111
   at Lucene.Net.Util.IOUtils.Close(IDisposable[] objects) in z:\Builds\work\bcdbe6b8cc677a49\src\Lucene.Net.Core\Util\IOUtils.cs:line
163
   --- End of inner exception stack trace ---
   at Lucene.Net.Util.IOUtils.ReThrowUnchecked(Exception th) in z:\Builds\work\bcdbe6b8cc677a49\src\Lucene.Net.Core\Util\IOUtils.cs:line
435
   at Lucene.Net.Util.IOUtils.ReThrow(Exception th) in z:\Builds\work\bcdbe6b8cc677a49\src\Lucene.Net.Core\Util\IOUtils.cs:line
418
   at Lucene.Net.Util.IOUtils.Close(IDisposable[] objects) in z:\Builds\work\bcdbe6b8cc677a49\src\Lucene.Net.Core\Util\IOUtils.cs:line
176
   at Lucene.Net.Codecs.Compressing.CompressingStoredFieldsWriter.Dispose(Boolean disposing)
in z:\Builds\work\bcdbe6b8cc677a49\src\Lucene.Net.Core\Codecs\Compressing\CompressingStoredFieldsWriter.cs:line
127
   at Lucene.Net.Codecs.StoredFieldsWriter.Dispose() in z:\Builds\work\bcdbe6b8cc677a49\src\Lucene.Net.Core\Codecs\StoredFieldsWriter.cs:line
157
   at Lucene.Net.Util.IOUtils.Close(IDisposable[] objects) in z:\Builds\work\bcdbe6b8cc677a49\src\Lucene.Net.Core\Util\IOUtils.cs:line
163 ---> System.Exception: System.Exception: System.IndexOutOfRangeException: Index was
outside the bounds of the array.
   at System.Collections.Generic.HashSet`1.SetCapacity(Int32 newSize, Boolean forceNewHashCodes)
   at System.Collections.Generic.HashSet`1.AddIfNotPresent(T value)
   at System.Collections.Generic.HashSet`1.Add(T item)
   at Lucene.Net.Store.FSDirectory.OnIndexOutputClosed(FSIndexOutput io) in z:\Builds\work\bcdbe6b8cc677a49\src\Lucene.Net.Core\Store\FSDirectory.cs:line
384
   at Lucene.Net.Store.FSDirectory.FSIndexOutput.Dispose() in z:\Builds\work\bcdbe6b8cc677a49\src\Lucene.Net.Core\Store\FSDirectory.cs:line
514
   at Lucene.Net.Store.MockIndexOutputWrapper.Dispose() in z:\Builds\work\bcdbe6b8cc677a49\src\Lucene.Net.TestFramework\Store\MockIndexOutputWrapper.cs:line
111
   at Lucene.Net.Util.IOUtils.Close(IDisposable[] objects) in z:\Builds\work\bcdbe6b8cc677a49\src\Lucene.Net.Core\Util\IOUtils.cs:line
163 ---> System.IndexOutOfRangeException: Index was outside the bounds of the array.
   at System.Collections.Generic.HashSet`1.SetCapacity(Int32 newSize, Boolean forceNewHashCodes)
   at System.Collections.Generic.HashSet`1.AddIfNotPresent(T value)
   at System.Collections.Generic.HashSet`1.Add(T item)
   at Lucene.Net.Store.FSDirectory.OnIndexOutputClosed(FSIndexOutput io) in z:\Builds\work\bcdbe6b8cc677a49\src\Lucene.Net.Core\Store\FSDirectory.cs:line
384
   at Lucene.Net.Store.FSDirectory.FSIndexOutput.Dispose() in z:\Builds\work\bcdbe6b8cc677a49\src\Lucene.Net.Core\Store\FSDirectory.cs:line
514
   at Lucene.Net.Store.MockIndexOutputWrapper.Dispose() in z:\Builds\work\bcdbe6b8cc677a49\src\Lucene.Net.TestFramework\Store\MockIndexOutputWrapper.cs:line
111
   at Lucene.Net.Util.IOUtils.Close(IDisposable[] objects) in z:\Builds\work\bcdbe6b8cc677a49\src\Lucene.Net.Core\Util\IOUtils.cs:line
163
   --- End of inner exception stack trace ---
   at Lucene.Net.Util.IOUtils.ReThrowUnchecked(Exception th) in z:\Builds\work\bcdbe6b8cc677a49\src\Lucene.Net.Core\Util\IOUtils.cs:line
435
   at Lucene.Net.Util.IOUtils.ReThrow(Exception th) in z:\Builds\work\bcdbe6b8cc677a49\src\Lucene.Net.Core\Util\IOUtils.cs:line
418
   at Lucene.Net.Util.IOUtils.Close(IDisposable[] objects) in z:\Builds\work\bcdbe6b8cc677a49\src\Lucene.Net.Core\Util\IOUtils.cs:line
176
   at Lucene.Net.Codecs.Compressing.CompressingStoredFieldsWriter.Dispose(Boolean disposing)
in z:\Builds\work\bcdbe6b8cc677a49\src\Lucene.Net.Core\Codecs\Compressing\CompressingStoredFieldsWriter.cs:line
127
   at Lucene.Net.Codecs.StoredFieldsWriter.Dispose() in z:\Builds\work\bcdbe6b8cc677a49\src\Lucene.Net.Core\Codecs\StoredFieldsWriter.cs:line
157
   at Lucene.Net.Util.IOUtils.Close(IDisposable[] objects) in z:\Builds\work\bcdbe6b8cc677a49\src\Lucene.Net.Core\Util\IOUtils.cs:line
163 ---> System.Exception: System.IndexOutOfRangeException: Index was outside the bounds
of the array.
   at System.Collections.Generic.HashSet`1.SetCapacity(Int32 newSize, Boolean forceNewHashCodes)
   at System.Collections.Generic.HashSet`1.AddIfNotPresent(T value)
   at System.Collections.Generic.HashSet`1.Add(T item)
   at Lucene.Net.Store.FSDirectory.OnIndexOutputClosed(FSIndexOutput io) in z:\Builds\work\bcdbe6b8cc677a49\src\Lucene.Net.Core\Store\FSDirectory.cs:line
384
   at Lucene.Net.Store.FSDirectory.FSIndexOutput.Dispose() in z:\Builds\work\bcdbe6b8cc677a49\src\Lucene.Net.Core\Store\FSDirectory.cs:line
514
   at Lucene.Net.Store.MockIndexOutputWrapper.Dispose() in z:\Builds\work\bcdbe6b8cc677a49\src\Lucene.Net.TestFramework\Store\MockIndexOutputWrapper.cs:line
111
   at Lucene.Net.Util.IOUtils.Close(IDisposable[] objects) in z:\Builds\work\bcdbe6b8cc677a49\src\Lucene.Net.Core\Util\IOUtils.cs:line
163 ---> System.IndexOutOfRangeException: Index was outside the bounds of the array.
   at System.Collections.Generic.HashSet`1.SetCapacity(Int32 newSize, Boolean forceNewHashCodes)
   at System.Collections.Generic.HashSet`1.AddIfNotPresent(T value)
   at System.Collections.Generic.HashSet`1.Add(T item)
   at Lucene.Net.Store.FSDirectory.OnIndexOutputClosed(FSIndexOutput io) in z:\Builds\work\bcdbe6b8cc677a49\src\Lucene.Net.Core\Store\FSDirectory.cs:line
384
   at Lucene.Net.Store.FSDirectory.FSIndexOutput.Dispose() in z:\Builds\work\bcdbe6b8cc677a49\src\Lucene.Net.Core\Store\FSDirectory.cs:line
514
   at Lucene.Net.Store.MockIndexOutputWrapper.Dispose() in z:\Builds\work\bcdbe6b8cc677a49\src\Lucene.Net.TestFramework\Store\MockIndexOutputWrapper.cs:line
111
   at Lucene.Net.Util.IOUtils.Close(IDisposable[] objects) in z:\Builds\work\bcdbe6b8cc677a49\src\Lucene.Net.Core\Util\IOUtils.cs:line
163
   --- End of inner exception stack trace ---
   at Lucene.Net.Util.IOUtils.ReThrowUnchecked(Exception th) in z:\Builds\work\bcdbe6b8cc677a49\src\Lucene.Net.Core\Util\IOUtils.cs:line
435
   at Lucene.Net.Util.IOUtils.ReThrow(Exception th) in z:\Builds\work\bcdbe6b8cc677a49\src\Lucene.Net.Core\Util\IOUtils.cs:line
418
   at Lucene.Net.Util.IOUtils.Close(IDisposable[] objects) in z:\Builds\work\bcdbe6b8cc677a49\src\Lucene.Net.Core\Util\IOUtils.cs:line
176
   at Lucene.Net.Codecs.Compressing.CompressingStoredFieldsWriter.Dispose(Boolean disposing)
in z:\Builds\work\bcdbe6b8cc677a49\src\Lucene.Net.Core\Codecs\Compressing\CompressingStoredFieldsWriter.cs:line
127
   at Lucene.Net.Codecs.StoredFieldsWriter.Dispose() in z:\Builds\work\bcdbe6b8cc677a49\src\Lucene.Net.Core\Codecs\StoredFieldsWriter.cs:line
157
   at Lucene.Net.Util.IOUtils.Close(IDisposable[] objects) in z:\Builds\work\bcdbe6b8cc677a49\src\Lucene.Net.Core\Util\IOUtils.cs:line
163
   --- End of inner exception stack trace ---
   at Lucene.Net.Util.IOUtils.ReThrowUnchecked(Exception th) in z:\Builds\work\bcdbe6b8cc677a49\src\Lucene.Net.Core\Util\IOUtils.cs:line
435
   at Lucene.Net.Util.IOUtils.ReThrow(Exception th) in z:\Builds\work\bcdbe6b8cc677a49\src\Lucene.Net.Core\Util\IOUtils.cs:line
418
   at Lucene.Net.Util.IOUtils.Close(IDisposable[] objects) in z:\Builds\work\bcdbe6b8cc677a49\src\Lucene.Net.Core\Util\IOUtils.cs:line
176
   at Lucene.Net.Index.StoredFieldsProcessor.Flush(SegmentWriteState state) in z:\Builds\work\bcdbe6b8cc677a49\src\Lucene.Net.Core\Index\StoredFieldsProcessor.cs:line
89
   at Lucene.Net.Index.TwoStoredFieldsConsumers.Flush(SegmentWriteState state) in z:\Builds\work\bcdbe6b8cc677a49\src\Lucene.Net.Core\Index\TwoStoredFieldsConsumers.cs:line
44
   at Lucene.Net.Index.DocFieldProcessor.Flush(SegmentWriteState state) in z:\Builds\work\bcdbe6b8cc677a49\src\Lucene.Net.Core\Index\DocFieldProcessor.cs:line
81
   at Lucene.Net.Index.DocumentsWriterPerThread.Flush() in z:\Builds\work\bcdbe6b8cc677a49\src\Lucene.Net.Core\Index\DocumentsWriterPerThread.cs:line
550
   at Lucene.Net.Index.DocumentsWriter.DoFlush(DocumentsWriterPerThread flushingDWPT) in z:\Builds\work\bcdbe6b8cc677a49\src\Lucene.Net.Core\Index\DocumentsWriter.cs:line
635
   at Lucene.Net.Index.DocumentsWriter.PostUpdate(DocumentsWriterPerThread flushingDWPT, Boolean
hasEvents) in z:\Builds\work\bcdbe6b8cc677a49\src\Lucene.Net.Core\Index\DocumentsWriter.cs:line
492
   at Lucene.Net.Index.DocumentsWriter.UpdateDocument(IEnumerable`1 doc, Analyzer analyzer,
Term delTerm) in z:\Builds\work\bcdbe6b8cc677a49\src\Lucene.Net.Core\Index\DocumentsWriter.cs:line
594
   at Lucene.Net.Index.IndexWriter.UpdateDocument(Term term, IEnumerable`1 doc, Analyzer analyzer)
in z:\Builds\work\bcdbe6b8cc677a49\src\Lucene.Net.Core\Index\IndexWriter.cs:line 1831
   at Lucene.Net.Index.IndexWriter.AddDocument(IEnumerable`1 doc, Analyzer analyzer) in z:\Builds\work\bcdbe6b8cc677a49\src\Lucene.Net.Core\Index\IndexWriter.cs:line
1456
   at Lucene.Net.Index.RandomIndexWriter.AddDocument(IEnumerable`1 doc, Analyzer a) in z:\Builds\work\bcdbe6b8cc677a49\src\Lucene.Net.TestFramework\Index\RandomIndexWriter.cs:line
147
   at Lucene.Net.Index.RandomIndexWriter.AddDocument(IEnumerable`1 doc) in z:\Builds\work\bcdbe6b8cc677a49\src\Lucene.Net.TestFramework\Index\RandomIndexWriter.cs:line
132
   at Lucene.Net.Index.TestBagOfPostings.ThreadAnonymousInnerClassHelper.Run() in z:\Builds\work\bcdbe6b8cc677a49\src\Lucene.Net.Tests\core\Index\TestBagOfPostings.cs:line
179
   --- End of inner exception stack trace ---
   at Lucene.Net.Index.TestBagOfPostings.ThreadAnonymousInnerClassHelper.Run() in z:\Builds\work\bcdbe6b8cc677a49\src\Lucene.Net.Tests\core\Index\TestBagOfPostings.cs:line
184
   at System.Threading.ThreadHelper.ThreadStart_Context(Object state)
   at System.Threading.ExecutionContext.RunInternal(ExecutionContext executionContext, ContextCallback
callback, Object state, Boolean preserveSyncCtx)
   at System.Threading.ExecutionContext.Run(ExecutionContext executionContext, ContextCallback
callback, Object state, Boolean preserveSyncCtx)
   at System.Threading.ExecutionContext.Run(ExecutionContext executionContext, ContextCallback
callback, Object state)
   at System.Threading.ThreadHelper.ThreadStart()
Lucene.Net.Tests.dll: Lucene.Net.Index.TestIndexWriter.TestThreadInterruptDeadlock (new) =================
Test(s) failed.   Expected: False
  But was:  True

   at NUnit.Framework.Assert.That(Object actual, IResolveConstraint expression, String message,
Object[] args)
   at NUnit.Framework.Assert.IsFalse(Boolean condition)
   at Lucene.Net.Index.TestIndexWriter.TestThreadInterruptDeadlock() in z:\Builds\work\bcdbe6b8cc677a49\src\Lucene.Net.Tests\core\Index\TestIndexWriter.cs:line
1412
------- Stderr: -------
TEST: got interrupt
   at Lucene.Net.Index.IndexWriter.DoWait() in z:\Builds\work\bcdbe6b8cc677a49\src\Lucene.Net.Core\Index\IndexWriter.cs:line
5367
   at Lucene.Net.Index.IndexWriter.ForceMerge(Int32 maxNumSegments, Boolean doWait) in z:\Builds\work\bcdbe6b8cc677a49\src\Lucene.Net.Core\Index\IndexWriter.cs:line
2192
   at Lucene.Net.Index.IndexWriter.ForceMerge(Int32 maxNumSegments) in z:\Builds\work\bcdbe6b8cc677a49\src\Lucene.Net.Core\Index\IndexWriter.cs:line
2100
   at Lucene.Net.Index.TestIndexWriter.IndexerThreadInterrupt.Run() in z:\Builds\work\bcdbe6b8cc677a49\src\Lucene.Net.Tests\core\Index\TestIndexWriter.cs:line
1274
TEST: got interrupt
   at Lucene.Net.Index.IndexWriter.DoWait() in z:\Builds\work\bcdbe6b8cc677a49\src\Lucene.Net.Core\Index\IndexWriter.cs:line
5367
   at Lucene.Net.Index.IndexWriter.ForceMerge(Int32 maxNumSegments, Boolean doWait) in z:\Builds\work\bcdbe6b8cc677a49\src\Lucene.Net.Core\Index\IndexWriter.cs:line
2192
   at Lucene.Net.Index.IndexWriter.ForceMerge(Int32 maxNumSegments) in z:\Builds\work\bcdbe6b8cc677a49\src\Lucene.Net.Core\Index\IndexWriter.cs:line
2100
   at Lucene.Net.Index.TestIndexWriter.IndexerThreadInterrupt.Run() in z:\Builds\work\bcdbe6b8cc677a49\src\Lucene.Net.Tests\core\Index\TestIndexWriter.cs:line
1274
TEST: got interrupt
   at Lucene.Net.Store.SlowOpeningMockIndexInputWrapper..ctor(MockDirectoryWrapper dir, String
name, IndexInput delegate) in z:\Builds\work\bcdbe6b8cc677a49\src\Lucene.Net.TestFramework\Store\SlowOpeningMockIndexInputWrapper.cs:line
45
   at Lucene.Net.Store.MockDirectoryWrapper.OpenInput(String name, IOContext context) in z:\Builds\work\bcdbe6b8cc677a49\src\Lucene.Net.TestFramework\Store\MockDirectoryWrapper.cs:line
805
   at Lucene.Net.Codecs.Lucene45.Lucene45DocValuesProducer..ctor(SegmentReadState state, String
dataCodec, String dataExtension, String metaCodec, String metaExtension) in z:\Builds\work\bcdbe6b8cc677a49\src\Lucene.Net.Core\Codecs\Lucene45\Lucene45DocValuesProducer.cs:line
115
   at Lucene.Net.Codecs.Lucene45.Lucene45DocValuesFormat.FieldsProducer(SegmentReadState state)
in z:\Builds\work\bcdbe6b8cc677a49\src\Lucene.Net.Core\Codecs\Lucene45\Lucene45DocValuesFormat.cs:line
167
   at Lucene.Net.Codecs.Perfield.PerFieldDocValuesFormat.FieldsReader..ctor(PerFieldDocValuesFormat
outerInstance, SegmentReadState readState) in z:\Builds\work\bcdbe6b8cc677a49\src\Lucene.Net.Core\Codecs\Perfield\PerFieldDocValuesFormat.cs:line
268
   at Lucene.Net.Codecs.Perfield.PerFieldDocValuesFormat.FieldsProducer(SegmentReadState state)
in z:\Builds\work\bcdbe6b8cc677a49\src\Lucene.Net.Core\Codecs\Perfield\PerFieldDocValuesFormat.cs:line
389
   at Lucene.Net.Index.SegmentDocValues.NewDocValuesProducer(SegmentCommitInfo si, IOContext
context, Directory dir, DocValuesFormat dvFormat, Nullable`1 gen, IList`1 infos, Int32 termsIndexDivisor)
in z:\Builds\work\bcdbe6b8cc677a49\src\Lucene.Net.Core\Index\SegmentDocValues.cs:line 54
   at Lucene.Net.Index.SegmentDocValues.GetDocValuesProducer(Nullable`1 gen, SegmentCommitInfo
si, IOContext context, Directory dir, DocValuesFormat dvFormat, IList`1 infos, Int32 termsIndexDivisor)
in z:\Builds\work\bcdbe6b8cc677a49\src\Lucene.Net.Core\Index\SegmentDocValues.cs:line 86
   at Lucene.Net.Index.SegmentReader.InitDocValuesProducers(Codec codec) in z:\Builds\work\bcdbe6b8cc677a49\src\Lucene.Net.Core\Index\SegmentReader.cs:line
222
   at Lucene.Net.Index.SegmentReader..ctor(SegmentCommitInfo si, Int32 termInfosIndexDivisor,
IOContext context) in z:\Builds\work\bcdbe6b8cc677a49\src\Lucene.Net.Core\Index\SegmentReader.cs:line
132
   at Lucene.Net.Index.ReadersAndUpdates.GetReader(IOContext context) in z:\Builds\work\bcdbe6b8cc677a49\src\Lucene.Net.Core\Index\ReadersAndUpdates.cs:line
167
   at Lucene.Net.Index.ReadersAndUpdates.GetReadOnlyClone(IOContext context) in z:\Builds\work\bcdbe6b8cc677a49\src\Lucene.Net.Core\Index\ReadersAndUpdates.cs:line
298
   at Lucene.Net.Index.StandardDirectoryReader.Open(IndexWriter writer, SegmentInfos infos,
Boolean applyAllDeletes) in z:\Builds\work\bcdbe6b8cc677a49\src\Lucene.Net.Core\Index\StandardDirectoryReader.cs:line
126
   at Lucene.Net.Index.IndexWriter.GetReader(Boolean applyAllDeletes) in z:\Builds\work\bcdbe6b8cc677a49\src\Lucene.Net.Core\Index\IndexWriter.cs:line
413
   at Lucene.Net.Index.DirectoryReader.Open(IndexWriter writer, Boolean applyAllDeletes) in
z:\Builds\work\bcdbe6b8cc677a49\src\Lucene.Net.Core\Index\DirectoryReader.cs:line 115
   at Lucene.Net.Index.TestIndexWriter.IndexerThreadInterrupt.Run() in z:\Builds\work\bcdbe6b8cc677a49\src\Lucene.Net.Tests\core\Index\TestIndexWriter.cs:line
1253
TEST: got interrupt
   at Lucene.Net.Store.SlowOpeningMockIndexInputWrapper..ctor(MockDirectoryWrapper dir, String
name, IndexInput delegate) in z:\Builds\work\bcdbe6b8cc677a49\src\Lucene.Net.TestFramework\Store\SlowOpeningMockIndexInputWrapper.cs:line
45
   at Lucene.Net.Store.MockDirectoryWrapper.OpenInput(String name, IOContext context) in z:\Builds\work\bcdbe6b8cc677a49\src\Lucene.Net.TestFramework\Store\MockDirectoryWrapper.cs:line
805
   at Lucene.Net.Store.FilterDirectory.OpenChecksumInput(String name, IOContext context) in
z:\Builds\work\bcdbe6b8cc677a49\src\Lucene.Net.Core\Store\FilterDirectory.cs:line 132
   at Lucene.Net.Codecs.Lucene46.Lucene46FieldInfosReader.Read(Directory directory, String
segmentName, String segmentSuffix, IOContext context) in z:\Builds\work\bcdbe6b8cc677a49\src\Lucene.Net.Core\Codecs\Lucene46\Lucene46FieldInfosReader.cs:line
50
   at Lucene.Net.Index.SegmentReader.ReadFieldInfos(SegmentCommitInfo info) in z:\Builds\work\bcdbe6b8cc677a49\src\Lucene.Net.Core\Index\SegmentReader.cs:line
258
   at Lucene.Net.Index.IndexWriter.get_FieldNumberMap() in z:\Builds\work\bcdbe6b8cc677a49\src\Lucene.Net.Core\Index\IndexWriter.cs:line
979
   at Lucene.Net.Index.IndexWriter..ctor(Directory d, IndexWriterConfig conf) in z:\Builds\work\bcdbe6b8cc677a49\src\Lucene.Net.Core\Index\IndexWriter.cs:line
923
   at Lucene.Net.Index.TestIndexWriter.IndexerThreadInterrupt.Run() in z:\Builds\work\bcdbe6b8cc677a49\src\Lucene.Net.Tests\core\Index\TestIndexWriter.cs:line
1201
TEST: got interrupt
   at Lucene.Net.Store.SlowOpeningMockIndexInputWrapper..ctor(MockDirectoryWrapper dir, String
name, IndexInput delegate) in z:\Builds\work\bcdbe6b8cc677a49\src\Lucene.Net.TestFramework\Store\SlowOpeningMockIndexInputWrapper.cs:line
45
   at Lucene.Net.Store.MockDirectoryWrapper.OpenInput(String name, IOContext context) in z:\Builds\work\bcdbe6b8cc677a49\src\Lucene.Net.TestFramework\Store\MockDirectoryWrapper.cs:line
805
   at Lucene.Net.Codecs.Lucene41.Lucene41PostingsReader..ctor(Directory dir, FieldInfos fieldInfos,
SegmentInfo segmentInfo, IOContext ioContext, String segmentSuffix) in z:\Builds\work\bcdbe6b8cc677a49\src\Lucene.Net.Core\Codecs\Lucene41\Lucene41PostingsReader.cs:line
54
   at Lucene.Net.Codecs.Lucene41.Lucene41PostingsFormat.FieldsProducer(SegmentReadState state)
in z:\Builds\work\bcdbe6b8cc677a49\src\Lucene.Net.Core\Codecs\Lucene41\Lucene41PostingsFormat.cs:line
428
   at Lucene.Net.Codecs.Perfield.PerFieldPostingsFormat.FieldsReader..ctor(PerFieldPostingsFormat
outerInstance, SegmentReadState readState) in z:\Builds\work\bcdbe6b8cc677a49\src\Lucene.Net.Core\Codecs\Perfield\PerFieldPostingsFormat.cs:line
216
   at Lucene.Net.Codecs.Perfield.PerFieldPostingsFormat.FieldsProducer(SegmentReadState state)
in z:\Builds\work\bcdbe6b8cc677a49\src\Lucene.Net.Core\Codecs\Perfield\PerFieldPostingsFormat.cs:line
277
   at Lucene.Net.Index.SegmentCoreReaders..ctor(SegmentReader owner, Directory dir, SegmentCommitInfo
si, IOContext context, Int32 termsIndexDivisor) in z:\Builds\work\bcdbe6b8cc677a49\src\Lucene.Net.Core\Index\SegmentCoreReaders.cs:line
151
   at Lucene.Net.Index.SegmentReader..ctor(SegmentCommitInfo si, Int32 termInfosIndexDivisor,
IOContext context) in z:\Builds\work\bcdbe6b8cc677a49\src\Lucene.Net.Core\Index\SegmentReader.cs:line
111
   at Lucene.Net.Index.ReadersAndUpdates.GetReader(IOContext context) in z:\Builds\work\bcdbe6b8cc677a49\src\Lucene.Net.Core\Index\ReadersAndUpdates.cs:line
167
   at Lucene.Net.Index.ReadersAndUpdates.GetReadOnlyClone(IOContext context) in z:\Builds\work\bcdbe6b8cc677a49\src\Lucene.Net.Core\Index\ReadersAndUpdates.cs:line
298
   at Lucene.Net.Index.StandardDirectoryReader.Open(IndexWriter writer, SegmentInfos infos,
Boolean applyAllDeletes) in z:\Builds\work\bcdbe6b8cc677a49\src\Lucene.Net.Core\Index\StandardDirectoryReader.cs:line
126
   at Lucene.Net.Index.IndexWriter.GetReader(Boolean applyAllDeletes) in z:\Builds\work\bcdbe6b8cc677a49\src\Lucene.Net.Core\Index\IndexWriter.cs:line
413
   at Lucene.Net.Index.DirectoryReader.Open(IndexWriter writer, Boolean applyAllDeletes) in
z:\Builds\work\bcdbe6b8cc677a49\src\Lucene.Net.Core\Index\DirectoryReader.cs:line 115
   at Lucene.Net.Index.TestIndexWriter.IndexerThreadInterrupt.Run() in z:\Builds\work\bcdbe6b8cc677a49\src\Lucene.Net.Tests\core\Index\TestIndexWriter.cs:line
1253
TEST: got interrupt
   at Lucene.Net.Store.SlowOpeningMockIndexInputWrapper..ctor(MockDirectoryWrapper dir, String
name, IndexInput delegate) in z:\Builds\work\bcdbe6b8cc677a49\src\Lucene.Net.TestFramework\Store\SlowOpeningMockIndexInputWrapper.cs:line
45
   at Lucene.Net.Store.MockDirectoryWrapper.OpenInput(String name, IOContext context) in z:\Builds\work\bcdbe6b8cc677a49\src\Lucene.Net.TestFramework\Store\MockDirectoryWrapper.cs:line
805
   at Lucene.Net.Codecs.Lucene41.Lucene41PostingsReader..ctor(Directory dir, FieldInfos fieldInfos,
SegmentInfo segmentInfo, IOContext ioContext, String segmentSuffix) in z:\Builds\work\bcdbe6b8cc677a49\src\Lucene.Net.Core\Codecs\Lucene41\Lucene41PostingsReader.cs:line
54
   at Lucene.Net.Codecs.Lucene41.Lucene41PostingsFormat.FieldsProducer(SegmentReadState state)
in z:\Builds\work\bcdbe6b8cc677a49\src\Lucene.Net.Core\Codecs\Lucene41\Lucene41PostingsFormat.cs:line
428
   at Lucene.Net.Codecs.Perfield.PerFieldPostingsFormat.FieldsReader..ctor(PerFieldPostingsFormat
outerInstance, SegmentReadState readState) in z:\Builds\work\bcdbe6b8cc677a49\src\Lucene.Net.Core\Codecs\Perfield\PerFieldPostingsFormat.cs:line
216
   at Lucene.Net.Codecs.Perfield.PerFieldPostingsFormat.FieldsProducer(SegmentReadState state)
in z:\Builds\work\bcdbe6b8cc677a49\src\Lucene.Net.Core\Codecs\Perfield\PerFieldPostingsFormat.cs:line
277
   at Lucene.Net.Index.SegmentCoreReaders..ctor(SegmentReader owner, Directory dir, SegmentCommitInfo
si, IOContext context, Int32 termsIndexDivisor) in z:\Builds\work\bcdbe6b8cc677a49\src\Lucene.Net.Core\Index\SegmentCoreReaders.cs:line
151
   at Lucene.Net.Index.SegmentReader..ctor(SegmentCommitInfo si, Int32 termInfosIndexDivisor,
IOContext context) in z:\Builds\work\bcdbe6b8cc677a49\src\Lucene.Net.Core\Index\SegmentReader.cs:line
111
   at Lucene.Net.Index.ReadersAndUpdates.GetReader(IOContext context) in z:\Builds\work\bcdbe6b8cc677a49\src\Lucene.Net.Core\Index\ReadersAndUpdates.cs:line
167
   at Lucene.Net.Index.BufferedUpdatesStream.ApplyDeletesAndUpdates(ReaderPool readerPool,
IList`1 infos) in z:\Builds\work\bcdbe6b8cc677a49\src\Lucene.Net.Core\Index\BufferedUpdatesStream.cs:line
328
   at Lucene.Net.Index.IndexWriter.ApplyAllDeletesAndUpdates() in z:\Builds\work\bcdbe6b8cc677a49\src\Lucene.Net.Core\Index\IndexWriter.cs:line
3947
   at Lucene.Net.Index.IndexWriter.MaybeApplyDeletes(Boolean applyAllDeletes) in z:\Builds\work\bcdbe6b8cc677a49\src\Lucene.Net.Core\Index\IndexWriter.cs:line
3932
   at Lucene.Net.Index.IndexWriter.GetReader(Boolean applyAllDeletes) in z:\Builds\work\bcdbe6b8cc677a49\src\Lucene.Net.Core\Index\IndexWriter.cs:line
412
   at Lucene.Net.Index.DirectoryReader.Open(IndexWriter writer, Boolean applyAllDeletes) in
z:\Builds\work\bcdbe6b8cc677a49\src\Lucene.Net.Core\Index\DirectoryReader.cs:line 115
   at Lucene.Net.Index.TestIndexWriter.IndexerThreadInterrupt.Run() in z:\Builds\work\bcdbe6b8cc677a49\src\Lucene.Net.Tests\core\Index\TestIndexWriter.cs:line
1253
FAILED; unexpected exception
   at Lucene.Net.Util.IOUtils.ReThrowUnchecked(Exception th) in z:\Builds\work\bcdbe6b8cc677a49\src\Lucene.Net.Core\Util\IOUtils.cs:line
435
   at Lucene.Net.Util.IOUtils.ReThrow(Exception th) in z:\Builds\work\bcdbe6b8cc677a49\src\Lucene.Net.Core\Util\IOUtils.cs:line
418
   at Lucene.Net.Index.IndexWriter.ReaderPool.DropAll(Boolean doSave) in z:\Builds\work\bcdbe6b8cc677a49\src\Lucene.Net.Core\Index\IndexWriter.cs:line
656
   at Lucene.Net.Index.IndexWriter.DeleteAll() in z:\Builds\work\bcdbe6b8cc677a49\src\Lucene.Net.Core\Index\IndexWriter.cs:line
2708
   at Lucene.Net.Index.TestIndexWriter.IndexerThreadInterrupt.Run() in z:\Builds\work\bcdbe6b8cc677a49\src\Lucene.Net.Tests\core\Index\TestIndexWriter.cs:line
1241
Unhandled exception in remote appdomain: System.Exception: System.Exception: MockDirectoryWrapper:
cannot close: there are still open locks: write.lock
   at Lucene.Net.Store.MockDirectoryWrapper.Dispose() in z:\Builds\work\bcdbe6b8cc677a49\src\Lucene.Net.TestFramework\Store\MockDirectoryWrapper.cs:line
923
   at Lucene.Net.Util.IOUtils.Close(IDisposable[] objects) in z:\Builds\work\bcdbe6b8cc677a49\src\Lucene.Net.Core\Util\IOUtils.cs:line
163 ---> System.Exception: MockDirectoryWrapper: cannot close: there are still open locks:
write.lock
   at Lucene.Net.Store.MockDirectoryWrapper.Dispose() in z:\Builds\work\bcdbe6b8cc677a49\src\Lucene.Net.TestFramework\Store\MockDirectoryWrapper.cs:line
923
   at Lucene.Net.Util.IOUtils.Close(IDisposable[] objects) in z:\Builds\work\bcdbe6b8cc677a49\src\Lucene.Net.Core\Util\IOUtils.cs:line
163
   --- End of inner exception stack trace ---
   at Lucene.Net.Util.IOUtils.ReThrowUnchecked(Exception th) in z:\Builds\work\bcdbe6b8cc677a49\src\Lucene.Net.Core\Util\IOUtils.cs:line
435
   at Lucene.Net.Util.IOUtils.ReThrow(Exception th) in z:\Builds\work\bcdbe6b8cc677a49\src\Lucene.Net.Core\Util\IOUtils.cs:line
418
   at Lucene.Net.Util.IOUtils.Close(IDisposable[] objects) in z:\Builds\work\bcdbe6b8cc677a49\src\Lucene.Net.Core\Util\IOUtils.cs:line
176
   at Lucene.Net.Index.TestIndexWriter.IndexerThreadInterrupt.Run() in z:\Builds\work\bcdbe6b8cc677a49\src\Lucene.Net.Tests\core\Index\TestIndexWriter.cs:line
1362
   at System.Threading.ThreadHelper.ThreadStart_Context(Object state)
   at System.Threading.ExecutionContext.RunInternal(ExecutionContext executionContext, ContextCallback
callback, Object state, Boolean preserveSyncCtx)
   at System.Threading.ExecutionContext.Run(ExecutionContext executionContext, ContextCallback
callback, Object state, Boolean preserveSyncCtx)
   at System.Threading.ExecutionContext.Run(ExecutionContext executionContext, ContextCallback
callback, Object state)
   at System.Threading.ThreadHelper.ThreadStart()
Lucene.Net.Tests.dll: Lucene.Net.Index.TestIndexWriter.TestTwoThreadsInterruptDeadlock (new)
=================
Test(s) failed.   Expected: False
  But was:  True

   at NUnit.Framework.Assert.That(Object actual, IResolveConstraint expression, String message,
Object[] args)
   at NUnit.Framework.Assert.IsFalse(Boolean condition)
   at Lucene.Net.Index.TestIndexWriter.TestTwoThreadsInterruptDeadlock() in z:\Builds\work\bcdbe6b8cc677a49\src\Lucene.Net.Tests\core\Index\TestIndexWriter.cs:line
1458
------- Stderr: -------
TEST: got interrupt
   at Lucene.Net.Index.IndexWriter.DoWait() in z:\Builds\work\bcdbe6b8cc677a49\src\Lucene.Net.Core\Index\IndexWriter.cs:line
5367
   at Lucene.Net.Index.IndexWriter.ForceMerge(Int32 maxNumSegments, Boolean doWait) in z:\Builds\work\bcdbe6b8cc677a49\src\Lucene.Net.Core\Index\IndexWriter.cs:line
2192
   at Lucene.Net.Index.IndexWriter.ForceMerge(Int32 maxNumSegments) in z:\Builds\work\bcdbe6b8cc677a49\src\Lucene.Net.Core\Index\IndexWriter.cs:line
2100
   at Lucene.Net.Index.TestIndexWriter.IndexerThreadInterrupt.Run() in z:\Builds\work\bcdbe6b8cc677a49\src\Lucene.Net.Tests\core\Index\TestIndexWriter.cs:line
1274
FAILED; unexpected exception
   at Lucene.Net.Util.IOUtils.ReThrowUnchecked(Exception th) in z:\Builds\work\bcdbe6b8cc677a49\src\Lucene.Net.Core\Util\IOUtils.cs:line
435
   at Lucene.Net.Index.IndexReader.NotifyReaderClosedListeners(Exception th) in z:\Builds\work\bcdbe6b8cc677a49\src\Lucene.Net.Core\Index\IndexReader.cs:line
170
   at Lucene.Net.Index.IndexReader.DecRef() in z:\Builds\work\bcdbe6b8cc677a49\src\Lucene.Net.Core\Index\IndexReader.cs:line
303
   at Lucene.Net.Index.IndexReader.Dispose(Boolean disposing) in z:\Builds\work\bcdbe6b8cc677a49\src\Lucene.Net.Core\Index\IndexReader.cs:line
570
   at Lucene.Net.Index.IndexReader.Dispose() in z:\Builds\work\bcdbe6b8cc677a49\src\Lucene.Net.Core\Index\IndexReader.cs:line
559
   at Lucene.Net.Index.TestIndexWriter.IndexerThreadInterrupt.Run() in z:\Builds\work\bcdbe6b8cc677a49\src\Lucene.Net.Tests\core\Index\TestIndexWriter.cs:line
1278
CheckIndex failed
Unhandled exception in remote appdomain: System.Exception: System.Threading.ThreadInterruptedException:
Thread was interrupted from a waiting state.
   at System.Threading.Thread.SleepInternal(Int32 millisecondsTimeout)
   at System.Threading.Thread.Sleep(Int32 millisecondsTimeout)
   at NUnit.Core.EventQueue.Enqueue(Event e)
   at NUnit.Core.QueuingEventListener.TestOutput(TestOutput output)
   at NUnit.Core.EventListenerTextWriter.WriteLine(String aString)
   at System.IO.TextWriter.SyncTextWriter.WriteLine(String value)
   at Lucene.Net.Util.TestUtil.CheckIndex(Directory dir, Boolean crossCheckTermVectors) in
z:\Builds\work\bcdbe6b8cc677a49\src\Lucene.Net.TestFramework\Util\TestUtil.cs:line 254
   at Lucene.Net.Store.MockDirectoryWrapper.Dispose() in z:\Builds\work\bcdbe6b8cc677a49\src\Lucene.Net.TestFramework\Store\MockDirectoryWrapper.cs:line
943
   at Lucene.Net.Util.IOUtils.Close(IDisposable[] objects) in z:\Builds\work\bcdbe6b8cc677a49\src\Lucene.Net.Core\Util\IOUtils.cs:line
163 ---> System.Threading.ThreadInterruptedException: Thread was interrupted from a waiting
state.
   at System.Threading.Thread.SleepInternal(Int32 millisecondsTimeout)
   at System.Threading.Thread.Sleep(Int32 millisecondsTimeout)
   at NUnit.Core.EventQueue.Enqueue(Event e)
   at NUnit.Core.QueuingEventListener.TestOutput(TestOutput output)
   at NUnit.Core.EventListenerTextWriter.WriteLine(String aString)
   at System.IO.TextWriter.SyncTextWriter.WriteLine(String value)
   at Lucene.Net.Util.TestUtil.CheckIndex(Directory dir, Boolean crossCheckTermVectors) in
z:\Builds\work\bcdbe6b8cc677a49\src\Lucene.Net.TestFramework\Util\TestUtil.cs:line 254
   at Lucene.Net.Store.MockDirectoryWrapper.Dispose() in z:\Builds\work\bcdbe6b8cc677a49\src\Lucene.Net.TestFramework\Store\MockDirectoryWrapper.cs:line
943
   at Lucene.Net.Util.IOUtils.Close(IDisposable[] objects) in z:\Builds\work\bcdbe6b8cc677a49\src\Lucene.Net.Core\Util\IOUtils.cs:line
163
   --- End of inner exception stack trace ---
   at Lucene.Net.Util.IOUtils.ReThrowUnchecked(Exception th) in z:\Builds\work\bcdbe6b8cc677a49\src\Lucene.Net.Core\Util\IOUtils.cs:line
435
   at Lucene.Net.Util.IOUtils.ReThrow(Exception th) in z:\Builds\work\bcdbe6b8cc677a49\src\Lucene.Net.Core\Util\IOUtils.cs:line
418
   at Lucene.Net.Util.IOUtils.Close(IDisposable[] objects) in z:\Builds\work\bcdbe6b8cc677a49\src\Lucene.Net.Core\Util\IOUtils.cs:line
176
   at Lucene.Net.Index.TestIndexWriter.IndexerThreadInterrupt.Run() in z:\Builds\work\bcdbe6b8cc677a49\src\Lucene.Net.Tests\core\Index\TestIndexWriter.cs:line
1362
   at System.Threading.ThreadHelper.ThreadStart_Context(Object state)
   at System.Threading.ExecutionContext.RunInternal(ExecutionContext executionContext, ContextCallback
callback, Object state, Boolean preserveSyncCtx)
   at System.Threading.ExecutionContext.Run(ExecutionContext executionContext, ContextCallback
callback, Object state, Boolean preserveSyncCtx)
   at System.Threading.ExecutionContext.Run(ExecutionContext executionContext, ContextCallback
callback, Object state)
   at System.Threading.ThreadHelper.ThreadStart()
FAILED; unexpected exception
   at Lucene.Net.Util.IOUtils.ReThrowUnchecked(Exception th) in z:\Builds\work\bcdbe6b8cc677a49\src\Lucene.Net.Core\Util\IOUtils.cs:line
435
   at Lucene.Net.Util.IOUtils.ReThrow(Exception th) in z:\Builds\work\bcdbe6b8cc677a49\src\Lucene.Net.Core\Util\IOUtils.cs:line
418
   at Lucene.Net.Index.IndexWriter.ReaderPool.DropAll(Boolean doSave) in z:\Builds\work\bcdbe6b8cc677a49\src\Lucene.Net.Core\Index\IndexWriter.cs:line
656
   at Lucene.Net.Index.IndexWriter.DeleteAll() in z:\Builds\work\bcdbe6b8cc677a49\src\Lucene.Net.Core\Index\IndexWriter.cs:line
2708
   at Lucene.Net.Index.TestIndexWriter.IndexerThreadInterrupt.Run() in z:\Builds\work\bcdbe6b8cc677a49\src\Lucene.Net.Tests\core\Index\TestIndexWriter.cs:line
1241
Unhandled exception in remote appdomain: System.Exception: System.Exception: MockDirectoryWrapper:
cannot close: there are still open locks: write.lock
   at Lucene.Net.Store.MockDirectoryWrapper.Dispose() in z:\Builds\work\bcdbe6b8cc677a49\src\Lucene.Net.TestFramework\Store\MockDirectoryWrapper.cs:line
923
   at Lucene.Net.Util.IOUtils.Close(IDisposable[] objects) in z:\Builds\work\bcdbe6b8cc677a49\src\Lucene.Net.Core\Util\IOUtils.cs:line
163 ---> System.Exception: MockDirectoryWrapper: cannot close: there are still open locks:
write.lock
   at Lucene.Net.Store.MockDirectoryWrapper.Dispose() in z:\Builds\work\bcdbe6b8cc677a49\src\Lucene.Net.TestFramework\Store\MockDirectoryWrapper.cs:line
923
   at Lucene.Net.Util.IOUtils.Close(IDisposable[] objects) in z:\Builds\work\bcdbe6b8cc677a49\src\Lucene.Net.Core\Util\IOUtils.cs:line
163
   --- End of inner exception stack trace ---
   at Lucene.Net.Util.IOUtils.ReThrowUnchecked(Exception th) in z:\Builds\work\bcdbe6b8cc677a49\src\Lucene.Net.Core\Util\IOUtils.cs:line
435
   at Lucene.Net.Util.IOUtils.ReThrow(Exception th) in z:\Builds\work\bcdbe6b8cc677a49\src\Lucene.Net.Core\Util\IOUtils.cs:line
418
   at Lucene.Net.Util.IOUtils.Close(IDisposable[] objects) in z:\Builds\work\bcdbe6b8cc677a49\src\Lucene.Net.Core\Util\IOUtils.cs:line
176
   at Lucene.Net.Index.TestIndexWriter.IndexerThreadInterrupt.Run() in z:\Builds\work\bcdbe6b8cc677a49\src\Lucene.Net.Tests\core\Index\TestIndexWriter.cs:line
1362
   at System.Threading.ThreadHelper.ThreadStart_Context(Object state)
   at System.Threading.ExecutionContext.RunInternal(ExecutionContext executionContext, ContextCallback
callback, Object state, Boolean preserveSyncCtx)
   at System.Threading.ExecutionContext.Run(ExecutionContext executionContext, ContextCallback
callback, Object state, Boolean preserveSyncCtx)
   at System.Threading.ExecutionContext.Run(ExecutionContext executionContext, ContextCallback
callback, Object state)
   at System.Threading.ThreadHelper.ThreadStart()
see all newly failed tests: http://teamcity.codebetter.com/viewLog.html?buildId=184907&buildTypeId=LuceneNet_LuceneNetNightly
Changes included (4 changes)
====================================================
Change 02d2bef56f9616c1a68164856fa3b6101cf51819 by laimis (1 file):
initialize docs on each test run


Change 82f9015c6913dc06fdf3d71ec208bd59d875cb05 by laimis (1 file):
add SetUp attribute


Change 01bac7d79f3f1abf436c4c39ad85b301882938d1 by laimis (1 file):
initialize snapshots on each test run


Change 9e1e7979dacc467210e0dc9da53549cb6732223d by laimis (2 files):
mark long running test, ignore test we are not ready to use


see more information about changed files: http://teamcity.codebetter.com/viewLog.html?tab=buildChangesDiv&buildId=184907&buildTypeId=LuceneNet_LuceneNetNightly

============================================================================
Configure email notifications: http://teamcity.codebetter.com/profile.html?init=1&tab=userNotifications

Mime
  • Unnamed multipart/alternative (inline, None, 0 bytes)
View raw message