lucenenet-dev mailing list archives

Site index · List index
Message view « Date » · « Thread »
Top « Date » · « Thread »
From t.@codebetter.com
Subject [TeamCity, FAILED] Build Lucene.NET :: Lucene.NET Nightly [master] #371
Date Sat, 21 Mar 2015 09:38:09 GMT
Build Lucene.NET :: Lucene.NET Nightly [master] #371 failed (Tests failed: 113 (8 new), passed:
2658, ignored: 122; snapshot dependency failed: Lucene.NET :: Lucene.NET Core).
Agent: JetBrains-dotnet-agent02
Build results: http://teamcity.codebetter.com/viewLog.html?buildId=186584&buildTypeId=LuceneNet_LuceneNetNightly

Failed Tests Summary:
Newly failed tests (8 tests, alphabetically ordered)
==================================================================
Lucene.Net.Tests.dll: Lucene.Net.Index.TestCrash.TestCrashWhileIndexing
Lucene.Net.Tests.dll: Lucene.Net.Index.TestDocTermOrds.TestRandomWithPrefix
Lucene.Net.Tests.dll: Lucene.Net.Index.TestIndexWriter.TestTwoThreadsInterruptDeadlock
Lucene.Net.Tests.dll: Lucene.Net.Index.TestIndexWriterForceMerge.TestPartialMerge
Lucene.Net.Tests.dll: Lucene.Net.Index.TestIndexWriterReader.TestDuringAddIndexes
Lucene.Net.Tests.dll: Lucene.Net.Index.TestNRTThreads.TestNRTThreads_Mem
Lucene.Net.Tests.dll: Lucene.Net.Store.TestDirectory.TestDontCreate
Lucene.Net.Tests.dll: Lucene.Net.Util.TestPagedBytes.TestDataInputOutput2

Other failed tests (105 tests, alphabetically ordered, only first 100 shown)
==================================================================
Lucene.Net.Tests.Facet.dll: Lucene.Net.Facet.Range.TestRangeFacetCounts.TestMixedRangeAndNonRangeTaxonomy
Lucene.Net.Tests.Facet.dll: Lucene.Net.Facet.SortedSet.TestSortedSetDocValuesFacets.TestRandom
Lucene.Net.Tests.Facet.dll: Lucene.Net.Facet.SortedSet.TestSortedSetDocValuesFacets.TestStaleState
Lucene.Net.Tests.Facet.dll: Lucene.Net.Facet.Taxonomy.Directory.TestAddTaxonomy.TestConcurrency
Lucene.Net.Tests.Facet.dll: Lucene.Net.Facet.Taxonomy.Directory.TestAddTaxonomy.TestSimple
Lucene.Net.Tests.Facet.dll: Lucene.Net.Facet.Taxonomy.Directory.TestConcurrentFacetedIndexing.TestConcurrency
Lucene.Net.Tests.Facet.dll: Lucene.Net.Facet.Taxonomy.Directory.TestDirectoryTaxonomyReader.TestFreshReadRecreatedTaxonomy
Lucene.Net.Tests.Facet.dll: Lucene.Net.Facet.Taxonomy.Directory.TestDirectoryTaxonomyReader.TestGetChildren
Lucene.Net.Tests.Facet.dll: Lucene.Net.Facet.Taxonomy.Directory.TestDirectoryTaxonomyReader.TestOpenIfChangedManySegments
Lucene.Net.Tests.Facet.dll: Lucene.Net.Facet.Taxonomy.Directory.TestDirectoryTaxonomyReader.TestOpenIfChangedMergedSegment
Lucene.Net.Tests.Facet.dll: Lucene.Net.Facet.Taxonomy.Directory.TestDirectoryTaxonomyReader.TestOpenIfChangedNoChangesButSegmentMerges
Lucene.Net.Tests.Facet.dll: Lucene.Net.Facet.Taxonomy.Directory.TestDirectoryTaxonomyReader.TestOpenIfChangedReadRecreatedTaxonomy
Lucene.Net.Tests.Facet.dll: Lucene.Net.Facet.Taxonomy.Directory.TestDirectoryTaxonomyWriter.TestConcurrency
Lucene.Net.Tests.Facet.dll: Lucene.Net.Facet.Taxonomy.Directory.TestDirectoryTaxonomyWriter.TestHugeLabel
Lucene.Net.Tests.Facet.dll: Lucene.Net.Facet.Taxonomy.TestLRUHashMap.TestLru
Lucene.Net.Tests.Facet.dll: Lucene.Net.Facet.Taxonomy.TestSearcherTaxonomyManager.TestReplaceTaxonomyNrt
Lucene.Net.Tests.Facet.dll: Lucene.Net.Facet.Taxonomy.TestTaxonomyCombined.TestChildrenArrays
Lucene.Net.Tests.Facet.dll: Lucene.Net.Facet.Taxonomy.TestTaxonomyCombined.TestChildrenArraysGrowth
Lucene.Net.Tests.Facet.dll: Lucene.Net.Facet.Taxonomy.TestTaxonomyCombined.TestChildrenArraysInvariants
Lucene.Net.Tests.Facet.dll: Lucene.Net.Facet.Taxonomy.TestTaxonomyCombined.TestReaderBasic
Lucene.Net.Tests.Facet.dll: Lucene.Net.Facet.Taxonomy.TestTaxonomyCombined.TestReaderParent
Lucene.Net.Tests.Facet.dll: Lucene.Net.Facet.Taxonomy.TestTaxonomyCombined.TestSeparateReaderAndWriter
Lucene.Net.Tests.Facet.dll: Lucene.Net.Facet.Taxonomy.TestTaxonomyCombined.TestWriter
Lucene.Net.Tests.Facet.dll: Lucene.Net.Facet.Taxonomy.TestTaxonomyCombined.TestWriterCheckPaths
Lucene.Net.Tests.Facet.dll: Lucene.Net.Facet.Taxonomy.TestTaxonomyCombined.TestWriterCheckPaths2
Lucene.Net.Tests.Facet.dll: Lucene.Net.Facet.Taxonomy.TestTaxonomyCombined.TestWriterParent1
Lucene.Net.Tests.Facet.dll: Lucene.Net.Facet.Taxonomy.TestTaxonomyCombined.TestWriterParent2
Lucene.Net.Tests.Facet.dll: Lucene.Net.Facet.Taxonomy.TestTaxonomyCombined.TestWriterSimpler
Lucene.Net.Tests.Facet.dll: Lucene.Net.Facet.Taxonomy.TestTaxonomyCombined.TestWriterTwice
Lucene.Net.Tests.Facet.dll: Lucene.Net.Facet.Taxonomy.TestTaxonomyCombined.TestWriterTwice2
Lucene.Net.Tests.Facet.dll: Lucene.Net.Facet.Taxonomy.TestTaxonomyCombined.TestWriterTwice3
Lucene.Net.Tests.Facet.dll: Lucene.Net.Facet.Taxonomy.TestTaxonomyFacetAssociations.TestFloatSumAssociation
Lucene.Net.Tests.Facet.dll: Lucene.Net.Facet.Taxonomy.TestTaxonomyFacetAssociations.TestIntAndFloatAssocation
Lucene.Net.Tests.Facet.dll: Lucene.Net.Facet.Taxonomy.TestTaxonomyFacetAssociations.TestIntSumAssociation
Lucene.Net.Tests.Facet.dll: Lucene.Net.Facet.Taxonomy.TestTaxonomyFacetAssociations.TestIntSumAssociationDrillDown
Lucene.Net.Tests.Facet.dll: Lucene.Net.Facet.Taxonomy.TestTaxonomyFacetCounts.TestBasic
Lucene.Net.Tests.Facet.dll: Lucene.Net.Facet.Taxonomy.TestTaxonomyFacetCounts.TestChildCount
Lucene.Net.Tests.Facet.dll: Lucene.Net.Facet.Taxonomy.TestTaxonomyFacetCounts.TestCountRoot
Lucene.Net.Tests.Facet.dll: Lucene.Net.Facet.Taxonomy.TestTaxonomyFacetCounts.TestLabelWithDelimiter
Lucene.Net.Tests.Facet.dll: Lucene.Net.Facet.Taxonomy.TestTaxonomyFacetCounts.TestManyFacetsInOneDocument
Lucene.Net.Tests.Facet.dll: Lucene.Net.Facet.Taxonomy.TestTaxonomyFacetCounts.TestRandom
Lucene.Net.Tests.Facet.dll: Lucene.Net.Facet.Taxonomy.TestTaxonomyFacetCounts.TestSegmentsWithoutCategoriesOrResults
Lucene.Net.Tests.Facet.dll: Lucene.Net.Facet.Taxonomy.TestTaxonomyFacetCounts.TestSeparateIndexedFields
Lucene.Net.Tests.Facet.dll: Lucene.Net.Facet.Taxonomy.TestTaxonomyFacetCounts.TestSparseFacets
Lucene.Net.Tests.Facet.dll: Lucene.Net.Facet.Taxonomy.TestTaxonomyFacetCounts2
Lucene.Net.Tests.Facet.dll: Lucene.Net.Facet.Taxonomy.TestTaxonomyFacetCounts2.TestAllCounts
Lucene.Net.Tests.Facet.dll: Lucene.Net.Facet.Taxonomy.TestTaxonomyFacetCounts2.TestBigNumResults
Lucene.Net.Tests.Facet.dll: Lucene.Net.Facet.Taxonomy.TestTaxonomyFacetCounts2.TestDifferentNumResults
Lucene.Net.Tests.Facet.dll: Lucene.Net.Facet.Taxonomy.TestTaxonomyFacetCounts2.TestNoParents
Lucene.Net.Tests.Facet.dll: Lucene.Net.Facet.Taxonomy.TestTaxonomyFacetSumValueSource.TestBasic
Lucene.Net.Tests.Facet.dll: Lucene.Net.Facet.Taxonomy.TestTaxonomyFacetSumValueSource.TestCountAndSumScore
Lucene.Net.Tests.Facet.dll: Lucene.Net.Facet.Taxonomy.TestTaxonomyFacetSumValueSource.TestNoScore
Lucene.Net.Tests.Facet.dll: Lucene.Net.Facet.Taxonomy.TestTaxonomyFacetSumValueSource.TestRandom
Lucene.Net.Tests.Facet.dll: Lucene.Net.Facet.Taxonomy.TestTaxonomyFacetSumValueSource.TestRollupValues
Lucene.Net.Tests.Queries.dll: Lucene.Net.Tests.Queries.CommonTermsQueryTest.TestEqualsHashCode
Lucene.Net.Tests.dll: Lucene.Net.Codecs.Lucene40.TestLucene40DocValuesFormat.BaseDocValuesFormatTestCase.TestBinaryVariableLengthVsStoredFields
Lucene.Net.Tests.dll: Lucene.Net.Codecs.Lucene40.TestLucene40DocValuesFormat.BaseDocValuesFormatTestCase.TestEmptyBinaryValueOnPageSizes
Lucene.Net.Tests.dll: Lucene.Net.Codecs.Lucene40.TestLucene40DocValuesFormat.BaseDocValuesFormatTestCase.TestHugeBinaryValueLimit
Lucene.Net.Tests.dll: Lucene.Net.Codecs.Lucene40.TestLucene40DocValuesFormat.BaseDocValuesFormatTestCase.TestThreads
Lucene.Net.Tests.dll: Lucene.Net.Codecs.Lucene40.TestLucene40DocValuesFormat.BaseIndexFileFormatTestCase.TestMergeStability
Lucene.Net.Tests.dll: Lucene.Net.Codecs.Lucene41.TestBlockPostingsFormat2
Lucene.Net.Tests.dll: Lucene.Net.Codecs.Lucene41.TestBlockPostingsFormat3.Test
Lucene.Net.Tests.dll: Lucene.Net.Codecs.Lucene41.TestLucene41StoredFieldsFormat.BaseStoredFieldsFormatTestCase.TestConcurrentReads
Lucene.Net.Tests.dll: Lucene.Net.Codecs.Lucene42.TestLucene42DocValuesFormat.BaseDocValuesFormatTestCase.TestVeryLargeButLegalSortedBytes
Lucene.Net.Tests.dll: Lucene.Net.Index.TestAtomicUpdate.TestAtomicUpdates
Lucene.Net.Tests.dll: Lucene.Net.Index.TestDocumentsWriterStallControl.TestSimpleStall
Lucene.Net.Tests.dll: Lucene.Net.Index.TestDuelingCodecs.TestEquals
Lucene.Net.Tests.dll: Lucene.Net.Index.TestIndexWriterExceptions.TestExceptionDuringRollback
Lucene.Net.Tests.dll: Lucene.Net.Index.TestIndexWriterExceptions.TestExceptionOnMergeInit
Lucene.Net.Tests.dll: Lucene.Net.Index.TestIndexWriterReader.TestDuringAddDelete
Lucene.Net.Tests.dll: Lucene.Net.Index.TestStressIndexing.TestStressIndexAndSearching
Lucene.Net.Tests.dll: Lucene.Net.Index.TestTermdocPerf.TestTermDocPerf
Lucene.Net.Tests.dll: Lucene.Net.Search.Spans.TestSpanMultiTermQueryWrapper.TestFuzzy2
Lucene.Net.Tests.dll: Lucene.Net.Search.TestFuzzyQuery.TestTieBreaker
Lucene.Net.Tests.dll: Lucene.Net.Search.TestNumericRangeQuery32.TestInfiniteValues
Lucene.Net.Tests.dll: Lucene.Net.Search.TestNumericRangeQuery64.TestInfiniteValues
Lucene.Net.Tests.dll: Lucene.Net.Search.TestSearchAfter.TestQueries
Lucene.Net.Tests.dll: Lucene.Net.Search.TestSimpleExplanations.TestDMQ8
Lucene.Net.Tests.dll: Lucene.Net.Search.TestTermVectors
Lucene.Net.Tests.dll: Lucene.Net.Search.TestTermVectors.TestMixedVectrosVectors
Lucene.Net.Tests.dll: Lucene.Net.Search.TestTopDocsMerge.TestSort_1
Lucene.Net.Tests.dll: Lucene.Net.Search.TestTopDocsMerge.TestSort_2
Lucene.Net.Tests.dll: Lucene.Net.Store.TestBufferedIndexInput.TestSetBufferSize
Lucene.Net.Tests.dll: Lucene.Net.Store.TestMockDirectoryWrapper.TestDiskFull
Lucene.Net.Tests.dll: Lucene.Net.Tests.TestAssertions.TestTokenStreams
Lucene.Net.Tests.dll: Lucene.Net.Util.Packed.TestEliasFanoSequence.TestMonotoneSequencesLonger
Lucene.Net.Tests.dll: Lucene.Net.Util.Packed.TestEliasFanoSequence.TestStrictMonotoneSequencesLonger
Lucene.Net.Tests.dll: Lucene.Net.Util.TestDocIdBitSet.BaseDocIdSetTestCase`1.TestAgainstBitSet
Lucene.Net.Tests.dll: Lucene.Net.Util.TestFixedBitSet.BaseDocIdSetTestCase`1.TestAgainstBitSet
Lucene.Net.Tests.dll: Lucene.Net.Util.TestIndexableBinaryStringTools.TestEncodedSortability
Lucene.Net.Tests.dll: Lucene.Net.Util.TestPagedBytes.TestDataInputOutput
Lucene.Net.Tests.dll: Lucene.Net.Util.TestPagedBytes.TestOverflow



Newly failed tests details (only first 3 failures shown here)
==================================================================
Lucene.Net.Tests.dll: Lucene.Net.Index.TestCrash.TestCrashWhileIndexing (new) =================
Test(s) failed. System.ArgumentException : When specifying MemoryMappedFileAccess.Read access,
the capacity must not be larger than the file size.
   at System.IO.MemoryMappedFiles.MemoryMappedFile.CreateFromFile(FileStream fileStream, String
mapName, Int64 capacity, MemoryMappedFileAccess access, MemoryMappedFileSecurity memoryMappedFileSecurity,
HandleInheritability inheritability, Boolean leaveOpen)
   at Lucene.Net.Store.MMapDirectory.Map(MMapIndexInput input, FileStream fc, Int64 offset,
Int64 length) in z:\Builds\work\bcdbe6b8cc677a49\src\Lucene.Net.Core\Store\MMapDirectory.cs:line
356
   at Lucene.Net.Store.MMapDirectory.MMapIndexInput..ctor(MMapDirectory outerInstance, String
resourceDescription, FileStream fc) in z:\Builds\work\bcdbe6b8cc677a49\src\Lucene.Net.Core\Store\MMapDirectory.cs:line
263
   at Lucene.Net.Store.MMapDirectory.OpenInput(String name, IOContext context) in z:\Builds\work\bcdbe6b8cc677a49\src\Lucene.Net.Core\Store\MMapDirectory.cs:line
205
   at Lucene.Net.Store.Directory.Copy(Directory to, String src, String dest, IOContext context)
in z:\Builds\work\bcdbe6b8cc677a49\src\Lucene.Net.Core\Store\Directory.cs:line 190
   at Lucene.Net.Store.MockDirectoryWrapper.Copy(Directory to, String src, String dest, IOContext
context) in z:\Builds\work\bcdbe6b8cc677a49\src\Lucene.Net.TestFramework\Store\MockDirectoryWrapper.cs:line
1296
   at Lucene.Net.Util.LuceneTestCase.NewDirectory(Random r, Directory d) in z:\Builds\work\bcdbe6b8cc677a49\src\Lucene.Net.TestFramework\Util\LuceneTestCase.cs:line
1181
   at Lucene.Net.Index.TestCrash.TestCrashWhileIndexing() in z:\Builds\work\bcdbe6b8cc677a49\src\Lucene.Net.Tests\core\Index\TestCrash.cs:line
90
Lucene.Net.Tests.dll: Lucene.Net.Index.TestDocTermOrds.TestRandomWithPrefix (new) =================
Test(s) failed. System.ArgumentException : A SPI class of type PostingsFormat with name 'Lucene41WithOrds'
does not exist. You need to add the corresponding JAR file supporting this SPI to your classpath.The
current classpath supports the following names: System.Collections.Generic.HashSet`1[System.String]
   at Lucene.Net.Util.NamedSPILoader`1.Lookup(String name) in z:\Builds\work\bcdbe6b8cc677a49\src\Lucene.Net.Core\Util\NamedSPILoader.cs:line
118
   at Lucene.Net.Codecs.PostingsFormat.ForName(String name) in z:\Builds\work\bcdbe6b8cc677a49\src\Lucene.Net.Core\Codecs\PostingsFormat.cs:line
105
   at Lucene.Net.Index.TestDocTermOrds.TestRandomWithPrefix() in z:\Builds\work\bcdbe6b8cc677a49\src\Lucene.Net.Tests\core\Index\TestDocTermOrds.cs:line
231
Lucene.Net.Tests.dll: Lucene.Net.Index.TestIndexWriter.TestTwoThreadsInterruptDeadlock (new)
=================
Test(s) failed.   Expected: False
  But was:  True

   at NUnit.Framework.Assert.That(Object actual, IResolveConstraint expression, String message,
Object[] args)
   at NUnit.Framework.Assert.IsFalse(Boolean condition)
   at Lucene.Net.Index.TestIndexWriter.TestTwoThreadsInterruptDeadlock() in z:\Builds\work\bcdbe6b8cc677a49\src\Lucene.Net.Tests\core\Index\TestIndexWriter.cs:line
1458
------- Stderr: -------
TEST: got interrupt
   at System.Threading.Monitor.ReliableEnter(Object obj, Boolean& lockTaken)
   at Lucene.Net.Index.IndexWriter.PublishFlushedSegment(SegmentCommitInfo newSegment, FrozenBufferedUpdates
packet, FrozenBufferedUpdates globalPacket) in z:\Builds\work\bcdbe6b8cc677a49\src\Lucene.Net.Core\Index\IndexWriter.cs:line
0
   at Lucene.Net.Index.DocumentsWriterFlushQueue.FlushTicket.PublishFlushedSegment(IndexWriter
indexWriter, FlushedSegment newSegment, FrozenBufferedUpdates globalPacket) in z:\Builds\work\bcdbe6b8cc677a49\src\Lucene.Net.Core\Index\DocumentsWriterFlushQueue.cs:line
259
   at Lucene.Net.Index.DocumentsWriterFlushQueue.FlushTicket.FinishFlush(IndexWriter indexWriter,
FlushedSegment newSegment, FrozenBufferedUpdates bufferedUpdates) in z:\Builds\work\bcdbe6b8cc677a49\src\Lucene.Net.Core\Index\DocumentsWriterFlushQueue.cs:line
279
   at Lucene.Net.Index.DocumentsWriterFlushQueue.SegmentFlushTicket.Publish(IndexWriter writer)
in z:\Builds\work\bcdbe6b8cc677a49\src\Lucene.Net.Core\Index\DocumentsWriterFlushQueue.cs:line
319
   at Lucene.Net.Index.DocumentsWriterFlushQueue.InnerPurge(IndexWriter writer) in z:\Builds\work\bcdbe6b8cc677a49\src\Lucene.Net.Core\Index\DocumentsWriterFlushQueue.cs:line
150
   at Lucene.Net.Index.DocumentsWriterFlushQueue.ForcePurge(IndexWriter writer) in z:\Builds\work\bcdbe6b8cc677a49\src\Lucene.Net.Core\Index\DocumentsWriterFlushQueue.cs:line
179
   at Lucene.Net.Index.DocumentsWriter.FlushAllThreads(IndexWriter indexWriter) in z:\Builds\work\bcdbe6b8cc677a49\src\Lucene.Net.Core\Index\DocumentsWriter.cs:line
781
   at Lucene.Net.Index.IndexWriter.GetReader(Boolean applyAllDeletes) in z:\Builds\work\bcdbe6b8cc677a49\src\Lucene.Net.Core\Index\IndexWriter.cs:line
399
   at Lucene.Net.Index.DirectoryReader.Open(IndexWriter writer, Boolean applyAllDeletes) in
z:\Builds\work\bcdbe6b8cc677a49\src\Lucene.Net.Core\Index\DirectoryReader.cs:line 115
   at Lucene.Net.Index.TestIndexWriter.IndexerThreadInterrupt.Run() in z:\Builds\work\bcdbe6b8cc677a49\src\Lucene.Net.Tests\core\Index\TestIndexWriter.cs:line
1253
Unhandled exception in remote appdomain: NUnit.Framework.AssertionException:   Expected: True
  But was:  False

   at NUnit.Framework.Assert.That(Object actual, IResolveConstraint expression, String message,
Object[] args)
   at NUnit.Framework.Assert.IsTrue(Boolean condition)
   at Lucene.Net.Index.TestIndexWriter.IndexerThreadInterrupt.Run() in z:\Builds\work\bcdbe6b8cc677a49\src\Lucene.Net.Tests\core\Index\TestIndexWriter.cs:line
1302
   at System.Threading.ThreadHelper.ThreadStart_Context(Object state)
   at System.Threading.ExecutionContext.RunInternal(ExecutionContext executionContext, ContextCallback
callback, Object state, Boolean preserveSyncCtx)
   at System.Threading.ExecutionContext.Run(ExecutionContext executionContext, ContextCallback
callback, Object state, Boolean preserveSyncCtx)
   at System.Threading.ExecutionContext.Run(ExecutionContext executionContext, ContextCallback
callback, Object state)
   at System.Threading.ThreadHelper.ThreadStart()
FAILED; unexpected exception
   at Lucene.Net.Util.IOUtils.ReThrowUnchecked(Exception th) in z:\Builds\work\bcdbe6b8cc677a49\src\Lucene.Net.Core\Util\IOUtils.cs:line
435
   at Lucene.Net.Util.IOUtils.ReThrow(Exception th) in z:\Builds\work\bcdbe6b8cc677a49\src\Lucene.Net.Core\Util\IOUtils.cs:line
418
   at Lucene.Net.Index.IndexWriter.HandleMergeException(Exception t, OneMerge merge) in z:\Builds\work\bcdbe6b8cc677a49\src\Lucene.Net.Core\Index\IndexWriter.cs:line
4527
   at Lucene.Net.Index.IndexWriter.Merge(OneMerge merge) in z:\Builds\work\bcdbe6b8cc677a49\src\Lucene.Net.Core\Index\IndexWriter.cs:line
4565
   at Lucene.Net.Index.SerialMergeScheduler.Merge(IndexWriter writer, MergeTrigger trigger,
Boolean newMergesFound) in z:\Builds\work\bcdbe6b8cc677a49\src\Lucene.Net.Core\Index\SerialMergeScheduler.cs:line
48
   at Lucene.Net.Index.IndexWriter.MaybeMerge(MergeTrigger trigger, Int32 maxNumSegments)
in z:\Builds\work\bcdbe6b8cc677a49\src\Lucene.Net.Core\Index\IndexWriter.cs:line 2384
   at Lucene.Net.Index.IndexWriter.ForceMerge(Int32 maxNumSegments, Boolean doWait) in z:\Builds\work\bcdbe6b8cc677a49\src\Lucene.Net.Core\Index\IndexWriter.cs:line
2156
   at Lucene.Net.Index.IndexWriter.ForceMerge(Int32 maxNumSegments) in z:\Builds\work\bcdbe6b8cc677a49\src\Lucene.Net.Core\Index\IndexWriter.cs:line
2100
   at Lucene.Net.Index.TestIndexWriter.IndexerThreadInterrupt.Run() in z:\Builds\work\bcdbe6b8cc677a49\src\Lucene.Net.Tests\core\Index\TestIndexWriter.cs:line
1274
Unhandled exception in remote appdomain: System.Exception: System.Exception: MockDirectoryWrapper:
cannot close: there are still open locks: write.lock
   at Lucene.Net.Store.MockDirectoryWrapper.Dispose() in z:\Builds\work\bcdbe6b8cc677a49\src\Lucene.Net.TestFramework\Store\MockDirectoryWrapper.cs:line
923
   at Lucene.Net.Util.IOUtils.Close(IDisposable[] objects) in z:\Builds\work\bcdbe6b8cc677a49\src\Lucene.Net.Core\Util\IOUtils.cs:line
163 ---> System.Exception: MockDirectoryWrapper: cannot close: there are still open locks:
write.lock
   at Lucene.Net.Store.MockDirectoryWrapper.Dispose() in z:\Builds\work\bcdbe6b8cc677a49\src\Lucene.Net.TestFramework\Store\MockDirectoryWrapper.cs:line
923
   at Lucene.Net.Util.IOUtils.Close(IDisposable[] objects) in z:\Builds\work\bcdbe6b8cc677a49\src\Lucene.Net.Core\Util\IOUtils.cs:line
163
   --- End of inner exception stack trace ---
   at Lucene.Net.Util.IOUtils.ReThrowUnchecked(Exception th) in z:\Builds\work\bcdbe6b8cc677a49\src\Lucene.Net.Core\Util\IOUtils.cs:line
435
   at Lucene.Net.Util.IOUtils.ReThrow(Exception th) in z:\Builds\work\bcdbe6b8cc677a49\src\Lucene.Net.Core\Util\IOUtils.cs:line
418
   at Lucene.Net.Util.IOUtils.Close(IDisposable[] objects) in z:\Builds\work\bcdbe6b8cc677a49\src\Lucene.Net.Core\Util\IOUtils.cs:line
176
   at Lucene.Net.Index.TestIndexWriter.IndexerThreadInterrupt.Run() in z:\Builds\work\bcdbe6b8cc677a49\src\Lucene.Net.Tests\core\Index\TestIndexWriter.cs:line
1362
   at System.Threading.ThreadHelper.ThreadStart_Context(Object state)
   at System.Threading.ExecutionContext.RunInternal(ExecutionContext executionContext, ContextCallback
callback, Object state, Boolean preserveSyncCtx)
   at System.Threading.ExecutionContext.Run(ExecutionContext executionContext, ContextCallback
callback, Object state, Boolean preserveSyncCtx)
   at System.Threading.ExecutionContext.Run(ExecutionContext executionContext, ContextCallback
callback, Object state)
   at System.Threading.ThreadHelper.ThreadStart()
see all newly failed tests: http://teamcity.codebetter.com/viewLog.html?buildId=186584&buildTypeId=LuceneNet_LuceneNetNightly
Changes included (1 change)
====================================================
Change 464fd5054e8fab75d022cfcf5ea09f9d98bcfb6c by itamar (1 file):
Removing GetCanonicalPath to match Lucene logic of not creating the directory first

Fixes #117 and closes #70

Related:
https://github.com/guidotag/lucenenet/commit/6137a84724a5424cb19aee261a6415a88fd839c2
https://github.com/laimis/lucenenet/commit/46b3b794dca8a035e7c751574b931449c5502316


see more information about changed files: http://teamcity.codebetter.com/viewLog.html?tab=buildChangesDiv&buildId=186584&buildTypeId=LuceneNet_LuceneNetNightly

============================================================================
Configure email notifications: http://teamcity.codebetter.com/profile.html?init=1&tab=userNotifications

Mime
  • Unnamed multipart/alternative (inline, None, 0 bytes)
View raw message