lucenenet-dev mailing list archives

Site index · List index
Message view « Date » · « Thread »
Top « Date » · « Thread »
From t.@codebetter.com
Subject [TeamCity, FAILED] Build Lucene.NET :: Lucene.NET Core [master] #349
Date Wed, 04 Mar 2015 11:35:19 GMT
Build Lucene.NET :: Lucene.NET Core [master] #349 failed (Tests failed: 50 (6 new), passed: 2416, ignored: 111).
Agent: JetBrains-dotnet-agent02
Build results: http://teamcity.codebetter.com/viewLog.html?buildId=184926&buildTypeId=LuceneNet_Core

Failed Tests Summary:
Newly failed tests (6 tests, alphabetically ordered)
==================================================================
Lucene.Net.Tests.dll: Lucene.Net.Codecs.Compressing.TestCompressingStoredFieldsFormat.BaseStoredFieldsFormatTestCase.TestConcurrentReads
Lucene.Net.Tests.dll: Lucene.Net.Codecs.Lucene3x.TestLucene3xStoredFieldsFormat.BaseStoredFieldsFormatTestCase.TestConcurrentReads
Lucene.Net.Tests.dll: Lucene.Net.Index.TestIndexWriter.TestThreadInterruptDeadlock
Lucene.Net.Tests.dll: Lucene.Net.Index.TestIndexWriterReader.TestDuringAddDelete
Lucene.Net.Tests.dll: Lucene.Net.Index.TestIndexWriterReader.TestDuringAddIndexes
Lucene.Net.Tests.dll: Lucene.Net.Store.TestMockDirectoryWrapper.TestDiskFull

Other failed tests (44 tests, alphabetically ordered)
==================================================================
Lucene.Net.Tests.dll: Lucene.Net.Codecs.Lucene40.TestLucene40DocValuesFormat.BaseDocValuesFormatTestCase.TestBinaryVariableLengthVsStoredFields
Lucene.Net.Tests.dll: Lucene.Net.Codecs.Lucene40.TestLucene40DocValuesFormat.BaseDocValuesFormatTestCase.TestEmptyBinaryValueOnPageSizes
Lucene.Net.Tests.dll: Lucene.Net.Codecs.Lucene40.TestLucene40DocValuesFormat.BaseDocValuesFormatTestCase.TestThreads
Lucene.Net.Tests.dll: Lucene.Net.Codecs.Lucene41.TestBlockPostingsFormat2
Lucene.Net.Tests.dll: Lucene.Net.Codecs.Lucene41.TestBlockPostingsFormat3.Test
Lucene.Net.Tests.dll: Lucene.Net.Codecs.Lucene42.TestLucene42DocValuesFormat.BaseDocValuesFormatTestCase.TestVeryLargeButLegalSortedBytes
Lucene.Net.Tests.dll: Lucene.Net.Index.TestDirectoryReader.TestNoDir
Lucene.Net.Tests.dll: Lucene.Net.Index.TestDocumentsWriterStallControl.TestSimpleStall
Lucene.Net.Tests.dll: Lucene.Net.Index.TestDuelingCodecs.TestEquals
Lucene.Net.Tests.dll: Lucene.Net.Index.TestIndexWriterExceptions.TestExceptionOnMergeInit
Lucene.Net.Tests.dll: Lucene.Net.Index.TestNRTThreads.TestNRTThreads_Mem
Lucene.Net.Tests.dll: Lucene.Net.Index.TestTermdocPerf.TestTermDocPerf
Lucene.Net.Tests.dll: Lucene.Net.Search.Payloads.TestPayloadNearQuery.Test
Lucene.Net.Tests.dll: Lucene.Net.Search.Payloads.TestPayloadNearQuery.TestAverageFunction
Lucene.Net.Tests.dll: Lucene.Net.Search.Payloads.TestPayloadNearQuery.TestComplexNested
Lucene.Net.Tests.dll: Lucene.Net.Search.Payloads.TestPayloadNearQuery.TestLongerSpan
Lucene.Net.Tests.dll: Lucene.Net.Search.Payloads.TestPayloadNearQuery.TestMaxFunction
Lucene.Net.Tests.dll: Lucene.Net.Search.Payloads.TestPayloadNearQuery.TestMinFunction
Lucene.Net.Tests.dll: Lucene.Net.Search.Payloads.TestPayloadNearQuery.TestPayloadNear
Lucene.Net.Tests.dll: Lucene.Net.Search.Spans.TestSpanMultiTermQueryWrapper.TestFuzzy2
Lucene.Net.Tests.dll: Lucene.Net.Search.TestFuzzyQuery.TestTieBreaker
Lucene.Net.Tests.dll: Lucene.Net.Search.TestMultiPhraseQuery.TestMultiSloppyWithRepeats
Lucene.Net.Tests.dll: Lucene.Net.Search.TestMultiValuedNumericRangeQuery.TestMultiValuedNRQ
Lucene.Net.Tests.dll: Lucene.Net.Search.TestNumericRangeQuery32.TestInfiniteValues
Lucene.Net.Tests.dll: Lucene.Net.Search.TestNumericRangeQuery64.TestInfiniteValues
Lucene.Net.Tests.dll: Lucene.Net.Search.TestRegexpQuery.TestBacktracking
Lucene.Net.Tests.dll: Lucene.Net.Search.TestRegexpQuery.TestRegexComplement
Lucene.Net.Tests.dll: Lucene.Net.Search.TestRegexpRandom.TestRegexps
Lucene.Net.Tests.dll: Lucene.Net.Search.TestSearchAfter.TestQueries
Lucene.Net.Tests.dll: Lucene.Net.Search.TestSearcherManager.TestSearcherManager_Mem
Lucene.Net.Tests.dll: Lucene.Net.Search.TestSimpleExplanations.TestDMQ8
Lucene.Net.Tests.dll: Lucene.Net.Search.TestTermVectors
Lucene.Net.Tests.dll: Lucene.Net.Search.TestTermVectors.TestMixedVectrosVectors
Lucene.Net.Tests.dll: Lucene.Net.Search.TestTopDocsMerge.TestSort_1
Lucene.Net.Tests.dll: Lucene.Net.Search.TestTopDocsMerge.TestSort_2
Lucene.Net.Tests.dll: Lucene.Net.Search.TestWildcardRandom.TestWildcards
Lucene.Net.Tests.dll: Lucene.Net.Store.TestBufferedIndexInput.TestSetBufferSize
Lucene.Net.Tests.dll: Lucene.Net.Store.TestFileSwitchDirectory.TestNoDir
Lucene.Net.Tests.dll: Lucene.Net.Store.TestNRTCachingDirectory.TestNoDir
Lucene.Net.Tests.dll: Lucene.Net.Tests.TestAssertions.TestTokenStreams
Lucene.Net.Tests.dll: Lucene.Net.Util.Automaton.TestUTF32ToUTF8.TestRandomRegexes
Lucene.Net.Tests.dll: Lucene.Net.Util.Packed.TestEliasFanoSequence.TestMonotoneSequences
Lucene.Net.Tests.dll: Lucene.Net.Util.TestIndexableBinaryStringTools.TestEncodedSortability
Lucene.Net.Tests.dll: Lucene.Net.Util.TestOpenBitSet.TestSmall



Newly failed tests details (only first 3 failures shown here)
==================================================================
Lucene.Net.Tests.dll: Lucene.Net.Codecs.Compressing.TestCompressingStoredFieldsFormat.BaseStoredFieldsFormatTestCase.TestConcurrentReads (new) =================
Test(s) failed. System.InvalidOperationException : Expected 1 hit, got 0
   at Lucene.Net.Index.BaseStoredFieldsFormatTestCase.TestConcurrentReads() in z:\Builds\work\bcdbe6b8cc677a49\src\Lucene.Net.TestFramework\Index\BaseStoredFieldsFormatTestCase.cs:line 453
Lucene.Net.Tests.dll: Lucene.Net.Codecs.Lucene3x.TestLucene3xStoredFieldsFormat.BaseStoredFieldsFormatTestCase.TestConcurrentReads (new) =================
Test(s) failed. System.InvalidOperationException : Expected 1 hit, got 0
   at Lucene.Net.Index.BaseStoredFieldsFormatTestCase.TestConcurrentReads() in z:\Builds\work\bcdbe6b8cc677a49\src\Lucene.Net.TestFramework\Index\BaseStoredFieldsFormatTestCase.cs:line 453
Lucene.Net.Tests.dll: Lucene.Net.Index.TestIndexWriter.TestThreadInterruptDeadlock (new) =================
Test(s) failed.   Expected: False
  But was:  True

   at NUnit.Framework.Assert.That(Object actual, IResolveConstraint expression, String message, Object[] args)
   at NUnit.Framework.Assert.IsFalse(Boolean condition)
   at Lucene.Net.Index.TestIndexWriter.TestThreadInterruptDeadlock() in z:\Builds\work\bcdbe6b8cc677a49\src\Lucene.Net.Tests\core\Index\TestIndexWriter.cs:line 1412
------- Stderr: -------
TEST: got interrupt
   at Lucene.Net.Store.SlowClosingMockIndexInputWrapper.Dispose() in z:\Builds\work\bcdbe6b8cc677a49\src\Lucene.Net.TestFramework\Store\SlowClosingMockIndexInputWrapper.cs:line 43
   at Lucene.Net.Codecs.BlockTreeTermsReader..ctor(Directory dir, FieldInfos fieldInfos, SegmentInfo info, PostingsReaderBase postingsReader, IOContext ioContext, String segmentSuffix, Int32 indexDivisor) in z:\Builds\work\bcdbe6b8cc677a49\src\Lucene.Net.Core\Codecs\BlockTreeTermsReader.cs:line 208
   at Lucene.Net.Codecs.Lucene41.Lucene41PostingsFormat.FieldsProducer(SegmentReadState state) in z:\Builds\work\bcdbe6b8cc677a49\src\Lucene.Net.Core\Codecs\Lucene41\Lucene41PostingsFormat.cs:line 432
   at Lucene.Net.Codecs.Perfield.PerFieldPostingsFormat.FieldsReader..ctor(PerFieldPostingsFormat outerInstance, SegmentReadState readState) in z:\Builds\work\bcdbe6b8cc677a49\src\Lucene.Net.Core\Codecs\Perfield\PerFieldPostingsFormat.cs:line 216
   at Lucene.Net.Codecs.Perfield.PerFieldPostingsFormat.FieldsProducer(SegmentReadState state) in z:\Builds\work\bcdbe6b8cc677a49\src\Lucene.Net.Core\Codecs\Perfield\PerFieldPostingsFormat.cs:line 277
   at Lucene.Net.Index.SegmentCoreReaders..ctor(SegmentReader owner, Directory dir, SegmentCommitInfo si, IOContext context, Int32 termsIndexDivisor) in z:\Builds\work\bcdbe6b8cc677a49\src\Lucene.Net.Core\Index\SegmentCoreReaders.cs:line 151
   at Lucene.Net.Index.SegmentReader..ctor(SegmentCommitInfo si, Int32 termInfosIndexDivisor, IOContext context) in z:\Builds\work\bcdbe6b8cc677a49\src\Lucene.Net.Core\Index\SegmentReader.cs:line 111
   at Lucene.Net.Index.ReadersAndUpdates.GetReader(IOContext context) in z:\Builds\work\bcdbe6b8cc677a49\src\Lucene.Net.Core\Index\ReadersAndUpdates.cs:line 167
   at Lucene.Net.Index.ReadersAndUpdates.GetReadOnlyClone(IOContext context) in z:\Builds\work\bcdbe6b8cc677a49\src\Lucene.Net.Core\Index\ReadersAndUpdates.cs:line 298
   at Lucene.Net.Index.StandardDirectoryReader.Open(IndexWriter writer, SegmentInfos infos, Boolean applyAllDeletes) in z:\Builds\work\bcdbe6b8cc677a49\src\Lucene.Net.Core\Index\StandardDirectoryReader.cs:line 126
   at Lucene.Net.Index.IndexWriter.GetReader(Boolean applyAllDeletes) in z:\Builds\work\bcdbe6b8cc677a49\src\Lucene.Net.Core\Index\IndexWriter.cs:line 413
   at Lucene.Net.Index.DirectoryReader.Open(IndexWriter writer, Boolean applyAllDeletes) in z:\Builds\work\bcdbe6b8cc677a49\src\Lucene.Net.Core\Index\DirectoryReader.cs:line 115
   at Lucene.Net.Index.TestIndexWriter.IndexerThreadInterrupt.Run() in z:\Builds\work\bcdbe6b8cc677a49\src\Lucene.Net.Tests\core\Index\TestIndexWriter.cs:line 1253
TEST: got interrupt
   at Lucene.Net.Index.IndexWriter.DoWait() in z:\Builds\work\bcdbe6b8cc677a49\src\Lucene.Net.Core\Index\IndexWriter.cs:line 5367
   at Lucene.Net.Index.IndexWriter.FinishMerges(Boolean waitForMerges) in z:\Builds\work\bcdbe6b8cc677a49\src\Lucene.Net.Core\Index\IndexWriter.cs:line 2778
   at Lucene.Net.Index.IndexWriter.DeleteAll() in z:\Builds\work\bcdbe6b8cc677a49\src\Lucene.Net.Core\Index\IndexWriter.cs:line 2696
   at Lucene.Net.Index.TestIndexWriter.IndexerThreadInterrupt.Run() in z:\Builds\work\bcdbe6b8cc677a49\src\Lucene.Net.Tests\core\Index\TestIndexWriter.cs:line 1241
TEST: got interrupt
   at Lucene.Net.Store.SlowOpeningMockIndexInputWrapper..ctor(MockDirectoryWrapper dir, String name, IndexInput delegate) in z:\Builds\work\bcdbe6b8cc677a49\src\Lucene.Net.TestFramework\Store\SlowOpeningMockIndexInputWrapper.cs:line 45
   at Lucene.Net.Store.MockDirectoryWrapper.OpenInput(String name, IOContext context) in z:\Builds\work\bcdbe6b8cc677a49\src\Lucene.Net.TestFramework\Store\MockDirectoryWrapper.cs:line 805
   at Lucene.Net.Store.FilterDirectory.OpenChecksumInput(String name, IOContext context) in z:\Builds\work\bcdbe6b8cc677a49\src\Lucene.Net.Core\Store\FilterDirectory.cs:line 132
   at Lucene.Net.Codecs.Lucene46.Lucene46FieldInfosReader.Read(Directory directory, String segmentName, String segmentSuffix, IOContext context) in z:\Builds\work\bcdbe6b8cc677a49\src\Lucene.Net.Core\Codecs\Lucene46\Lucene46FieldInfosReader.cs:line 50
   at Lucene.Net.Index.SegmentReader.ReadFieldInfos(SegmentCommitInfo info) in z:\Builds\work\bcdbe6b8cc677a49\src\Lucene.Net.Core\Index\SegmentReader.cs:line 258
   at Lucene.Net.Index.SegmentReader..ctor(SegmentCommitInfo si, Int32 termInfosIndexDivisor, IOContext context) in z:\Builds\work\bcdbe6b8cc677a49\src\Lucene.Net.Core\Index\SegmentReader.cs:line 110
   at Lucene.Net.Index.ReadersAndUpdates.GetReader(IOContext context) in z:\Builds\work\bcdbe6b8cc677a49\src\Lucene.Net.Core\Index\ReadersAndUpdates.cs:line 167
   at Lucene.Net.Index.BufferedUpdatesStream.ApplyDeletesAndUpdates(ReaderPool readerPool, IList`1 infos) in z:\Builds\work\bcdbe6b8cc677a49\src\Lucene.Net.Core\Index\BufferedUpdatesStream.cs:line 328
   at Lucene.Net.Index.IndexWriter.ApplyAllDeletesAndUpdates() in z:\Builds\work\bcdbe6b8cc677a49\src\Lucene.Net.Core\Index\IndexWriter.cs:line 3947
   at Lucene.Net.Index.IndexWriter.MaybeApplyDeletes(Boolean applyAllDeletes) in z:\Builds\work\bcdbe6b8cc677a49\src\Lucene.Net.Core\Index\IndexWriter.cs:line 3932
   at Lucene.Net.Index.IndexWriter.GetReader(Boolean applyAllDeletes) in z:\Builds\work\bcdbe6b8cc677a49\src\Lucene.Net.Core\Index\IndexWriter.cs:line 412
   at Lucene.Net.Index.DirectoryReader.Open(IndexWriter writer, Boolean applyAllDeletes) in z:\Builds\work\bcdbe6b8cc677a49\src\Lucene.Net.Core\Index\DirectoryReader.cs:line 115
   at Lucene.Net.Index.TestIndexWriter.IndexerThreadInterrupt.Run() in z:\Builds\work\bcdbe6b8cc677a49\src\Lucene.Net.Tests\core\Index\TestIndexWriter.cs:line 1253
TEST: got interrupt
   at Lucene.Net.Store.SlowOpeningMockIndexInputWrapper..ctor(MockDirectoryWrapper dir, String name, IndexInput delegate) in z:\Builds\work\bcdbe6b8cc677a49\src\Lucene.Net.TestFramework\Store\SlowOpeningMockIndexInputWrapper.cs:line 45
   at Lucene.Net.Store.MockDirectoryWrapper.OpenInput(String name, IOContext context) in z:\Builds\work\bcdbe6b8cc677a49\src\Lucene.Net.TestFramework\Store\MockDirectoryWrapper.cs:line 805
   at Lucene.Net.Codecs.BlockTreeTermsReader..ctor(Directory dir, FieldInfos fieldInfos, SegmentInfo info, PostingsReaderBase postingsReader, IOContext ioContext, String segmentSuffix, Int32 indexDivisor) in z:\Builds\work\bcdbe6b8cc677a49\src\Lucene.Net.Core\Codecs\BlockTreeTermsReader.cs:line 128
   at Lucene.Net.Codecs.Lucene41.Lucene41PostingsFormat.FieldsProducer(SegmentReadState state) in z:\Builds\work\bcdbe6b8cc677a49\src\Lucene.Net.Core\Codecs\Lucene41\Lucene41PostingsFormat.cs:line 432
   at Lucene.Net.Codecs.Perfield.PerFieldPostingsFormat.FieldsReader..ctor(PerFieldPostingsFormat outerInstance, SegmentReadState readState) in z:\Builds\work\bcdbe6b8cc677a49\src\Lucene.Net.Core\Codecs\Perfield\PerFieldPostingsFormat.cs:line 216
   at Lucene.Net.Codecs.Perfield.PerFieldPostingsFormat.FieldsProducer(SegmentReadState state) in z:\Builds\work\bcdbe6b8cc677a49\src\Lucene.Net.Core\Codecs\Perfield\PerFieldPostingsFormat.cs:line 277
   at Lucene.Net.Index.SegmentCoreReaders..ctor(SegmentReader owner, Directory dir, SegmentCommitInfo si, IOContext context, Int32 termsIndexDivisor) in z:\Builds\work\bcdbe6b8cc677a49\src\Lucene.Net.Core\Index\SegmentCoreReaders.cs:line 151
   at Lucene.Net.Index.SegmentReader..ctor(SegmentCommitInfo si, Int32 termInfosIndexDivisor, IOContext context) in z:\Builds\work\bcdbe6b8cc677a49\src\Lucene.Net.Core\Index\SegmentReader.cs:line 111
   at Lucene.Net.Index.ReadersAndUpdates.GetReader(IOContext context) in z:\Builds\work\bcdbe6b8cc677a49\src\Lucene.Net.Core\Index\ReadersAndUpdates.cs:line 167
   at Lucene.Net.Index.BufferedUpdatesStream.ApplyDeletesAndUpdates(ReaderPool readerPool, IList`1 infos) in z:\Builds\work\bcdbe6b8cc677a49\src\Lucene.Net.Core\Index\BufferedUpdatesStream.cs:line 328
   at Lucene.Net.Index.IndexWriter.ApplyAllDeletesAndUpdates() in z:\Builds\work\bcdbe6b8cc677a49\src\Lucene.Net.Core\Index\IndexWriter.cs:line 3947
   at Lucene.Net.Index.IndexWriter.MaybeApplyDeletes(Boolean applyAllDeletes) in z:\Builds\work\bcdbe6b8cc677a49\src\Lucene.Net.Core\Index\IndexWriter.cs:line 3932
   at Lucene.Net.Index.IndexWriter.DoFlush(Boolean applyAllDeletes) in z:\Builds\work\bcdbe6b8cc677a49\src\Lucene.Net.Core\Index\IndexWriter.cs:line 3893
   at Lucene.Net.Index.IndexWriter.CloseInternal(Boolean waitForMerges, Boolean doFlush) in z:\Builds\work\bcdbe6b8cc677a49\src\Lucene.Net.Core\Index\IndexWriter.cs:line 1177
   at Lucene.Net.Index.IndexWriter.Dispose(Boolean waitForMerges) in z:\Builds\work\bcdbe6b8cc677a49\src\Lucene.Net.Core\Index\IndexWriter.cs:line 1102
   at Lucene.Net.Index.TestIndexWriter.IndexerThreadInterrupt.Run() in z:\Builds\work\bcdbe6b8cc677a49\src\Lucene.Net.Tests\core\Index\TestIndexWriter.cs:line 1197
TEST: got interrupt
   at Lucene.Net.Store.SlowOpeningMockIndexInputWrapper..ctor(MockDirectoryWrapper dir, String name, IndexInput delegate) in z:\Builds\work\bcdbe6b8cc677a49\src\Lucene.Net.TestFramework\Store\SlowOpeningMockIndexInputWrapper.cs:line 45
   at Lucene.Net.Store.MockDirectoryWrapper.OpenInput(String name, IOContext context) in z:\Builds\work\bcdbe6b8cc677a49\src\Lucene.Net.TestFramework\Store\MockDirectoryWrapper.cs:line 805
   at Lucene.Net.Store.FilterDirectory.OpenChecksumInput(String name, IOContext context) in z:\Builds\work\bcdbe6b8cc677a49\src\Lucene.Net.Core\Store\FilterDirectory.cs:line 132
   at Lucene.Net.Codecs.Lucene46.Lucene46SegmentInfoReader.Read(Directory dir, String segment, IOContext context) in z:\Builds\work\bcdbe6b8cc677a49\src\Lucene.Net.Core\Codecs\Lucene46\Lucene46SegmentInfoReader.cs:line 47
   at Lucene.Net.Index.SegmentInfos.Read(Directory directory, String segmentFileName) in z:\Builds\work\bcdbe6b8cc677a49\src\Lucene.Net.Core\Index\SegmentInfos.cs:line 381
   at Lucene.Net.Index.SegmentInfos.FindSegmentsFileAnonymousInnerClassHelper.DoBody(String segmentFileName) in z:\Builds\work\bcdbe6b8cc677a49\src\Lucene.Net.Core\Index\SegmentInfos.cs:line 487
   at Lucene.Net.Index.SegmentInfos.FindSegmentsFile.Run(IndexCommit commit) in z:\Builds\work\bcdbe6b8cc677a49\src\Lucene.Net.Core\Index\SegmentInfos.cs:line 1031
   at Lucene.Net.Index.SegmentInfos.FindSegmentsFile.Run() in z:\Builds\work\bcdbe6b8cc677a49\src\Lucene.Net.Core\Index\SegmentInfos.cs:line 838
   at Lucene.Net.Index.SegmentInfos.Read(Directory directory) in z:\Builds\work\bcdbe6b8cc677a49\src\Lucene.Net.Core\Index\SegmentInfos.cs:line 469
   at Lucene.Net.Index.IndexWriter..ctor(Directory d, IndexWriterConfig conf) in z:\Builds\work\bcdbe6b8cc677a49\src\Lucene.Net.Core\Index\IndexWriter.cs:line 895
   at Lucene.Net.Index.TestIndexWriter.IndexerThreadInterrupt.Run() in z:\Builds\work\bcdbe6b8cc677a49\src\Lucene.Net.Tests\core\Index\TestIndexWriter.cs:line 1201
FAILED; unexpected exception
   at Lucene.Net.Util.IOUtils.ReThrowUnchecked(Exception th) in z:\Builds\work\bcdbe6b8cc677a49\src\Lucene.Net.Core\Util\IOUtils.cs:line 435
   at Lucene.Net.Util.IOUtils.ReThrow(Exception th) in z:\Builds\work\bcdbe6b8cc677a49\src\Lucene.Net.Core\Util\IOUtils.cs:line 418
   at Lucene.Net.Index.IndexWriter.ReaderPool.DropAll(Boolean doSave) in z:\Builds\work\bcdbe6b8cc677a49\src\Lucene.Net.Core\Index\IndexWriter.cs:line 656
   at Lucene.Net.Index.IndexWriter.DeleteAll() in z:\Builds\work\bcdbe6b8cc677a49\src\Lucene.Net.Core\Index\IndexWriter.cs:line 2708
   at Lucene.Net.Index.TestIndexWriter.IndexerThreadInterrupt.Run() in z:\Builds\work\bcdbe6b8cc677a49\src\Lucene.Net.Tests\core\Index\TestIndexWriter.cs:line 1241
Unhandled exception in remote appdomain: System.Exception: System.Exception: MockDirectoryWrapper: cannot close: there are still open locks: write.lock
   at Lucene.Net.Store.MockDirectoryWrapper.Dispose() in z:\Builds\work\bcdbe6b8cc677a49\src\Lucene.Net.TestFramework\Store\MockDirectoryWrapper.cs:line 923
   at Lucene.Net.Util.IOUtils.Close(IDisposable[] objects) in z:\Builds\work\bcdbe6b8cc677a49\src\Lucene.Net.Core\Util\IOUtils.cs:line 163 ---> System.Exception: MockDirectoryWrapper: cannot close: there are still open locks: write.lock
   at Lucene.Net.Store.MockDirectoryWrapper.Dispose() in z:\Builds\work\bcdbe6b8cc677a49\src\Lucene.Net.TestFramework\Store\MockDirectoryWrapper.cs:line 923
   at Lucene.Net.Util.IOUtils.Close(IDisposable[] objects) in z:\Builds\work\bcdbe6b8cc677a49\src\Lucene.Net.Core\Util\IOUtils.cs:line 163
   --- End of inner exception stack trace ---
   at Lucene.Net.Util.IOUtils.ReThrowUnchecked(Exception th) in z:\Builds\work\bcdbe6b8cc677a49\src\Lucene.Net.Core\Util\IOUtils.cs:line 435
   at Lucene.Net.Util.IOUtils.ReThrow(Exception th) in z:\Builds\work\bcdbe6b8cc677a49\src\Lucene.Net.Core\Util\IOUtils.cs:line 418
   at Lucene.Net.Util.IOUtils.Close(IDisposable[] objects) in z:\Builds\work\bcdbe6b8cc677a49\src\Lucene.Net.Core\Util\IOUtils.cs:line 176
   at Lucene.Net.Index.TestIndexWriter.IndexerThreadInterrupt.Run() in z:\Builds\work\bcdbe6b8cc677a49\src\Lucene.Net.Tests\core\Index\TestIndexWriter.cs:line 1362
   at System.Threading.ThreadHelper.ThreadStart_Context(Object state)
   at System.Threading.ExecutionContext.RunInternal(ExecutionContext executionContext, ContextCallback callback, Object state, Boolean preserveSyncCtx)
   at System.Threading.ExecutionContext.Run(ExecutionContext executionContext, ContextCallback callback, Object state, Boolean preserveSyncCtx)
   at System.Threading.ExecutionContext.Run(ExecutionContext executionContext, ContextCallback callback, Object state)
   at System.Threading.ThreadHelper.ThreadStart()
see all newly failed tests: http://teamcity.codebetter.com/viewLog.html?buildId=184926&buildTypeId=LuceneNet_Core



Other failed tests details (only first 3 failures shown here)
==================================================================
Lucene.Net.Tests.dll: Lucene.Net.Codecs.Lucene40.TestLucene40DocValuesFormat.BaseDocValuesFormatTestCase.TestBinaryVariableLengthVsStoredFields =================
Test(s) failed. System.IO.IOException : did not read all bytes from file: read 57 vs size 103 (resource: MockIndexInputWrapper(SlicedIndexInput(SlicedIndexInput(_0_2_dv.dat in RAMInputStream(name=_0.cfs)) in RAMInputStream(name=_0.cfs) slice=357:460)))
   at Lucene.Net.Util.IOUtils.ReThrow(Exception th) in z:\Builds\work\bcdbe6b8cc677a49\src\Lucene.Net.Core\Util\IOUtils.cs:line 416
   at Lucene.Net.Index.IndexWriter.HandleMergeException(Exception t, OneMerge merge) in z:\Builds\work\bcdbe6b8cc677a49\src\Lucene.Net.Core\Index\IndexWriter.cs:line 4527
   at Lucene.Net.Index.IndexWriter.Merge(OneMerge merge) in z:\Builds\work\bcdbe6b8cc677a49\src\Lucene.Net.Core\Index\IndexWriter.cs:line 4565
   at Lucene.Net.Index.SerialMergeScheduler.Merge(IndexWriter writer, MergeTrigger trigger, Boolean newMergesFound) in z:\Builds\work\bcdbe6b8cc677a49\src\Lucene.Net.Core\Index\SerialMergeScheduler.cs:line 48
   at Lucene.Net.Index.IndexWriter.MaybeMerge(MergeTrigger trigger, Int32 maxNumSegments) in z:\Builds\work\bcdbe6b8cc677a49\src\Lucene.Net.Core\Index\IndexWriter.cs:line 2384
   at Lucene.Net.Index.IndexWriter.PrepareCommitInternal() in z:\Builds\work\bcdbe6b8cc677a49\src\Lucene.Net.Core\Index\IndexWriter.cs:line 3635
   at Lucene.Net.Index.IndexWriter.CommitInternal() in z:\Builds\work\bcdbe6b8cc677a49\src\Lucene.Net.Core\Index\IndexWriter.cs:line 3762
   at Lucene.Net.Index.RandomIndexWriter.Commit() in z:\Builds\work\bcdbe6b8cc677a49\src\Lucene.Net.TestFramework\Index\RandomIndexWriter.cs:line 365
   at Lucene.Net.Index.BaseDocValuesFormatTestCase.DoTestBinaryVsStoredFields(Int32 minLength, Int32 maxLength) in z:\Builds\work\bcdbe6b8cc677a49\src\Lucene.Net.TestFramework\Index\BaseDocValuesFormatTestCase.cs:line 1615
   at Lucene.Net.Index.BaseDocValuesFormatTestCase.TestBinaryVariableLengthVsStoredFields() in z:\Builds\work\bcdbe6b8cc677a49\src\Lucene.Net.TestFramework\Index\BaseDocValuesFormatTestCase.cs:line 1663
Lucene.Net.Tests.dll: Lucene.Net.Codecs.Lucene40.TestLucene40DocValuesFormat.BaseDocValuesFormatTestCase.TestEmptyBinaryValueOnPageSizes =================
Test(s) failed. System.IO.IOException : did not read all bytes from file: read 31 vs size 32 (resource: MockIndexInputWrapper(SlicedIndexInput(SlicedIndexInput(_0_0_dv.dat in RAMInputStream(name=_0.cfs)) in RAMInputStream(name=_0.cfs) slice=184:216)))
   at Lucene.Net.Codecs.CodecUtil.CheckEOF(IndexInput in) in z:\Builds\work\bcdbe6b8cc677a49\src\Lucene.Net.Core\Codecs\CodecUtil.cs:line 255
   at Lucene.Net.Codecs.Lucene40.Lucene40DocValuesReader.LoadBytesFixedDeref(FieldInfo field) in z:\Builds\work\bcdbe6b8cc677a49\src\Lucene.Net.Core\Codecs\Lucene40\Lucene40DocValuesReader.cs:line 565
   at Lucene.Net.Codecs.Lucene40.Lucene40DocValuesReader.GetBinary(FieldInfo field) in z:\Builds\work\bcdbe6b8cc677a49\src\Lucene.Net.Core\Codecs\Lucene40\Lucene40DocValuesReader.cs:line 426
   at Lucene.Net.Index.SegmentReader.GetBinaryDocValues(String field) in z:\Builds\work\bcdbe6b8cc677a49\src\Lucene.Net.Core\Index\SegmentReader.cs:line 590
   at Lucene.Net.Index.MultiDocValues.GetBinaryValues(IndexReader r, String field) in z:\Builds\work\bcdbe6b8cc677a49\src\Lucene.Net.Core\Index\MultiDocValues.cs:line 270
   at Lucene.Net.Index.SlowCompositeReaderWrapper.GetBinaryDocValues(String field) in z:\Builds\work\bcdbe6b8cc677a49\src\Lucene.Net.Core\Index\SlowCompositeReaderWrapper.cs:line 108
   at Lucene.Net.Index.BaseDocValuesFormatTestCase.TestEmptyBinaryValueOnPageSizes() in z:\Builds\work\bcdbe6b8cc677a49\src\Lucene.Net.TestFramework\Index\BaseDocValuesFormatTestCase.cs:line 3497
Lucene.Net.Tests.dll: Lucene.Net.Codecs.Lucene40.TestLucene40DocValuesFormat.BaseDocValuesFormatTestCase.TestThreads =================
Test(s) failed. System.Exception : CheckIndex failed
   at Lucene.Net.Util.TestUtil.CheckIndex(Directory dir, Boolean crossCheckTermVectors) in z:\Builds\work\bcdbe6b8cc677a49\src\Lucene.Net.TestFramework\Util\TestUtil.cs:line 257
   at Lucene.Net.Store.MockDirectoryWrapper.Dispose() in z:\Builds\work\bcdbe6b8cc677a49\src\Lucene.Net.TestFramework\Store\MockDirectoryWrapper.cs:line 943
   at Lucene.Net.Index.BaseDocValuesFormatTestCase.TestThreads() in z:\Builds\work\bcdbe6b8cc677a49\src\Lucene.Net.TestFramework\Index\BaseDocValuesFormatTestCase.cs:line 3225
------- Stderr: -------
Unhandled exception in remote appdomain: Lucene.Net.Index.MergePolicy+MergeException: read past EOF: SlicedIndexInput(SlicedIndexInput(_0_2_dv.dat in RAMInputStream(name=_0.cfs)) in RAMInputStream(name=_0.cfs) slice=1707:1974)
   at Lucene.Net.Index.ConcurrentMergeScheduler.HandleMergeException(Exception exc) in z:\Builds\work\bcdbe6b8cc677a49\src\Lucene.Net.Core\Index\ConcurrentMergeScheduler.cs:line 718
   at Lucene.Net.Index.ConcurrentMergeScheduler.MergeThread.Run() in z:\Builds\work\bcdbe6b8cc677a49\src\Lucene.Net.Core\Index\ConcurrentMergeScheduler.cs:line 682
   at System.Threading.ThreadHelper.ThreadStart_Context(Object state)
   at System.Threading.ExecutionContext.RunInternal(ExecutionContext executionContext, ContextCallback callback, Object state, Boolean preserveSyncCtx)
   at System.Threading.ExecutionContext.Run(ExecutionContext executionContext, ContextCallback callback, Object state, Boolean preserveSyncCtx)
   at System.Threading.ExecutionContext.Run(ExecutionContext executionContext, ContextCallback callback, Object state)
   at System.Threading.ThreadHelper.ThreadStart()
Unhandled exception in remote appdomain: Lucene.Net.Index.MergePolicy+MergeException: read past EOF: SlicedIndexInput(SlicedIndexInput(_0_2_dv.dat in RAMInputStream(name=_0.cfs)) in RAMInputStream(name=_0.cfs) slice=1707:1974)
   at Lucene.Net.Index.ConcurrentMergeScheduler.HandleMergeException(Exception exc) in z:\Builds\work\bcdbe6b8cc677a49\src\Lucene.Net.Core\Index\ConcurrentMergeScheduler.cs:line 718
   at Lucene.Net.Index.ConcurrentMergeScheduler.MergeThread.Run() in z:\Builds\work\bcdbe6b8cc677a49\src\Lucene.Net.Core\Index\ConcurrentMergeScheduler.cs:line 682
   at System.Threading.ThreadHelper.ThreadStart_Context(Object state)
   at System.Threading.ExecutionContext.RunInternal(ExecutionContext executionContext, ContextCallback callback, Object state, Boolean preserveSyncCtx)
   at System.Threading.ExecutionContext.Run(ExecutionContext executionContext, ContextCallback callback, Object state, Boolean preserveSyncCtx)
   at System.Threading.ExecutionContext.Run(ExecutionContext executionContext, ContextCallback callback, Object state)
   at System.Threading.ThreadHelper.ThreadStart()
Unhandled exception in remote appdomain: Lucene.Net.Index.MergePolicy+MergeException: did not read all bytes from file: read 83 vs size 93 (resource: MockIndexInputWrapper(SlicedIndexInput(SlicedIndexInput(_1_2_dv.dat in RAMInputStream(name=_1.cfs)) in RAMInputStream(name=_1.cfs) slice=477:570)))
   at Lucene.Net.Index.ConcurrentMergeScheduler.HandleMergeException(Exception exc) in z:\Builds\work\bcdbe6b8cc677a49\src\Lucene.Net.Core\Index\ConcurrentMergeScheduler.cs:line 718
   at Lucene.Net.Index.ConcurrentMergeScheduler.MergeThread.Run() in z:\Builds\work\bcdbe6b8cc677a49\src\Lucene.Net.Core\Index\ConcurrentMergeScheduler.cs:line 682
   at System.Threading.ThreadHelper.ThreadStart_Context(Object state)
   at System.Threading.ExecutionContext.RunInternal(ExecutionContext executionContext, ContextCallback callback, Object state, Boolean preserveSyncCtx)
   at System.Threading.ExecutionContext.Run(ExecutionContext executionContext, ContextCallback callback, Object state, Boolean preserveSyncCtx)
   at System.Threading.ExecutionContext.Run(ExecutionContext executionContext, ContextCallback callback, Object state)
   at System.Threading.ThreadHelper.ThreadStart()
Unhandled exception in remote appdomain: Lucene.Net.Index.MergePolicy+MergeException: did not read all bytes from file: read 83 vs size 93 (resource: MockIndexInputWrapper(SlicedIndexInput(SlicedIndexInput(_1_2_dv.dat in RAMInputStream(name=_1.cfs)) in RAMInputStream(name=_1.cfs) slice=477:570)))
   at Lucene.Net.Index.ConcurrentMergeScheduler.HandleMergeException(Exception exc) in z:\Builds\work\bcdbe6b8cc677a49\src\Lucene.Net.Core\Index\ConcurrentMergeScheduler.cs:line 718
   at Lucene.Net.Index.ConcurrentMergeScheduler.MergeThread.Run() in z:\Builds\work\bcdbe6b8cc677a49\src\Lucene.Net.Core\Index\ConcurrentMergeScheduler.cs:line 682
   at System.Threading.ThreadHelper.ThreadStart_Context(Object state)
   at System.Threading.ExecutionContext.RunInternal(ExecutionContext executionContext, ContextCallback callback, Object state, Boolean preserveSyncCtx)
   at System.Threading.ExecutionContext.Run(ExecutionContext executionContext, ContextCallback callback, Object state, Boolean preserveSyncCtx)
   at System.Threading.ExecutionContext.Run(ExecutionContext executionContext, ContextCallback callback, Object state)
   at System.Threading.ThreadHelper.ThreadStart()
Unhandled exception in remote appdomain: Lucene.Net.Index.MergePolicy+MergeException: did not read all bytes from file: read 31 vs size 523 (resource: MockIndexInputWrapper(SlicedIndexInput(SlicedIndexInput(_5_2_dv.dat in RAMInputStream(name=_5.cfs)) in RAMInputStream(name=_5.cfs) slice=3283:3806)))
   at Lucene.Net.Index.ConcurrentMergeScheduler.HandleMergeException(Exception exc) in z:\Builds\work\bcdbe6b8cc677a49\src\Lucene.Net.Core\Index\ConcurrentMergeScheduler.cs:line 718
   at Lucene.Net.Index.ConcurrentMergeScheduler.MergeThread.Run() in z:\Builds\work\bcdbe6b8cc677a49\src\Lucene.Net.Core\Index\ConcurrentMergeScheduler.cs:line 682
   at System.Threading.ThreadHelper.ThreadStart_Context(Object state)
   at System.Threading.ExecutionContext.RunInternal(ExecutionContext executionContext, ContextCallback callback, Object state, Boolean preserveSyncCtx)
   at System.Threading.ExecutionContext.Run(ExecutionContext executionContext, ContextCallback callback, Object state, Boolean preserveSyncCtx)
   at System.Threading.ExecutionContext.Run(ExecutionContext executionContext, ContextCallback callback, Object state)
   at System.Threading.ThreadHelper.ThreadStart()
Unhandled exception in remote appdomain: Lucene.Net.Index.MergePolicy+MergeException: read past EOF: SlicedIndexInput(SlicedIndexInput(_d_2_dv.dat in RAMInputStream(name=_d.cfs)) in RAMInputStream(name=_d.cfs) slice=441:520)
   at Lucene.Net.Index.ConcurrentMergeScheduler.HandleMergeException(Exception exc) in z:\Builds\work\bcdbe6b8cc677a49\src\Lucene.Net.Core\Index\ConcurrentMergeScheduler.cs:line 718
   at Lucene.Net.Index.ConcurrentMergeScheduler.MergeThread.Run() in z:\Builds\work\bcdbe6b8cc677a49\src\Lucene.Net.Core\Index\ConcurrentMergeScheduler.cs:line 682
   at System.Threading.ThreadHelper.ThreadStart_Context(Object state)
   at System.Threading.ExecutionContext.RunInternal(ExecutionContext executionContext, ContextCallback callback, Object state, Boolean preserveSyncCtx)
   at System.Threading.ExecutionContext.Run(ExecutionContext executionContext, ContextCallback callback, Object state, Boolean preserveSyncCtx)
   at System.Threading.ExecutionContext.Run(ExecutionContext executionContext, ContextCallback callback, Object state)
   at System.Threading.ThreadHelper.ThreadStart()
Unhandled exception in remote appdomain: Lucene.Net.Index.MergePolicy+MergeException: read past EOF: SlicedIndexInput(SlicedIndexInput(_d_2_dv.dat in RAMInputStream(name=_d.cfs)) in RAMInputStream(name=_d.cfs) slice=441:520)
   at Lucene.Net.Index.ConcurrentMergeScheduler.HandleMergeException(Exception exc) in z:\Builds\work\bcdbe6b8cc677a49\src\Lucene.Net.Core\Index\ConcurrentMergeScheduler.cs:line 718
   at Lucene.Net.Index.ConcurrentMergeScheduler.MergeThread.Run() in z:\Builds\work\bcdbe6b8cc677a49\src\Lucene.Net.Core\Index\ConcurrentMergeScheduler.cs:line 682
   at System.Threading.ThreadHelper.ThreadStart_Context(Object state)
   at System.Threading.ExecutionContext.RunInternal(ExecutionContext executionContext, ContextCallback callback, Object state, Boolean preserveSyncCtx)
   at System.Threading.ExecutionContext.Run(ExecutionContext executionContext, ContextCallback callback, Object state, Boolean preserveSyncCtx)
   at System.Threading.ExecutionContext.Run(ExecutionContext executionContext, ContextCallback callback, Object state)
   at System.Threading.ThreadHelper.ThreadStart()
Unhandled exception in remote appdomain: Lucene.Net.Index.MergePolicy+MergeException: read past EOF: SlicedIndexInput(SlicedIndexInput(_7_2_dv.dat in RAMInputStream(name=_7.cfs)) in RAMInputStream(name=_7.cfs) slice=421:502)
   at Lucene.Net.Index.ConcurrentMergeScheduler.HandleMergeException(Exception exc) in z:\Builds\work\bcdbe6b8cc677a49\src\Lucene.Net.Core\Index\ConcurrentMergeScheduler.cs:line 718
   at Lucene.Net.Index.ConcurrentMergeScheduler.MergeThread.Run() in z:\Builds\work\bcdbe6b8cc677a49\src\Lucene.Net.Core\Index\ConcurrentMergeScheduler.cs:line 682
   at System.Threading.ThreadHelper.ThreadStart_Context(Object state)
   at System.Threading.ExecutionContext.RunInternal(ExecutionContext executionContext, ContextCallback callback, Object state, Boolean preserveSyncCtx)
   at System.Threading.ExecutionContext.Run(ExecutionContext executionContext, ContextCallback callback, Object state, Boolean preserveSyncCtx)
   at System.Threading.ExecutionContext.Run(ExecutionContext executionContext, ContextCallback callback, Object state)
   at System.Threading.ThreadHelper.ThreadStart()
Unhandled exception in remote appdomain: Lucene.Net.Index.MergePolicy+MergeException: read past EOF: SlicedIndexInput(SlicedIndexInput(_f_2_dv.dat in RAMInputStream(name=_f.cfs)) in RAMInputStream(name=_f.cfs) slice=581:690)
   at Lucene.Net.Index.ConcurrentMergeScheduler.HandleMergeException(Exception exc) in z:\Builds\work\bcdbe6b8cc677a49\src\Lucene.Net.Core\Index\ConcurrentMergeScheduler.cs:line 718
   at Lucene.Net.Index.ConcurrentMergeScheduler.MergeThread.Run() in z:\Builds\work\bcdbe6b8cc677a49\src\Lucene.Net.Core\Index\ConcurrentMergeScheduler.cs:line 682
   at System.Threading.ThreadHelper.ThreadStart_Context(Object state)
   at System.Threading.ExecutionContext.RunInternal(ExecutionContext executionContext, ContextCallback callback, Object state, Boolean preserveSyncCtx)
   at System.Threading.ExecutionContext.Run(ExecutionContext executionContext, ContextCallback callback, Object state, Boolean preserveSyncCtx)
   at System.Threading.ExecutionContext.Run(ExecutionContext executionContext, ContextCallback callback, Object state)
   at System.Threading.ThreadHelper.ThreadStart()
Unhandled exception in remote appdomain: Lucene.Net.Index.MergePolicy+MergeException: read past EOF: SlicedIndexInput(SlicedIndexInput(_7_2_dv.dat in RAMInputStream(name=_7.cfs)) in RAMInputStream(name=_7.cfs) slice=421:502)
   at Lucene.Net.Index.ConcurrentMergeScheduler.HandleMergeException(Exception exc) in z:\Builds\work\bcdbe6b8cc677a49\src\Lucene.Net.Core\Index\ConcurrentMergeScheduler.cs:line 718
   at Lucene.Net.Index.ConcurrentMergeScheduler.MergeThread.Run() in z:\Builds\work\bcdbe6b8cc677a49\src\Lucene.Net.Core\Index\ConcurrentMergeScheduler.cs:line 682
   at System.Threading.ThreadHelper.ThreadStart_Context(Object state)
   at System.Threading.ExecutionContext.RunInternal(ExecutionContext executionContext, ContextCallback callback, Object state, Boolean preserveSyncCtx)
   at System.Threading.ExecutionContext.Run(ExecutionContext executionContext, ContextCallback callback, Object state, Boolean preserveSyncCtx)
   at System.Threading.ExecutionContext.Run(ExecutionContext executionContext, ContextCallback callback, Object state)
   at System.Threading.ThreadHelper.ThreadStart()
Unhandled exception in remote appdomain: Lucene.Net.Index.MergePolicy+MergeException: did not read all bytes from file: read 31 vs size 523 (resource: MockIndexInputWrapper(SlicedIndexInput(SlicedIndexInput(_5_2_dv.dat in RAMInputStream(name=_5.cfs)) in RAMInputStream(name=_5.cfs) slice=3283:3806)))
   at Lucene.Net.Index.ConcurrentMergeScheduler.HandleMergeException(Exception exc) in z:\Builds\work\bcdbe6b8cc677a49\src\Lucene.Net.Core\Index\ConcurrentMergeScheduler.cs:line 718
   at Lucene.Net.Index.ConcurrentMergeScheduler.MergeThread.Run() in z:\Builds\work\bcdbe6b8cc677a49\src\Lucene.Net.Core\Index\ConcurrentMergeScheduler.cs:line 682
   at System.Threading.ThreadHelper.ThreadStart_Context(Object state)
   at System.Threading.ExecutionContext.RunInternal(ExecutionContext executionContext, ContextCallback callback, Object state, Boolean preserveSyncCtx)
   at System.Threading.ExecutionContext.Run(ExecutionContext executionContext, ContextCallback callback, Object state, Boolean preserveSyncCtx)
   at System.Threading.ExecutionContext.Run(ExecutionContext executionContext, ContextCallback callback, Object state)
   at System.Threading.ThreadHelper.ThreadStart()
Unhandled exception in remote appdomain: Lucene.Net.Index.MergePolicy+MergeException: did not read all bytes from file: read 83 vs size 93 (resource: MockIndexInputWrapper(SlicedIndexInput(SlicedIndexInput(_1_2_dv.dat in RAMInputStream(name=_1.cfs)) in RAMInputStream(name=_1.cfs) slice=477:570)))
   at Lucene.Net.Index.ConcurrentMergeScheduler.HandleMergeException(Exception exc) in z:\Builds\work\bcdbe6b8cc677a49\src\Lucene.Net.Core\Index\ConcurrentMergeScheduler.cs:line 718
   at Lucene.Net.Index.ConcurrentMergeScheduler.MergeThread.Run() in z:\Builds\work\bcdbe6b8cc677a49\src\Lucene.Net.Core\Index\ConcurrentMergeScheduler.cs:line 682
   at System.Threading.ThreadHelper.ThreadStart_Context(Object state)
   at System.Threading.ExecutionContext.RunInternal(ExecutionContext executionContext, ContextCallback callback, Object state, Boolean preserveSyncCtx)
   at System.Threading.ExecutionContext.Run(ExecutionContext executionContext, ContextCallback callback, Object state, Boolean preserveSyncCtx)
   at System.Threading.ExecutionContext.Run(ExecutionContext executionContext, ContextCallback callback, Object state)
   at System.Threading.ThreadHelper.ThreadStart()
Unhandled exception in remote appdomain: Lucene.Net.Index.MergePolicy+MergeException: read past EOF: SlicedIndexInput(SlicedIndexInput(_9_2_dv.dat in RAMInputStream(name=_9.cfs)) in RAMInputStream(name=_9.cfs) slice=554:658)
   at Lucene.Net.Index.ConcurrentMergeScheduler.HandleMergeException(Exception exc) in z:\Builds\work\bcdbe6b8cc677a49\src\Lucene.Net.Core\Index\ConcurrentMergeScheduler.cs:line 718
   at Lucene.Net.Index.ConcurrentMergeScheduler.MergeThread.Run() in z:\Builds\work\bcdbe6b8cc677a49\src\Lucene.Net.Core\Index\ConcurrentMergeScheduler.cs:line 682
   at System.Threading.ThreadHelper.ThreadStart_Context(Object state)
   at System.Threading.ExecutionContext.RunInternal(ExecutionContext executionContext, ContextCallback callback, Object state, Boolean preserveSyncCtx)
   at System.Threading.ExecutionContext.Run(ExecutionContext executionContext, ContextCallback callback, Object state, Boolean preserveSyncCtx)
   at System.Threading.ExecutionContext.Run(ExecutionContext executionContext, ContextCallback callback, Object state)
   at System.Threading.ThreadHelper.ThreadStart()
Unhandled exception in remote appdomain: Lucene.Net.Index.MergePolicy+MergeException: did not read all bytes from file: read 31 vs size 523 (resource: MockIndexInputWrapper(SlicedIndexInput(SlicedIndexInput(_5_2_dv.dat in RAMInputStream(name=_5.cfs)) in RAMInputStream(name=_5.cfs) slice=3283:3806)))
   at Lucene.Net.Index.ConcurrentMergeScheduler.HandleMergeException(Exception exc) in z:\Builds\work\bcdbe6b8cc677a49\src\Lucene.Net.Core\Index\ConcurrentMergeScheduler.cs:line 718
   at Lucene.Net.Index.ConcurrentMergeScheduler.MergeThread.Run() in z:\Builds\work\bcdbe6b8cc677a49\src\Lucene.Net.Core\Index\ConcurrentMergeScheduler.cs:line 682
   at System.Threading.ThreadHelper.ThreadStart_Context(Object state)
   at System.Threading.ExecutionContext.RunInternal(ExecutionContext executionContext, ContextCallback callback, Object state, Boolean preserveSyncCtx)
   at System.Threading.ExecutionContext.Run(ExecutionContext executionContext, ContextCallback callback, Object state, Boolean preserveSyncCtx)
   at System.Threading.ExecutionContext.Run(ExecutionContext executionContext, ContextCallback callback, Object state)
   at System.Threading.ThreadHelper.ThreadStart()
Unhandled exception in remote appdomain: System.Exception: read past EOF: SlicedIndexInput(SlicedIndexInput(_0_2_dv.dat in RAMInputStream(name=_0.cfs)) in RAMInputStream(name=_0.cfs) slice=1707:1974) ---> System.IO.EndOfStreamException: read past EOF: SlicedIndexInput(SlicedIndexInput(_0_2_dv.dat in RAMInputStream(name=_0.cfs)) in RAMInputStream(name=_0.cfs) slice=1707:1974)
   at Lucene.Net.Store.BufferedIndexInput.ReadBytes(Byte[] b, Int32 offset, Int32 len, Boolean useBuffer) in z:\Builds\work\bcdbe6b8cc677a49\src\Lucene.Net.Core\Store\BufferedIndexInput.cs:line 192
   at Lucene.Net.Store.MockIndexInputWrapper.ReadBytes(Byte[] b, Int32 offset, Int32 len, Boolean useBuffer) in z:\Builds\work\bcdbe6b8cc677a49\src\Lucene.Net.TestFramework\Store\MockIndexInputWrapper.cs:line 140
   at Lucene.Net.Util.PagedBytes.Copy(IndexInput in, Int64 byteCount) in z:\Builds\work\bcdbe6b8cc677a49\src\Lucene.Net.Core\Util\PagedBytes.cs:line 202
   at Lucene.Net.Codecs.Lucene40.Lucene40DocValuesReader.LoadBytesFixedDeref(FieldInfo field) in z:\Builds\work\bcdbe6b8cc677a49\src\Lucene.Net.Core\Codecs\Lucene40\Lucene40DocValuesReader.cs:line 562
   at Lucene.Net.Codecs.Lucene40.Lucene40DocValuesReader.GetBinary(FieldInfo field) in z:\Builds\work\bcdbe6b8cc677a49\src\Lucene.Net.Core\Codecs\Lucene40\Lucene40DocValuesReader.cs:line 426
   at Lucene.Net.Index.SegmentReader.GetBinaryDocValues(String field) in z:\Builds\work\bcdbe6b8cc677a49\src\Lucene.Net.Core\Index\SegmentReader.cs:line 590
   at Lucene.Net.Index.BaseDocValuesFormatTestCase.ThreadAnonymousInnerClassHelper.Run() in z:\Builds\work\bcdbe6b8cc677a49\src\Lucene.Net.TestFramework\Index\BaseDocValuesFormatTestCase.cs:line 3250
   --- End of inner exception stack trace ---
   at Lucene.Net.Index.BaseDocValuesFormatTestCase.ThreadAnonymousInnerClassHelper.Run() in z:\Builds\work\bcdbe6b8cc677a49\src\Lucene.Net.TestFramework\Index\BaseDocValuesFormatTestCase.cs:line 3269
   at System.Threading.ThreadHelper.ThreadStart_Context(Object state)
   at System.Threading.ExecutionContext.RunInternal(ExecutionContext executionContext, ContextCallback callback, Object state, Boolean preserveSyncCtx)
   at System.Threading.ExecutionContext.Run(ExecutionContext executionContext, ContextCallback callback, Object state, Boolean preserveSyncCtx)
   at System.Threading.ExecutionContext.Run(ExecutionContext executionContext, ContextCallback callback, Object state)
   at System.Threading.ThreadHelper.ThreadStart()
Unhandled exception in remote appdomain: System.Exception: read past EOF: SlicedIndexInput(SlicedIndexInput(_0_2_dv.dat in RAMInputStream(name=_0.cfs)) in RAMInputStream(name=_0.cfs) slice=1707:1974) ---> System.IO.EndOfStreamException: read past EOF: SlicedIndexInput(SlicedIndexInput(_0_2_dv.dat in RAMInputStream(name=_0.cfs)) in RAMInputStream(name=_0.cfs) slice=1707:1974)
   at Lucene.Net.Store.BufferedIndexInput.ReadBytes(Byte[] b, Int32 offset, Int32 len, Boolean useBuffer) in z:\Builds\work\bcdbe6b8cc677a49\src\Lucene.Net.Core\Store\BufferedIndexInput.cs:line 192
   at Lucene.Net.Store.MockIndexInputWrapper.ReadBytes(Byte[] b, Int32 offset, Int32 len, Boolean useBuffer) in z:\Builds\work\bcdbe6b8cc677a49\src\Lucene.Net.TestFramework\Store\MockIndexInputWrapper.cs:line 140
   at Lucene.Net.Util.PagedBytes.Copy(IndexInput in, Int64 byteCount) in z:\Builds\work\bcdbe6b8cc677a49\src\Lucene.Net.Core\Util\PagedBytes.cs:line 202
   at Lucene.Net.Codecs.Lucene40.Lucene40DocValuesReader.LoadBytesFixedDeref(FieldInfo field) in z:\Builds\work\bcdbe6b8cc677a49\src\Lucene.Net.Core\Codecs\Lucene40\Lucene40DocValuesReader.cs:line 562
   at Lucene.Net.Codecs.Lucene40.Lucene40DocValuesReader.GetBinary(FieldInfo field) in z:\Builds\work\bcdbe6b8cc677a49\src\Lucene.Net.Core\Codecs\Lucene40\Lucene40DocValuesReader.cs:line 426
   at Lucene.Net.Index.SegmentReader.GetBinaryDocValues(String field) in z:\Builds\work\bcdbe6b8cc677a49\src\Lucene.Net.Core\Index\SegmentReader.cs:line 590
   at Lucene.Net.Index.BaseDocValuesFormatTestCase.ThreadAnonymousInnerClassHelper.Run() in z:\Builds\work\bcdbe6b8cc677a49\src\Lucene.Net.TestFramework\Index\BaseDocValuesFormatTestCase.cs:line 3250
   --- End of inner exception stack trace ---
   at Lucene.Net.Index.BaseDocValuesFormatTestCase.ThreadAnonymousInnerClassHelper.Run() in z:\Builds\work\bcdbe6b8cc677a49\src\Lucene.Net.TestFramework\Index\BaseDocValuesFormatTestCase.cs:line 3269
   at System.Threading.ThreadHelper.ThreadStart_Context(Object state)
   at System.Threading.ExecutionContext.RunInternal(ExecutionContext executionContext, ContextCallback callback, Object state, Boolean preserveSyncCtx)
   at System.Threading.ExecutionContext.Run(ExecutionContext executionContext, ContextCallback callback, Object state, Boolean preserveSyncCtx)
   at System.Threading.ExecutionContext.Run(ExecutionContext executionContext, ContextCallback callback, Object state)
   at System.Threading.ThreadHelper.ThreadStart()
Unhandled exception in remote appdomain: System.Exception: read past EOF: SlicedIndexInput(SlicedIndexInput(_0_2_dv.dat in RAMInputStream(name=_0.cfs)) in RAMInputStream(name=_0.cfs) slice=1707:1974) ---> System.IO.EndOfStreamException: read past EOF: SlicedIndexInput(SlicedIndexInput(_0_2_dv.dat in RAMInputStream(name=_0.cfs)) in RAMInputStream(name=_0.cfs) slice=1707:1974)
   at Lucene.Net.Store.BufferedIndexInput.ReadBytes(Byte[] b, Int32 offset, Int32 len, Boolean useBuffer) in z:\Builds\work\bcdbe6b8cc677a49\src\Lucene.Net.Core\Store\BufferedIndexInput.cs:line 192
   at Lucene.Net.Store.MockIndexInputWrapper.ReadBytes(Byte[] b, Int32 offset, Int32 len, Boolean useBuffer) in z:\Builds\work\bcdbe6b8cc677a49\src\Lucene.Net.TestFramework\Store\MockIndexInputWrapper.cs:line 140
   at Lucene.Net.Util.PagedBytes.Copy(IndexInput in, Int64 byteCount) in z:\Builds\work\bcdbe6b8cc677a49\src\Lucene.Net.Core\Util\PagedBytes.cs:line 202
   at Lucene.Net.Codecs.Lucene40.Lucene40DocValuesReader.LoadBytesFixedDeref(FieldInfo field) in z:\Builds\work\bcdbe6b8cc677a49\src\Lucene.Net.Core\Codecs\Lucene40\Lucene40DocValuesReader.cs:line 562
   at Lucene.Net.Codecs.Lucene40.Lucene40DocValuesReader.GetBinary(FieldInfo field) in z:\Builds\work\bcdbe6b8cc677a49\src\Lucene.Net.Core\Codecs\Lucene40\Lucene40DocValuesReader.cs:line 426
   at Lucene.Net.Index.SegmentReader.GetBinaryDocValues(String field) in z:\Builds\work\bcdbe6b8cc677a49\src\Lucene.Net.Core\Index\SegmentReader.cs:line 590
   at Lucene.Net.Index.BaseDocValuesFormatTestCase.ThreadAnonymousInnerClassHelper.Run() in z:\Builds\work\bcdbe6b8cc677a49\src\Lucene.Net.TestFramework\Index\BaseDocValuesFormatTestCase.cs:line 3250
   --- End of inner exception stack trace ---
   at Lucene.Net.Index.BaseDocValuesFormatTestCase.ThreadAnonymousInnerClassHelper.Run() in z:\Builds\work\bcdbe6b8cc677a49\src\Lucene.Net.TestFramework\Index\BaseDocValuesFormatTestCase.cs:line 3269
   at System.Threading.ThreadHelper.ThreadStart_Context(Object state)
   at System.Threading.ExecutionContext.RunInternal(ExecutionContext executionContext, ContextCallback callback, Object state, Boolean preserveSyncCtx)
   at System.Threading.ExecutionContext.Run(ExecutionContext executionContext, ContextCallback callback, Object state, Boolean preserveSyncCtx)
   at System.Threading.ExecutionContext.Run(ExecutionContext executionContext, ContextCallback callback, Object state)
   at System.Threading.ThreadHelper.ThreadStart()
CheckIndex failed
´╗┐Segments file=segments_13 numSegments=13 version=4.8 format=
  1 of 13: name=_0 docCount=61
    codec=Lucene40
    compound=True
    numFiles=4
    size (MB)=0.00426101684570313
    diagnostics = System.Collections.Generic.Dictionary`2[System.String,System.String]
    has deletions [delGen=1]
    test: open reader.........OK
    test: check integrity.....OK
    test: check live docs.....OK [1 deleted docs]
    test: fields..............OK [6 fields]
    test: field norms.........OK [0 fields]
    test: terms, freq, prox...OK [60 terms; 60 terms/docs pairs; 0 tokens]
    test (ignoring deletes): terms, freq, prox...OK [61 terms; 61 terms/docs pairs; 0 tokens]
    test: stored fields.......OK [120 total field count; avg 2 fields per doc]
    test: term vectors........OK [0 total vector count; avg 0 term/freq vector fields per doc]
    test: docvalues...........ERROR [read past EOF: SlicedIndexInput(SlicedIndexInput(_0_2_dv.dat in RAMInputStream(name=_0.cfs)) in RAMInputStream(name=_0.cfs) slice=1707:1974)]
   at Lucene.Net.Store.BufferedIndexInput.ReadBytes(Byte[] b, Int32 offset, Int32 len, Boolean useBuffer) in z:\Builds\work\bcdbe6b8cc677a49\src\Lucene.Net.Core\Store\BufferedIndexInput.cs:line 192
   at Lucene.Net.Store.MockIndexInputWrapper.ReadBytes(Byte[] b, Int32 offset, Int32 len, Boolean useBuffer) in z:\Builds\work\bcdbe6b8cc677a49\src\Lucene.Net.TestFramework\Store\MockIndexInputWrapper.cs:line 140
   at Lucene.Net.Util.PagedBytes.Copy(IndexInput in, Int64 byteCount) in z:\Builds\work\bcdbe6b8cc677a49\src\Lucene.Net.Core\Util\PagedBytes.cs:line 202
   at Lucene.Net.Codecs.Lucene40.Lucene40DocValuesReader.LoadBytesFixedDeref(FieldInfo field) in z:\Builds\work\bcdbe6b8cc677a49\src\Lucene.Net.Core\Codecs\Lucene40\Lucene40DocValuesReader.cs:line 562
   at Lucene.Net.Codecs.Lucene40.Lucene40DocValuesReader.GetBinary(FieldInfo field) in z:\Builds\work\bcdbe6b8cc677a49\src\Lucene.Net.Core\Codecs\Lucene40\Lucene40DocValuesReader.cs:line 426
   at Lucene.Net.Index.SegmentReader.GetBinaryDocValues(String field) in z:\Builds\work\bcdbe6b8cc677a49\src\Lucene.Net.Core\Index\SegmentReader.cs:line 590
   at Lucene.Net.Index.CheckIndex.CheckDocValues(FieldInfo fi, AtomicReader reader, DocValuesStatus status) in z:\Builds\work\bcdbe6b8cc677a49\src\Lucene.Net.Core\Index\CheckIndex.cs:line 1937
   at Lucene.Net.Index.CheckIndex.TestDocValues(AtomicReader reader, StreamWriter infoStream) in z:\Builds\work\bcdbe6b8cc677a49\src\Lucene.Net.Core\Index\CheckIndex.cs:line 1706
FAILED
    WARNING: fixIndex() would remove reference to this segment; full exception:
   at Lucene.Net.Index.CheckIndex.DoCheckIndex(IList`1 onlySegments) in z:\Builds\work\bcdbe6b8cc677a49\src\Lucene.Net.Core\Index\CheckIndex.cs:line 828
  2 of 13: name=_1 docCount=13
    codec=Lucene40
    compound=True
    numFiles=4
    size (MB)=0.00217151641845703
    diagnostics = System.Collections.Generic.Dictionary`2[System.String,System.String]
    has deletions [delGen=1]
    test: open reader.........OK
    test: check integrity.....OK
    test: check live docs.....OK [1 deleted docs]
    test: fields..............OK [6 fields]
    test: field norms.........OK [0 fields]
    test: terms, freq, prox...OK [12 terms; 12 terms/docs pairs; 0 tokens]
    test (ignoring deletes): terms, freq, prox...OK [13 terms; 13 terms/docs pairs; 0 tokens]
    test: stored fields.......OK [24 total field count; avg 2 fields per doc]
    test: term vectors........OK [0 total vector count; avg 0 term/freq vector fields per doc]
    test: docvalues...........ERROR [did not read all bytes from file: read 83 vs size 93 (resource: MockIndexInputWrapper(SlicedIndexInput(SlicedIndexInput(_1_2_dv.dat in RAMInputStream(name=_1.cfs)) in RAMInputStream(name=_1.cfs) slice=477:570)))]
   at Lucene.Net.Codecs.CodecUtil.CheckEOF(IndexInput in) in z:\Builds\work\bcdbe6b8cc677a49\src\Lucene.Net.Core\Codecs\CodecUtil.cs:line 255
   at Lucene.Net.Codecs.Lucene40.Lucene40DocValuesReader.LoadBytesFixedDeref(FieldInfo field) in z:\Builds\work\bcdbe6b8cc677a49\src\Lucene.Net.Core\Codecs\Lucene40\Lucene40DocValuesReader.cs:line 565
   at Lucene.Net.Codecs.Lucene40.Lucene40DocValuesReader.GetBinary(FieldInfo field) in z:\Builds\work\bcdbe6b8cc677a49\src\Lucene.Net.Core\Codecs\Lucene40\Lucene40DocValuesReader.cs:line 426
   at Lucene.Net.Index.SegmentReader.GetBinaryDocValues(String field) in z:\Builds\work\bcdbe6b8cc677a49\src\Lucene.Net.Core\Index\SegmentReader.cs:line 590
   at Lucene.Net.Index.CheckIndex.CheckDocValues(FieldInfo fi, AtomicReader reader, DocValuesStatus status) in z:\Builds\work\bcdbe6b8cc677a49\src\Lucene.Net.Core\Index\CheckIndex.cs:line 1937
   at Lucene.Net.Index.CheckIndex.TestDocValues(AtomicReader reader, StreamWriter infoStream) in z:\Builds\work\bcdbe6b8cc677a49\src\Lucene.Net.Core\Index\CheckIndex.cs:line 1706
FAILED
    WARNING: fixIndex() would remove reference to this segment; full exception:
   at Lucene.Net.Index.CheckIndex.DoCheckIndex(IList`1 onlySegments) in z:\Builds\work\bcdbe6b8cc677a49\src\Lucene.Net.Core\Index\CheckIndex.cs:line 828
  3 of 13: name=_2 docCount=3
    codec=Lucene40
    compound=True
    numFiles=3
    size (MB)=0.00166702270507813
    diagnostics = System.Collections.Generic.Dictionary`2[System.String,System.String]
    no deletions
    test: open reader.........OK
    test: check integrity.....OK
    test: check live docs.....OK
    test: fields..............OK [6 fields]
    test: field norms.........OK [0 fields]
    test: terms, freq, prox...OK [3 terms; 3 terms/docs pairs; 0 tokens]
    test: stored fields.......OK [6 total field count; avg 2 fields per doc]
    test: term vectors........OK [0 total vector count; avg 0 term/freq vector fields per doc]
    test: docvalues...........ERROR [read past EOF: SlicedIndexInput(SlicedIndexInput(_2_2_dv.dat in RAMInputStream(name=_2.cfs)) in RAMInputStream(name=_2.cfs) slice=206:248)]
   at Lucene.Net.Store.BufferedIndexInput.ReadBytes(Byte[] b, Int32 offset, Int32 len, Boolean useBuffer) in z:\Builds\work\bcdbe6b8cc677a49\src\Lucene.Net.Core\Store\BufferedIndexInput.cs:line 192
   at Lucene.Net.Store.MockIndexInputWrapper.ReadBytes(Byte[] b, Int32 offset, Int32 len, Boolean useBuffer) in z:\Builds\work\bcdbe6b8cc677a49\src\Lucene.Net.TestFramework\Store\MockIndexInputWrapper.cs:line 140
   at Lucene.Net.Util.PagedBytes.Copy(IndexInput in, Int64 byteCount) in z:\Builds\work\bcdbe6b8cc677a49\src\Lucene.Net.Core\Util\PagedBytes.cs:line 202
   at Lucene.Net.Codecs.Lucene40.Lucene40DocValuesReader.LoadBytesFixedDeref(FieldInfo field) in z:\Builds\work\bcdbe6b8cc677a49\src\Lucene.Net.Core\Codecs\Lucene40\Lucene40DocValuesReader.cs:line 562
   at Lucene.Net.Codecs.Lucene40.Lucene40DocValuesReader.GetBinary(FieldInfo field) in z:\Builds\work\bcdbe6b8cc677a49\src\Lucene.Net.Core\Codecs\Lucene40\Lucene40DocValuesReader.cs:line 426
   at Lucene.Net.Index.SegmentReader.GetBinaryDocValues(String field) in z:\Builds\work\bcdbe6b8cc677a49\src\Lucene.Net.Core\Index\SegmentReader.cs:line 590
   at Lucene.Net.Index.CheckIndex.CheckDocValues(FieldInfo fi, AtomicReader reader, DocValuesStatus status) in z:\Builds\work\bcdbe6b8cc677a49\src\Lucene.Net.Core\Index\CheckIndex.cs:line 1937
   at Lucene.Net.Index.CheckIndex.TestDocValues(AtomicReader reader, StreamWriter infoStream) in z:\Builds\work\bcdbe6b8cc677a49\src\Lucene.Net.Core\Index\CheckIndex.cs:line 1706
FAILED
    WARNING: fixIndex() would remove reference to this segment; full exception:
   at Lucene.Net.Index.CheckIndex.DoCheckIndex(IList`1 onlySegments) in z:\Builds\work\bcdbe6b8cc677a49\src\Lucene.Net.Core\Index\CheckIndex.cs:line 828
  4 of 13: name=_3 docCount=10
    codec=Lucene40
    compound=True
    numFiles=4
    size (MB)=0.0020294189453125
    diagnostics = System.Collections.Generic.Dictionary`2[System.String,System.String]
    has deletions [delGen=1]
    test: open reader.........OK
    test: check integrity.....OK
    test: check live docs.....OK [1 deleted docs]
    test: fields..............OK [6 fields]
    test: field norms.........OK [0 fields]
    test: terms, freq, prox...OK [9 terms; 9 terms/docs pairs; 0 tokens]
    test (ignoring deletes): terms, freq, prox...OK [10 terms; 10 terms/docs pairs; 0 tokens]
    test: stored fields.......OK [18 total field count; avg 2 fields per doc]
    test: term vectors........OK [0 total vector count; avg 0 term/freq vector fields per doc]
    test: docvalues...........ERROR [did not read all bytes from file: read 58 vs size 78 (resource: MockIndexInputWrapper(SlicedIndexInput(SlicedIndexInput(_3_2_dv.dat in RAMInputStream(name=_3.cfs)) in RAMInputStream(name=_3.cfs) slice=396:474)))]
   at Lucene.Net.Codecs.CodecUtil.CheckEOF(IndexInput in) in z:\Builds\work\bcdbe6b8cc677a49\src\Lucene.Net.Core\Codecs\CodecUtil.cs:line 255
   at Lucene.Net.Codecs.Lucene40.Lucene40DocValuesReader.LoadBytesFixedDeref(FieldInfo field) in z:\Builds\work\bcdbe6b8cc677a49\src\Lucene.Net.Core\Codecs\Lucene40\Lucene40DocValuesReader.cs:line 565
   at Lucene.Net.Codecs.Lucene40.Lucene40DocValuesReader.GetBinary(FieldInfo field) in z:\Builds\work\bcdbe6b8cc677a49\src\Lucene.Net.Core\Codecs\Lucene40\Lucene40DocValuesReader.cs:line 426
   at Lucene.Net.Index.SegmentReader.GetBinaryDocValues(String field) in z:\Builds\work\bcdbe6b8cc677a49\src\Lucene.Net.Core\Index\SegmentReader.cs:line 590
   at Lucene.Net.Index.CheckIndex.CheckDocValues(FieldInfo fi, AtomicReader reader, DocValuesStatus status) in z:\Builds\work\bcdbe6b8cc677a49\src\Lucene.Net.Core\Index\CheckIndex.cs:line 1937
   at Lucene.Net.Index.CheckIndex.TestDocValues(AtomicReader reader, StreamWriter infoStream) in z:\Builds\work\bcdbe6b8cc677a49\src\Lucene.Net.Core\Index\CheckIndex.cs:line 1706
FAILED
    WARNING: fixIndex() would remove reference to this segment; full exception:
   at Lucene.Net.Index.CheckIndex.DoCheckIndex(IList`1 onlySegments) in z:\Builds\work\bcdbe6b8cc677a49\src\Lucene.Net.Core\Index\CheckIndex.cs:line 828
  5 of 13: name=_5 docCount=121
    codec=Lucene40
    compound=True
    numFiles=4
    size (MB)=0.00707244873046875
    diagnostics = System.Collections.Generic.Dictionary`2[System.String,System.String]
    has deletions [delGen=1]
    test: open reader.........OK
    test: check integrity.....OK
    test: check live docs.....OK [10 deleted docs]
    test: fields..............OK [6 fields]
    test: field norms.........OK [0 fields]
    test: terms, freq, prox...OK [111 terms; 111 terms/docs pairs; 0 tokens]
    test (ignoring deletes): terms, freq, prox...OK [121 terms; 121 terms/docs pairs; 0 tokens]
    test: stored fields.......OK [222 total field count; avg 2 fields per doc]
    test: term vectors........OK [0 total vector count; avg 0 term/freq vector fields per doc]
    test: docvalues...........ERROR [did not read all bytes from file: read 31 vs size 523 (resource: MockIndexInputWrapper(SlicedIndexInput(SlicedIndexInput(_5_2_dv.dat in RAMInputStream(name=_5.cfs)) in RAMInputStream(name=_5.cfs) slice=3283:3806)))]
   at Lucene.Net.Codecs.CodecUtil.CheckEOF(IndexInput in) in z:\Builds\work\bcdbe6b8cc677a49\src\Lucene.Net.Core\Codecs\CodecUtil.cs:line 255
   at Lucene.Net.Codecs.Lucene40.Lucene40DocValuesReader.LoadBytesFixedDeref(FieldInfo field) in z:\Builds\work\bcdbe6b8cc677a49\src\Lucene.Net.Core\Codecs\Lucene40\Lucene40DocValuesReader.cs:line 565
   at Lucene.Net.Codecs.Lucene40.Lucene40DocValuesReader.GetBinary(FieldInfo field) in z:\Builds\work\bcdbe6b8cc677a49\src\Lucene.Net.Core\Codecs\Lucene40\Lucene40DocValuesReader.cs:line 426
   at Lucene.Net.Index.SegmentReader.GetBinaryDocValues(String field) in z:\Builds\work\bcdbe6b8cc677a49\src\Lucene.Net.Core\Index\SegmentReader.cs:line 590
   at Lucene.Net.Index.CheckIndex.CheckDocValues(FieldInfo fi, AtomicReader reader, DocValuesStatus status) in z:\Builds\work\bcdbe6b8cc677a49\src\Lucene.Net.Core\Index\CheckIndex.cs:line 1937
   at Lucene.Net.Index.CheckIndex.TestDocValues(AtomicReader reader, StreamWriter infoStream) in z:\Builds\work\bcdbe6b8cc677a49\src\Lucene.Net.Core\Index\CheckIndex.cs:line 1706
FAILED
    WARNING: fixIndex() would remove reference to this segment; full exception:
   at Lucene.Net.Index.CheckIndex.DoCheckIndex(IList`1 onlySegments) in z:\Builds\work\bcdbe6b8cc677a49\src\Lucene.Net.Core\Index\CheckIndex.cs:line 828
  6 of 13: name=_7 docCount=11
    codec=Lucene40
    compound=True
    numFiles=3
    size (MB)=0.00204086303710938
    diagnostics = System.Collections.Generic.Dictionary`2[System.String,System.String]
    no deletions
    test: open reader.........OK
    test: check integrity.....OK
    test: check live docs.....OK
    test: fields..............OK [6 fields]
    test: field norms.........OK [0 fields]
    test: terms, freq, prox...OK [11 terms; 11 terms/docs pairs; 0 tokens]
    test: stored fields.......OK [22 total field count; avg 2 fields per doc]
    test: term vectors........OK [0 total vector count; avg 0 term/freq vector fields per doc]
    test: docvalues...........ERROR [read past EOF: SlicedIndexInput(SlicedIndexInput(_7_2_dv.dat in RAMInputStream(name=_7.cfs)) in RAMInputStream(name=_7.cfs) slice=421:502)]
   at Lucene.Net.Store.BufferedIndexInput.ReadBytes(Byte[] b, Int32 offset, Int32 len, Boolean useBuffer) in z:\Builds\work\bcdbe6b8cc677a49\src\Lucene.Net.Core\Store\BufferedIndexInput.cs:line 192
   at Lucene.Net.Store.MockIndexInputWrapper.ReadBytes(Byte[] b, Int32 offset, Int32 len, Boolean useBuffer) in z:\Builds\work\bcdbe6b8cc677a49\src\Lucene.Net.TestFramework\Store\MockIndexInputWrapper.cs:line 140
   at Lucene.Net.Util.PagedBytes.Copy(IndexInput in, Int64 byteCount) in z:\Builds\work\bcdbe6b8cc677a49\src\Lucene.Net.Core\Util\PagedBytes.cs:line 202
   at Lucene.Net.Codecs.Lucene40.Lucene40DocValuesReader.LoadBytesFixedDeref(FieldInfo field) in z:\Builds\work\bcdbe6b8cc677a49\src\Lucene.Net.Core\Codecs\Lucene40\Lucene40DocValuesReader.cs:line 562
   at Lucene.Net.Codecs.Lucene40.Lucene40DocValuesReader.GetBinary(FieldInfo field) in z:\Builds\work\bcdbe6b8cc677a49\src\Lucene.Net.Core\Codecs\Lucene40\Lucene40DocValuesReader.cs:line 426
   at Lucene.Net.Index.SegmentReader.GetBinaryDocValues(String field) in z:\Builds\work\bcdbe6b8cc677a49\src\Lucene.Net.Core\Index\SegmentReader.cs:line 590
   at Lucene.Net.Index.CheckIndex.CheckDocValues(FieldInfo fi, AtomicReader reader, DocValuesStatus status) in z:\Builds\work\bcdbe6b8cc677a49\src\Lucene.Net.Core\Index\CheckIndex.cs:line 1937
   at Lucene.Net.Index.CheckIndex.TestDocValues(AtomicReader reader, StreamWriter infoStream) in z:\Builds\work\bcdbe6b8cc677a49\src\Lucene.Net.Core\Index\CheckIndex.cs:line 1706
FAILED
    WARNING: fixIndex() would remove reference to this segment; full exception:
   at Lucene.Net.Index.CheckIndex.DoCheckIndex(IList`1 onlySegments) in z:\Builds\work\bcdbe6b8cc677a49\src\Lucene.Net.Core\Index\CheckIndex.cs:line 828
  7 of 13: name=_8 docCount=13
    codec=Lucene40
    compound=True
    numFiles=3
    size (MB)=0.00212955474853516
    diagnostics = System.Collections.Generic.Dictionary`2[System.String,System.String]
    no deletions
    test: open reader.........OK
    test: check integrity.....OK
    test: check live docs.....OK
    test: fields..............OK [6 fields]
    test: field norms.........OK [0 fields]
    test: terms, freq, prox...OK [13 terms; 13 terms/docs pairs; 0 tokens]
    test: stored fields.......OK [26 total field count; avg 2 fields per doc]
    test: term vectors........OK [0 total vector count; avg 0 term/freq vector fields per doc]
    test: docvalues...........ERROR [read past EOF: SlicedIndexInput(SlicedIndexInput(_8_2_dv.dat in RAMInputStream(name=_8.cfs)) in RAMInputStream(name=_8.cfs) slice=474:564)]
   at Lucene.Net.Store.BufferedIndexInput.ReadBytes(Byte[] b, Int32 offset, Int32 len, Boolean useBuffer) in z:\Builds\work\bcdbe6b8cc677a49\src\Lucene.Net.Core\Store\BufferedIndexInput.cs:line 192
   at Lucene.Net.Store.MockIndexInputWrapper.ReadBytes(Byte[] b, Int32 offset, Int32 len, Boolean useBuffer) in z:\Builds\work\bcdbe6b8cc677a49\src\Lucene.Net.TestFramework\Store\MockIndexInputWrapper.cs:line 140
   at Lucene.Net.Util.PagedBytes.Copy(IndexInput in, Int64 byteCount) in z:\Builds\work\bcdbe6b8cc677a49\src\Lucene.Net.Core\Util\PagedBytes.cs:line 202
   at Lucene.Net.Codecs.Lucene40.Lucene40DocValuesReader.LoadBytesFixedDeref(FieldInfo field) in z:\Builds\work\bcdbe6b8cc677a49\src\Lucene.Net.Core\Codecs\Lucene40\Lucene40DocValuesReader.cs:line 562
   at Lucene.Net.Codecs.Lucene40.Lucene40DocValuesReader.GetBinary(FieldInfo field) in z:\Builds\work\bcdbe6b8cc677a49\src\Lucene.Net.Core\Codecs\Lucene40\Lucene40DocValuesReader.cs:line 426
   at Lucene.Net.Index.SegmentReader.GetBinaryDocValues(String field) in z:\Builds\work\bcdbe6b8cc677a49\src\Lucene.Net.Core\Index\SegmentReader.cs:line 590
   at Lucene.Net.Index.CheckIndex.CheckDocValues(FieldInfo fi, AtomicReader reader, DocValuesStatus status) in z:\Builds\work\bcdbe6b8cc677a49\src\Lucene.Net.Core\Index\CheckIndex.cs:line 1937
   at Lucene.Net.Index.CheckIndex.TestDocValues(AtomicReader reader, StreamWriter infoStream) in z:\Builds\work\bcdbe6b8cc677a49\src\Lucene.Net.Core\Index\CheckIndex.cs:line 1706
FAILED
    WARNING: fixIndex() would remove reference to this segment; full exception:
   at Lucene.Net.Index.CheckIndex.DoCheckIndex(IList`1 onlySegments) in z:\Builds\work\bcdbe6b8cc677a49\src\Lucene.Net.Core\Index\CheckIndex.cs:line 828
  8 of 13: name=_9 docCount=16
    codec=Lucene40
    compound=True
    numFiles=4
    size (MB)=0.00231170654296875
    diagnostics = System.Collections.Generic.Dictionary`2[System.String,System.String]
    has deletions [delGen=1]
    test: open reader.........OK
    test: check integrity.....OK
    test: check live docs.....OK [1 deleted docs]
    test: fields..............OK [6 fields]
    test: field norms.........OK [0 fields]
    test: terms, freq, prox...OK [15 terms; 15 terms/docs pairs; 0 tokens]
    test (ignoring deletes): terms, freq, prox...OK [16 terms; 16 terms/docs pairs; 0 tokens]
    test: stored fields.......OK [30 total field count; avg 2 fields per doc]
    test: term vectors........OK [0 total vector count; avg 0 term/freq vector fields per doc]
    test: docvalues...........ERROR [read past EOF: SlicedIndexInput(SlicedIndexInput(_9_2_dv.dat in RAMInputStream(name=_9.cfs)) in RAMInputStream(name=_9.cfs) slice=554:658)]
   at Lucene.Net.Store.BufferedIndexInput.ReadBytes(Byte[] b, Int32 offset, Int32 len, Boolean useBuffer) in z:\Builds\work\bcdbe6b8cc677a49\src\Lucene.Net.Core\Store\BufferedIndexInput.cs:line 192
   at Lucene.Net.Store.MockIndexInputWrapper.ReadBytes(Byte[] b, Int32 offset, Int32 len, Boolean useBuffer) in z:\Builds\work\bcdbe6b8cc677a49\src\Lucene.Net.TestFramework\Store\MockIndexInputWrapper.cs:line 140
   at Lucene.Net.Util.PagedBytes.Copy(IndexInput in, Int64 byteCount) in z:\Builds\work\bcdbe6b8cc677a49\src\Lucene.Net.Core\Util\PagedBytes.cs:line 202
   at Lucene.Net.Codecs.Lucene40.Lucene40DocValuesReader.LoadBytesFixedDeref(FieldInfo field) in z:\Builds\work\bcdbe6b8cc677a49\src\Lucene.Net.Core\Codecs\Lucene40\Lucene40DocValuesReader.cs:line 562
   at Lucene.Net.Codecs.Lucene40.Lucene40DocValuesReader.GetBinary(FieldInfo field) in z:\Builds\work\bcdbe6b8cc677a49\src\Lucene.Net.Core\Codecs\Lucene40\Lucene40DocValuesReader.cs:line 426
   at Lucene.Net.Index.SegmentReader.GetBinaryDocValues(String field) in z:\Builds\work\bcdbe6b8cc677a49\src\Lucene.Net.Core\Index\SegmentReader.cs:line 590
   at Lucene.Net.Index.CheckIndex.CheckDocValues(FieldInfo fi, AtomicReader reader, DocValuesStatus status) in z:\Builds\work\bcdbe6b8cc677a49\src\Lucene.Net.Core\Index\CheckIndex.cs:line 1937
   at Lucene.Net.Index.CheckIndex.TestDocValues(AtomicReader reader, StreamWriter infoStream) in z:\Builds\work\bcdbe6b8cc677a49\src\Lucene.Net.Core\Index\CheckIndex.cs:line 1706
FAILED
    WARNING: fixIndex() would remove reference to this segment; full exception:
   at Lucene.Net.Index.CheckIndex.DoCheckIndex(IList`1 onlySegments) in z:\Builds\work\bcdbe6b8cc677a49\src\Lucene.Net.Core\Index\CheckIndex.cs:line 828
  9 of 13: name=_d docCount=12
    codec=Lucene40
    compound=True
    numFiles=3
    size (MB)=0.00206661224365234
    diagnostics = System.Collections.Generic.Dictionary`2[System.String,System.String]
    no deletions
    test: open reader.........OK
    test: check integrity.....OK
    test: check live docs.....OK
    test: fields..............OK [6 fields]
    test: field norms.........OK [0 fields]
    test: terms, freq, prox...OK [12 terms; 12 terms/docs pairs; 0 tokens]
    test: stored fields.......OK [24 total field count; avg 2 fields per doc]
    test: term vectors........OK [0 total vector count; avg 0 term/freq vector fields per doc]
    test: docvalues...........ERROR [read past EOF: SlicedIndexInput(SlicedIndexInput(_d_2_dv.dat in RAMInputStream(name=_d.cfs)) in RAMInputStream(name=_d.cfs) slice=441:520)]
   at Lucene.Net.Store.BufferedIndexInput.ReadBytes(Byte[] b, Int32 offset, Int32 len, Boolean useBuffer) in z:\Builds\work\bcdbe6b8cc677a49\src\Lucene.Net.Core\Store\BufferedIndexInput.cs:line 192
   at Lucene.Net.Store.MockIndexInputWrapper.ReadBytes(Byte[] b, Int32 offset, Int32 len, Boolean useBuffer) in z:\Builds\work\bcdbe6b8cc677a49\src\Lucene.Net.TestFramework\Store\MockIndexInputWrapper.cs:line 140
   at Lucene.Net.Util.PagedBytes.Copy(IndexInput in, Int64 byteCount) in z:\Builds\work\bcdbe6b8cc677a49\src\Lucene.Net.Core\Util\PagedBytes.cs:line 202
   at Lucene.Net.Codecs.Lucene40.Lucene40DocValuesReader.LoadBytesFixedDeref(FieldInfo field) in z:\Builds\work\bcdbe6b8cc677a49\src\Lucene.Net.Core\Codecs\Lucene40\Lucene40DocValuesReader.cs:line 562
   at Lucene.Net.Codecs.Lucene40.Lucene40DocValuesReader.GetBinary(FieldInfo field) in z:\Builds\work\bcdbe6b8cc677a49\src\Lucene.Net.Core\Codecs\Lucene40\Lucene40DocValuesReader.cs:line 426
   at Lucene.Net.Index.SegmentReader.GetBinaryDocValues(String field) in z:\Builds\work\bcdbe6b8cc677a49\src\Lucene.Net.Core\Index\SegmentReader.cs:line 590
   at Lucene.Net.Index.CheckIndex.CheckDocValues(FieldInfo fi, AtomicReader reader, DocValuesStatus status) in z:\Builds\work\bcdbe6b8cc677a49\src\Lucene.Net.Core\Index\CheckIndex.cs:line 1937
   at Lucene.Net.Index.CheckIndex.TestDocValues(AtomicReader reader, StreamWriter infoStream) in z:\Builds\work\bcdbe6b8cc677a49\src\Lucene.Net.Core\Index\CheckIndex.cs:line 1706
FAILED
    WARNING: fixIndex() would remove reference to this segment; full exception:
   at Lucene.Net.Index.CheckIndex.DoCheckIndex(IList`1 onlySegments) in z:\Builds\work\bcdbe6b8cc677a49\src\Lucene.Net.Core\Index\CheckIndex.cs:line 828
  10 of 13: name=_f docCount=17
    codec=Lucene40
    compound=True
    numFiles=3
    size (MB)=0.00232696533203125
    diagnostics = System.Collections.Generic.Dictionary`2[System.String,System.String]
    no deletions
    test: open reader.........OK
    test: check integrity.....OK
    test: check live docs.....OK
    test: fields..............OK [6 fields]
    test: field norms.........OK [0 fields]
    test: terms, freq, prox...OK [17 terms; 17 terms/docs pairs; 0 tokens]
    test: stored fields.......OK [34 total field count; avg 2 fields per doc]
    test: term vectors........OK [0 total vector count; avg 0 term/freq vector fields per doc]
    test: docvalues...........ERROR [read past EOF: SlicedIndexInput(SlicedIndexInput(_f_2_dv.dat in RAMInputStream(name=_f.cfs)) in RAMInputStream(name=_f.cfs) slice=581:690)]
   at Lucene.Net.Store.BufferedIndexInput.ReadBytes(Byte[] b, Int32 offset, Int32 len, Boolean useBuffer) in z:\Builds\work\bcdbe6b8cc677a49\src\Lucene.Net.Core\Store\BufferedIndexInput.cs:line 192
   at Lucene.Net.Store.MockIndexInputWrapper.ReadBytes(Byte[] b, Int32 offset, Int32 len, Boolean useBuffer) in z:\Builds\work\bcdbe6b8cc677a49\src\Lucene.Net.TestFramework\Store\MockIndexInputWrapper.cs:line 140
   at Lucene.Net.Util.PagedBytes.Copy(IndexInput in, Int64 byteCount) in z:\Builds\work\bcdbe6b8cc677a49\src\Lucene.Net.Core\Util\PagedBytes.cs:line 202
   at Lucene.Net.Codecs.Lucene40.Lucene40DocValuesReader.LoadBytesFixedDeref(FieldInfo field) in z:\Builds\work\bcdbe6b8cc677a49\src\Lucene.Net.Core\Codecs\Lucene40\Lucene40DocValuesReader.cs:line 562
   at Lucene.Net.Codecs.Lucene40.Lucene40DocValuesReader.GetBinary(FieldInfo field) in z:\Builds\work\bcdbe6b8cc677a49\src\Lucene.Net.Core\Codecs\Lucene40\Lucene40DocValuesReader.cs:line 426
   at Lucene.Net.Index.SegmentReader.GetBinaryDocValues(String field) in z:\Builds\work\bcdbe6b8cc677a49\src\Lucene.Net.Core\Index\SegmentReader.cs:line 590
   at Lucene.Net.Index.CheckIndex.CheckDocValues(FieldInfo fi, AtomicReader reader, DocValuesStatus status) in z:\Builds\work\bcdbe6b8cc677a49\src\Lucene.Net.Core\Index\CheckIndex.cs:line 1937
   at Lucene.Net.Index.CheckIndex.TestDocValues(AtomicReader reader, StreamWriter infoStream) in z:\Builds\work\bcdbe6b8cc677a49\src\Lucene.Net.Core\Index\CheckIndex.cs:line 1706
FAILED
    WARNING: fixIndex() would remove reference to this segment; full exception:
   at Lucene.Net.Index.CheckIndex.DoCheckIndex(IList`1 onlySegments) in z:\Builds\work\bcdbe6b8cc677a49\src\Lucene.Net.Core\Index\CheckIndex.cs:line 828
  11 of 13: name=_i docCount=11
    codec=Lucene40
    compound=True
    numFiles=4
    size (MB)=0.00207805633544922
    diagnostics = System.Collections.Generic.Dictionary`2[System.String,System.String]
    has deletions [delGen=1]
    test: open reader.........OK
    test: check integrity.....OK
    test: check live docs.....OK [1 deleted docs]
    test: fields..............OK [6 fields]
    test: field norms.........OK [0 fields]
    test: terms, freq, prox...OK [10 terms; 10 terms/docs pairs; 0 tokens]
    test (ignoring deletes): terms, freq, prox...OK [11 terms; 11 terms/docs pairs; 0 tokens]
    test: stored fields.......OK [20 total field count; avg 2 fields per doc]
    test: term vectors........OK [0 total vector count; avg 0 term/freq vector fields per doc]
    test: docvalues...........ERROR [did not read all bytes from file: read 42 vs size 78 (resource: MockIndexInputWrapper(SlicedIndexInput(SlicedIndexInput(_i_2_dv.dat in RAMInputStream(name=_i.cfs)) in RAMInputStream(name=_i.cfs) slice=418:496)))]
   at Lucene.Net.Codecs.CodecUtil.CheckEOF(IndexInput in) in z:\Builds\work\bcdbe6b8cc677a49\src\Lucene.Net.Core\Codecs\CodecUtil.cs:line 255
   at Lucene.Net.Codecs.Lucene40.Lucene40DocValuesReader.LoadBytesFixedDeref(FieldInfo field) in z:\Builds\work\bcdbe6b8cc677a49\src\Lucene.Net.Core\Codecs\Lucene40\Lucene40DocValuesReader.cs:line 565
   at Lucene.Net.Codecs.Lucene40.Lucene40DocValuesReader.GetBinary(FieldInfo field) in z:\Builds\work\bcdbe6b8cc677a49\src\Lucene.Net.Core\Codecs\Lucene40\Lucene40DocValuesReader.cs:line 426
   at Lucene.Net.Index.SegmentReader.GetBinaryDocValues(String field) in z:\Builds\work\bcdbe6b8cc677a49\src\Lucene.Net.Core\Index\SegmentReader.cs:line 590
   at Lucene.Net.Index.CheckIndex.CheckDocValues(FieldInfo fi, AtomicReader reader, DocValuesStatus status) in z:\Builds\work\bcdbe6b8cc677a49\src\Lucene.Net.Core\Index\CheckIndex.cs:line 1937
   at Lucene.Net.Index.CheckIndex.TestDocValues(AtomicReader reader, StreamWriter infoStream) in z:\Builds\work\bcdbe6b8cc677a49\src\Lucene.Net.Core\Index\CheckIndex.cs:line 1706
FAILED
    WARNING: fixIndex() would remove reference to this segment; full exception:
   at Lucene.Net.Index.CheckIndex.DoCheckIndex(IList`1 onlySegments) in z:\Builds\work\bcdbe6b8cc677a49\src\Lucene.Net.Core\Index\CheckIndex.cs:line 828
  12 of 13: name=_j docCount=118
    codec=Lucene40
    compound=True
    numFiles=4
    size (MB)=0.00701713562011719
    diagnostics = System.Collections.Generic.Dictionary`2[System.String,System.String]
    has deletions [delGen=1]
    test: open reader.........OK
    test: check integrity.....OK
    test: check live docs.....OK [14 deleted docs]
    test: fields..............OK [6 fields]
    test: field norms.........OK [0 fields]
    test: terms, freq, prox...OK [104 terms; 104 terms/docs pairs; 0 tokens]
    test (ignoring deletes): terms, freq, prox...OK [118 terms; 118 terms/docs pairs; 0 tokens]
    test: stored fields.......OK [208 total field count; avg 2 fields per doc]
    test: term vectors........OK [0 total vector count; avg 0 term/freq vector fields per doc]
    test: docvalues...........ERROR [read past EOF: SlicedIndexInput(SlicedIndexInput(_j_2_dv.dat in RAMInputStream(name=_j.cfs)) in RAMInputStream(name=_j.cfs) slice=3229:3764)]
   at Lucene.Net.Store.BufferedIndexInput.ReadBytes(Byte[] b, Int32 offset, Int32 len, Boolean useBuffer) in z:\Builds\work\bcdbe6b8cc677a49\src\Lucene.Net.Core\Store\BufferedIndexInput.cs:line 192
   at Lucene.Net.Store.MockIndexInputWrapper.ReadBytes(Byte[] b, Int32 offset, Int32 len, Boolean useBuffer) in z:\Builds\work\bcdbe6b8cc677a49\src\Lucene.Net.TestFramework\Store\MockIndexInputWrapper.cs:line 140
   at Lucene.Net.Util.PagedBytes.Copy(IndexInput in, Int64 byteCount) in z:\Builds\work\bcdbe6b8cc677a49\src\Lucene.Net.Core\Util\PagedBytes.cs:line 202
   at Lucene.Net.Codecs.Lucene40.Lucene40DocValuesReader.LoadBytesFixedDeref(FieldInfo field) in z:\Builds\work\bcdbe6b8cc677a49\src\Lucene.Net.Core\Codecs\Lucene40\Lucene40DocValuesReader.cs:line 562
   at Lucene.Net.Codecs.Lucene40.Lucene40DocValuesReader.GetBinary(FieldInfo field) in z:\Builds\work\bcdbe6b8cc677a49\src\Lucene.Net.Core\Codecs\Lucene40\Lucene40DocValuesReader.cs:line 426
   at Lucene.Net.Index.SegmentReader.GetBinaryDocValues(String field) in z:\Builds\work\bcdbe6b8cc677a49\src\Lucene.Net.Core\Index\SegmentReader.cs:line 590
   at Lucene.Net.Index.CheckIndex.CheckDocValues(FieldInfo fi, AtomicReader reader, DocValuesStatus status) in z:\Builds\work\bcdbe6b8cc677a49\src\Lucene.Net.Core\Index\CheckIndex.cs:line 1937
   at Lucene.Net.Index.CheckIndex.TestDocValues(AtomicReader reader, StreamWriter infoStream) in z:\Builds\work\bcdbe6b8cc677a49\src\Lucene.Net.Core\Index\CheckIndex.cs:line 1706
FAILED
    WARNING: fixIndex() would remove reference to this segment; full exception:
   at Lucene.Net.Index.CheckIndex.DoCheckIndex(IList`1 onlySegments) in z:\Builds\work\bcdbe6b8cc677a49\src\Lucene.Net.Core\Index\CheckIndex.cs:line 828
  13 of 13: name=_n docCount=11
    codec=Lucene40
    compound=True
    numFiles=3
    size (MB)=0.00203800201416016
    diagnostics = System.Collections.Generic.Dictionary`2[System.String,System.String]
    no deletions
    test: open reader.........OK
    test: check integrity.....OK
    test: check live docs.....OK
    test: fields..............OK [6 fields]
    test: field norms.........OK [0 fields]
    test: terms, freq, prox...OK [11 terms; 11 terms/docs pairs; 0 tokens]
    test: stored fields.......OK [22 total field count; avg 2 fields per doc]
    test: term vectors........OK [0 total vector count; avg 0 term/freq vector fields per doc]
    test: docvalues...........ERROR [read past EOF: SlicedIndexInput(SlicedIndexInput(_n_2_dv.dat in RAMInputStream(name=_n.cfs)) in RAMInputStream(name=_n.cfs) slice=420:500)]
   at Lucene.Net.Store.BufferedIndexInput.ReadBytes(Byte[] b, Int32 offset, Int32 len, Boolean useBuffer) in z:\Builds\work\bcdbe6b8cc677a49\src\Lucene.Net.Core\Store\BufferedIndexInput.cs:line 192
   at Lucene.Net.Store.MockIndexInputWrapper.ReadBytes(Byte[] b, Int32 offset, Int32 len, Boolean useBuffer) in z:\Builds\work\bcdbe6b8cc677a49\src\Lucene.Net.TestFramework\Store\MockIndexInputWrapper.cs:line 140
   at Lucene.Net.Util.PagedBytes.Copy(IndexInput in, Int64 byteCount) in z:\Builds\work\bcdbe6b8cc677a49\src\Lucene.Net.Core\Util\PagedBytes.cs:line 202
   at Lucene.Net.Codecs.Lucene40.Lucene40DocValuesReader.LoadBytesFixedDeref(FieldInfo field) in z:\Builds\work\bcdbe6b8cc677a49\src\Lucene.Net.Core\Codecs\Lucene40\Lucene40DocValuesReader.cs:line 562
   at Lucene.Net.Codecs.Lucene40.Lucene40DocValuesReader.GetBinary(FieldInfo field) in z:\Builds\work\bcdbe6b8cc677a49\src\Lucene.Net.Core\Codecs\Lucene40\Lucene40DocValuesReader.cs:line 426
   at Lucene.Net.Index.SegmentReader.GetBinaryDocValues(String field) in z:\Builds\work\bcdbe6b8cc677a49\src\Lucene.Net.Core\Index\SegmentReader.cs:line 590
   at Lucene.Net.Index.CheckIndex.CheckDocValues(FieldInfo fi, AtomicReader reader, DocValuesStatus status) in z:\Builds\work\bcdbe6b8cc677a49\src\Lucene.Net.Core\Index\CheckIndex.cs:line 1937
   at Lucene.Net.Index.CheckIndex.TestDocValues(AtomicReader reader, StreamWriter infoStream) in z:\Builds\work\bcdbe6b8cc677a49\src\Lucene.Net.Core\Index\CheckIndex.cs:line 1706
FAILED
    WARNING: fixIndex() would remove reference to this segment; full exception:
   at Lucene.Net.Index.CheckIndex.DoCheckIndex(IList`1 onlySegments) in z:\Builds\work\bcdbe6b8cc677a49\src\Lucene.Net.Core\Index\CheckIndex.cs:line 828
WARNING: 13 broken segments (containing 388 documents) detected
Changes included (1 change)
====================================================
Change 0da1fe3d0e49fc44a8f19f71c6ffb9bb9d98f76f by laimis (1 file):
don't use instance variables, clean up test


see more information about changed files: http://teamcity.codebetter.com/viewLog.html?tab=buildChangesDiv&buildId=184926&buildTypeId=LuceneNet_Core

============================================================================
Configure email notifications: http://teamcity.codebetter.com/profile.html?init=1&tab=userNotifications

Mime
  • Unnamed multipart/alternative (inline, None, 0 bytes)
View raw message