lucenenet-dev mailing list archives

Site index · List index
Message view « Date » · « Thread »
Top « Date » · « Thread »
From t.@codebetter.com
Subject [TeamCity, FAILED] Build Lucene.NET :: Lucene.NET Core [master] #350
Date Wed, 04 Mar 2015 12:24:07 GMT
Build Lucene.NET :: Lucene.NET Core [master] #350 failed (Tests failed: 53 (8 new), passed:
2413, ignored: 111).
Agent: JetBrains-dotnet-agent02
Build results: http://teamcity.codebetter.com/viewLog.html?buildId=184934&buildTypeId=LuceneNet_Core

Failed Tests Summary:
Newly failed tests (8 tests, alphabetically ordered)
==================================================================
Lucene.Net.Tests.dll: Lucene.Net.Analysis.TestGraphTokenizers.TestMockGraphTokenFilterAfterHolesRandom
Lucene.Net.Tests.dll: Lucene.Net.Codecs.Lucene40.TestLucene40DocValuesFormat.BaseIndexFileFormatTestCase.TestMergeStability
Lucene.Net.Tests.dll: Lucene.Net.Codecs.Lucene40.TestLucene40StoredFieldsFormat.BaseStoredFieldsFormatTestCase.TestConcurrentReads
Lucene.Net.Tests.dll: Lucene.Net.Codecs.Lucene42.TestLucene42DocValuesFormat.BaseDocValuesFormatTestCase.TestRandomSortedBytes
Lucene.Net.Tests.dll: Lucene.Net.Index.TestIndexWriterExceptions.TestExceptionDuringRollback
Lucene.Net.Tests.dll: Lucene.Net.Index.TestTransactions.TestTransactions_Mem
Lucene.Net.Tests.dll: Lucene.Net.Util.Automaton.TestBasicOperations.TestGetRandomAcceptedString
Lucene.Net.Tests.dll: Lucene.Net.Util.Automaton.TestMinimize.Test

Other failed tests (45 tests, alphabetically ordered)
==================================================================
Lucene.Net.Tests.dll: Lucene.Net.Codecs.Lucene40.TestLucene40DocValuesFormat.BaseDocValuesFormatTestCase.TestBinaryVariableLengthVsStoredFields
Lucene.Net.Tests.dll: Lucene.Net.Codecs.Lucene40.TestLucene40DocValuesFormat.BaseDocValuesFormatTestCase.TestEmptyBinaryValueOnPageSizes
Lucene.Net.Tests.dll: Lucene.Net.Codecs.Lucene40.TestLucene40DocValuesFormat.BaseDocValuesFormatTestCase.TestThreads
Lucene.Net.Tests.dll: Lucene.Net.Codecs.Lucene41.TestBlockPostingsFormat2
Lucene.Net.Tests.dll: Lucene.Net.Codecs.Lucene41.TestBlockPostingsFormat3.Test
Lucene.Net.Tests.dll: Lucene.Net.Codecs.Lucene42.TestLucene42DocValuesFormat.BaseDocValuesFormatTestCase.TestVeryLargeButLegalSortedBytes
Lucene.Net.Tests.dll: Lucene.Net.Index.TestDirectoryReader.TestNoDir
Lucene.Net.Tests.dll: Lucene.Net.Index.TestDocumentsWriterStallControl.TestSimpleStall
Lucene.Net.Tests.dll: Lucene.Net.Index.TestDuelingCodecs.TestEquals
Lucene.Net.Tests.dll: Lucene.Net.Index.TestIndexWriterExceptions.TestExceptionOnMergeInit
Lucene.Net.Tests.dll: Lucene.Net.Index.TestIndexWriterReader.TestDuringAddDelete
Lucene.Net.Tests.dll: Lucene.Net.Index.TestNRTThreads.TestNRTThreads_Mem
Lucene.Net.Tests.dll: Lucene.Net.Index.TestTermdocPerf.TestTermDocPerf
Lucene.Net.Tests.dll: Lucene.Net.Search.Payloads.TestPayloadNearQuery.Test
Lucene.Net.Tests.dll: Lucene.Net.Search.Payloads.TestPayloadNearQuery.TestAverageFunction
Lucene.Net.Tests.dll: Lucene.Net.Search.Payloads.TestPayloadNearQuery.TestComplexNested
Lucene.Net.Tests.dll: Lucene.Net.Search.Payloads.TestPayloadNearQuery.TestLongerSpan
Lucene.Net.Tests.dll: Lucene.Net.Search.Payloads.TestPayloadNearQuery.TestMaxFunction
Lucene.Net.Tests.dll: Lucene.Net.Search.Payloads.TestPayloadNearQuery.TestMinFunction
Lucene.Net.Tests.dll: Lucene.Net.Search.Payloads.TestPayloadNearQuery.TestPayloadNear
Lucene.Net.Tests.dll: Lucene.Net.Search.Spans.TestSpanMultiTermQueryWrapper.TestFuzzy2
Lucene.Net.Tests.dll: Lucene.Net.Search.TestFuzzyQuery.TestTieBreaker
Lucene.Net.Tests.dll: Lucene.Net.Search.TestMultiPhraseQuery.TestMultiSloppyWithRepeats
Lucene.Net.Tests.dll: Lucene.Net.Search.TestMultiValuedNumericRangeQuery.TestMultiValuedNRQ
Lucene.Net.Tests.dll: Lucene.Net.Search.TestNumericRangeQuery32.TestInfiniteValues
Lucene.Net.Tests.dll: Lucene.Net.Search.TestNumericRangeQuery64.TestInfiniteValues
Lucene.Net.Tests.dll: Lucene.Net.Search.TestRegexpQuery.TestBacktracking
Lucene.Net.Tests.dll: Lucene.Net.Search.TestRegexpQuery.TestRegexComplement
Lucene.Net.Tests.dll: Lucene.Net.Search.TestRegexpRandom.TestRegexps
Lucene.Net.Tests.dll: Lucene.Net.Search.TestSearchAfter.TestQueries
Lucene.Net.Tests.dll: Lucene.Net.Search.TestSearcherManager.TestSearcherManager_Mem
Lucene.Net.Tests.dll: Lucene.Net.Search.TestSimpleExplanations.TestDMQ8
Lucene.Net.Tests.dll: Lucene.Net.Search.TestTermVectors
Lucene.Net.Tests.dll: Lucene.Net.Search.TestTermVectors.TestMixedVectrosVectors
Lucene.Net.Tests.dll: Lucene.Net.Search.TestTopDocsMerge.TestSort_1
Lucene.Net.Tests.dll: Lucene.Net.Search.TestTopDocsMerge.TestSort_2
Lucene.Net.Tests.dll: Lucene.Net.Search.TestWildcardRandom.TestWildcards
Lucene.Net.Tests.dll: Lucene.Net.Store.TestBufferedIndexInput.TestSetBufferSize
Lucene.Net.Tests.dll: Lucene.Net.Store.TestFileSwitchDirectory.TestNoDir
Lucene.Net.Tests.dll: Lucene.Net.Store.TestNRTCachingDirectory.TestNoDir
Lucene.Net.Tests.dll: Lucene.Net.Tests.TestAssertions.TestTokenStreams
Lucene.Net.Tests.dll: Lucene.Net.Util.Automaton.TestUTF32ToUTF8.TestRandomRegexes
Lucene.Net.Tests.dll: Lucene.Net.Util.Packed.TestEliasFanoSequence.TestMonotoneSequences
Lucene.Net.Tests.dll: Lucene.Net.Util.TestIndexableBinaryStringTools.TestEncodedSortability
Lucene.Net.Tests.dll: Lucene.Net.Util.TestOpenBitSet.TestSmall



Newly failed tests details (only first 3 failures shown here)
==================================================================
Lucene.Net.Tests.dll: Lucene.Net.Analysis.TestGraphTokenizers.TestMockGraphTokenFilterAfterHolesRandom
(new) =================
Test(s) failed. Test exceeded Timeout value of 20000ms

Lucene.Net.Tests.dll: Lucene.Net.Codecs.Lucene40.TestLucene40DocValuesFormat.BaseIndexFileFormatTestCase.TestMergeStability
(new) =================
Test(s) failed.   Expected: 11686
  But was:  11052

   at NUnit.Framework.Assert.That(Object actual, IResolveConstraint expression, String message,
Object[] args)
   at NUnit.Framework.Assert.AreEqual(Object expected, Object actual)
   at Lucene.Net.Util.LuceneTestCase.assertEquals[T,S](IDictionary`2 expected, IDictionary`2
actual) in z:\Builds\work\bcdbe6b8cc677a49\src\Lucene.Net.TestFramework\JavaCompatibility\LuceneTestCase.cs:line
64
   at Lucene.Net.Index.BaseIndexFileFormatTestCase.TestMergeStability() in z:\Builds\work\bcdbe6b8cc677a49\src\Lucene.Net.TestFramework\Index\BaseIndexFileFormatTestCase.cs:line
126
Lucene.Net.Tests.dll: Lucene.Net.Codecs.Lucene40.TestLucene40StoredFieldsFormat.BaseStoredFieldsFormatTestCase.TestConcurrentReads
(new) =================
Test(s) failed. System.InvalidOperationException : Expected 1 hit, got 0
   at Lucene.Net.Index.BaseStoredFieldsFormatTestCase.TestConcurrentReads() in z:\Builds\work\bcdbe6b8cc677a49\src\Lucene.Net.TestFramework\Index\BaseStoredFieldsFormatTestCase.cs:line
453
see all newly failed tests: http://teamcity.codebetter.com/viewLog.html?buildId=184934&buildTypeId=LuceneNet_Core



Other failed tests details (only first 3 failures shown here)
==================================================================
Lucene.Net.Tests.dll: Lucene.Net.Codecs.Lucene40.TestLucene40DocValuesFormat.BaseDocValuesFormatTestCase.TestBinaryVariableLengthVsStoredFields
=================
Test(s) failed. System.IO.EndOfStreamException : read past EOF: SlicedIndexInput(SlicedIndexInput(_0_2_dv.dat
in RAMInputStream(name=_0_dv.cfs)) in RAMInputStream(name=_0_dv.cfs) slice=31:153)
   at Lucene.Net.Store.BufferedIndexInput.ReadBytes(Byte[] b, Int32 offset, Int32 len, Boolean
useBuffer) in z:\Builds\work\bcdbe6b8cc677a49\src\Lucene.Net.Core\Store\BufferedIndexInput.cs:line
192
   at Lucene.Net.Store.MockIndexInputWrapper.ReadBytes(Byte[] b, Int32 offset, Int32 len,
Boolean useBuffer) in z:\Builds\work\bcdbe6b8cc677a49\src\Lucene.Net.TestFramework\Store\MockIndexInputWrapper.cs:line
140
   at Lucene.Net.Util.PagedBytes.Copy(IndexInput in, Int64 byteCount) in z:\Builds\work\bcdbe6b8cc677a49\src\Lucene.Net.Core\Util\PagedBytes.cs:line
202
   at Lucene.Net.Codecs.Lucene40.Lucene40DocValuesReader.LoadBytesFixedDeref(FieldInfo field)
in z:\Builds\work\bcdbe6b8cc677a49\src\Lucene.Net.Core\Codecs\Lucene40\Lucene40DocValuesReader.cs:line
562
   at Lucene.Net.Codecs.Lucene40.Lucene40DocValuesReader.GetBinary(FieldInfo field) in z:\Builds\work\bcdbe6b8cc677a49\src\Lucene.Net.Core\Codecs\Lucene40\Lucene40DocValuesReader.cs:line
426
   at Lucene.Net.Index.SegmentReader.GetBinaryDocValues(String field) in z:\Builds\work\bcdbe6b8cc677a49\src\Lucene.Net.Core\Index\SegmentReader.cs:line
590
   at Lucene.Net.Index.BaseDocValuesFormatTestCase.DoTestBinaryVsStoredFields(Int32 minLength,
Int32 maxLength) in z:\Builds\work\bcdbe6b8cc677a49\src\Lucene.Net.TestFramework\Index\BaseDocValuesFormatTestCase.cs:line
1633
   at Lucene.Net.Index.BaseDocValuesFormatTestCase.TestBinaryVariableLengthVsStoredFields()
in z:\Builds\work\bcdbe6b8cc677a49\src\Lucene.Net.TestFramework\Index\BaseDocValuesFormatTestCase.cs:line
1663
Lucene.Net.Tests.dll: Lucene.Net.Codecs.Lucene40.TestLucene40DocValuesFormat.BaseDocValuesFormatTestCase.TestEmptyBinaryValueOnPageSizes
=================
Test(s) failed. System.IO.IOException : did not read all bytes from file: read 31 vs size
32 (resource: MockIndexInputWrapper(SlicedIndexInput(SlicedIndexInput(_0_0_dv.dat in RAMInputStream(name=_0_dv.cfs))
in RAMInputStream(name=_0_dv.cfs) slice=31:63)))
   at Lucene.Net.Codecs.CodecUtil.CheckEOF(IndexInput in) in z:\Builds\work\bcdbe6b8cc677a49\src\Lucene.Net.Core\Codecs\CodecUtil.cs:line
255
   at Lucene.Net.Codecs.Lucene40.Lucene40DocValuesReader.LoadBytesFixedDeref(FieldInfo field)
in z:\Builds\work\bcdbe6b8cc677a49\src\Lucene.Net.Core\Codecs\Lucene40\Lucene40DocValuesReader.cs:line
565
   at Lucene.Net.Codecs.Lucene40.Lucene40DocValuesReader.GetBinary(FieldInfo field) in z:\Builds\work\bcdbe6b8cc677a49\src\Lucene.Net.Core\Codecs\Lucene40\Lucene40DocValuesReader.cs:line
426
   at Lucene.Net.Index.SegmentReader.GetBinaryDocValues(String field) in z:\Builds\work\bcdbe6b8cc677a49\src\Lucene.Net.Core\Index\SegmentReader.cs:line
590
   at Lucene.Net.Index.MultiDocValues.GetBinaryValues(IndexReader r, String field) in z:\Builds\work\bcdbe6b8cc677a49\src\Lucene.Net.Core\Index\MultiDocValues.cs:line
270
   at Lucene.Net.Index.SlowCompositeReaderWrapper.GetBinaryDocValues(String field) in z:\Builds\work\bcdbe6b8cc677a49\src\Lucene.Net.Core\Index\SlowCompositeReaderWrapper.cs:line
108
   at Lucene.Net.Index.BaseDocValuesFormatTestCase.TestEmptyBinaryValueOnPageSizes() in z:\Builds\work\bcdbe6b8cc677a49\src\Lucene.Net.TestFramework\Index\BaseDocValuesFormatTestCase.cs:line
3497
Lucene.Net.Tests.dll: Lucene.Net.Codecs.Lucene40.TestLucene40DocValuesFormat.BaseDocValuesFormatTestCase.TestThreads
=================
Test(s) failed. System.Exception : CheckIndex failed
   at Lucene.Net.Util.TestUtil.CheckIndex(Directory dir, Boolean crossCheckTermVectors) in
z:\Builds\work\bcdbe6b8cc677a49\src\Lucene.Net.TestFramework\Util\TestUtil.cs:line 257
   at Lucene.Net.Store.MockDirectoryWrapper.Dispose() in z:\Builds\work\bcdbe6b8cc677a49\src\Lucene.Net.TestFramework\Store\MockDirectoryWrapper.cs:line
943
   at Lucene.Net.Index.BaseDocValuesFormatTestCase.TestThreads() in z:\Builds\work\bcdbe6b8cc677a49\src\Lucene.Net.TestFramework\Index\BaseDocValuesFormatTestCase.cs:line
3225
------- Stderr: -------
Unhandled exception in remote appdomain: System.Exception: did not read all bytes from file:
read 31 vs size 307 (resource: MockIndexInputWrapper(SlicedIndexInput(SlicedIndexInput(_0_2_dv.dat
in RAMInputStream(name=_0.cfs)) in RAMInputStream(name=_0.cfs) slice=1967:2274))) --->
System.IO.IOException: did not read all bytes from file: read 31 vs size 307 (resource: MockIndexInputWrapper(SlicedIndexInput(SlicedIndexInput(_0_2_dv.dat
in RAMInputStream(name=_0.cfs)) in RAMInputStream(name=_0.cfs) slice=1967:2274)))
   at Lucene.Net.Codecs.CodecUtil.CheckEOF(IndexInput in) in z:\Builds\work\bcdbe6b8cc677a49\src\Lucene.Net.Core\Codecs\CodecUtil.cs:line
255
   at Lucene.Net.Codecs.Lucene40.Lucene40DocValuesReader.LoadBytesFixedDeref(FieldInfo field)
in z:\Builds\work\bcdbe6b8cc677a49\src\Lucene.Net.Core\Codecs\Lucene40\Lucene40DocValuesReader.cs:line
565
   at Lucene.Net.Codecs.Lucene40.Lucene40DocValuesReader.GetBinary(FieldInfo field) in z:\Builds\work\bcdbe6b8cc677a49\src\Lucene.Net.Core\Codecs\Lucene40\Lucene40DocValuesReader.cs:line
426
   at Lucene.Net.Index.SegmentReader.GetBinaryDocValues(String field) in z:\Builds\work\bcdbe6b8cc677a49\src\Lucene.Net.Core\Index\SegmentReader.cs:line
590
   at Lucene.Net.Index.BaseDocValuesFormatTestCase.ThreadAnonymousInnerClassHelper.Run() in
z:\Builds\work\bcdbe6b8cc677a49\src\Lucene.Net.TestFramework\Index\BaseDocValuesFormatTestCase.cs:line
3250
   --- End of inner exception stack trace ---
   at Lucene.Net.Index.BaseDocValuesFormatTestCase.ThreadAnonymousInnerClassHelper.Run() in
z:\Builds\work\bcdbe6b8cc677a49\src\Lucene.Net.TestFramework\Index\BaseDocValuesFormatTestCase.cs:line
3269
   at System.Threading.ThreadHelper.ThreadStart_Context(Object state)
   at System.Threading.ExecutionContext.RunInternal(ExecutionContext executionContext, ContextCallback
callback, Object state, Boolean preserveSyncCtx)
   at System.Threading.ExecutionContext.Run(ExecutionContext executionContext, ContextCallback
callback, Object state, Boolean preserveSyncCtx)
   at System.Threading.ExecutionContext.Run(ExecutionContext executionContext, ContextCallback
callback, Object state)
   at System.Threading.ThreadHelper.ThreadStart()
Unhandled exception in remote appdomain: System.Exception: did not read all bytes from file:
read 31 vs size 307 (resource: MockIndexInputWrapper(SlicedIndexInput(SlicedIndexInput(_0_2_dv.dat
in RAMInputStream(name=_0.cfs)) in RAMInputStream(name=_0.cfs) slice=1967:2274))) --->
System.IO.IOException: did not read all bytes from file: read 31 vs size 307 (resource: MockIndexInputWrapper(SlicedIndexInput(SlicedIndexInput(_0_2_dv.dat
in RAMInputStream(name=_0.cfs)) in RAMInputStream(name=_0.cfs) slice=1967:2274)))
   at Lucene.Net.Codecs.CodecUtil.CheckEOF(IndexInput in) in z:\Builds\work\bcdbe6b8cc677a49\src\Lucene.Net.Core\Codecs\CodecUtil.cs:line
255
   at Lucene.Net.Codecs.Lucene40.Lucene40DocValuesReader.LoadBytesFixedDeref(FieldInfo field)
in z:\Builds\work\bcdbe6b8cc677a49\src\Lucene.Net.Core\Codecs\Lucene40\Lucene40DocValuesReader.cs:line
565
   at Lucene.Net.Codecs.Lucene40.Lucene40DocValuesReader.GetBinary(FieldInfo field) in z:\Builds\work\bcdbe6b8cc677a49\src\Lucene.Net.Core\Codecs\Lucene40\Lucene40DocValuesReader.cs:line
426
   at Lucene.Net.Index.SegmentReader.GetBinaryDocValues(String field) in z:\Builds\work\bcdbe6b8cc677a49\src\Lucene.Net.Core\Index\SegmentReader.cs:line
590
   at Lucene.Net.Index.BaseDocValuesFormatTestCase.ThreadAnonymousInnerClassHelper.Run() in
z:\Builds\work\bcdbe6b8cc677a49\src\Lucene.Net.TestFramework\Index\BaseDocValuesFormatTestCase.cs:line
3250
   --- End of inner exception stack trace ---
   at Lucene.Net.Index.BaseDocValuesFormatTestCase.ThreadAnonymousInnerClassHelper.Run() in
z:\Builds\work\bcdbe6b8cc677a49\src\Lucene.Net.TestFramework\Index\BaseDocValuesFormatTestCase.cs:line
3269
   at System.Threading.ThreadHelper.ThreadStart_Context(Object state)
   at System.Threading.ExecutionContext.RunInternal(ExecutionContext executionContext, ContextCallback
callback, Object state, Boolean preserveSyncCtx)
   at System.Threading.ExecutionContext.Run(ExecutionContext executionContext, ContextCallback
callback, Object state, Boolean preserveSyncCtx)
   at System.Threading.ExecutionContext.Run(ExecutionContext executionContext, ContextCallback
callback, Object state)
   at System.Threading.ThreadHelper.ThreadStart()
Unhandled exception in remote appdomain: System.Exception: did not read all bytes from file:
read 31 vs size 307 (resource: MockIndexInputWrapper(SlicedIndexInput(SlicedIndexInput(_0_2_dv.dat
in RAMInputStream(name=_0.cfs)) in RAMInputStream(name=_0.cfs) slice=1967:2274))) --->
System.IO.IOException: did not read all bytes from file: read 31 vs size 307 (resource: MockIndexInputWrapper(SlicedIndexInput(SlicedIndexInput(_0_2_dv.dat
in RAMInputStream(name=_0.cfs)) in RAMInputStream(name=_0.cfs) slice=1967:2274)))
   at Lucene.Net.Codecs.CodecUtil.CheckEOF(IndexInput in) in z:\Builds\work\bcdbe6b8cc677a49\src\Lucene.Net.Core\Codecs\CodecUtil.cs:line
255
   at Lucene.Net.Codecs.Lucene40.Lucene40DocValuesReader.LoadBytesFixedDeref(FieldInfo field)
in z:\Builds\work\bcdbe6b8cc677a49\src\Lucene.Net.Core\Codecs\Lucene40\Lucene40DocValuesReader.cs:line
565
   at Lucene.Net.Codecs.Lucene40.Lucene40DocValuesReader.GetBinary(FieldInfo field) in z:\Builds\work\bcdbe6b8cc677a49\src\Lucene.Net.Core\Codecs\Lucene40\Lucene40DocValuesReader.cs:line
426
   at Lucene.Net.Index.SegmentReader.GetBinaryDocValues(String field) in z:\Builds\work\bcdbe6b8cc677a49\src\Lucene.Net.Core\Index\SegmentReader.cs:line
590
   at Lucene.Net.Index.BaseDocValuesFormatTestCase.ThreadAnonymousInnerClassHelper.Run() in
z:\Builds\work\bcdbe6b8cc677a49\src\Lucene.Net.TestFramework\Index\BaseDocValuesFormatTestCase.cs:line
3250
   --- End of inner exception stack trace ---
   at Lucene.Net.Index.BaseDocValuesFormatTestCase.ThreadAnonymousInnerClassHelper.Run() in
z:\Builds\work\bcdbe6b8cc677a49\src\Lucene.Net.TestFramework\Index\BaseDocValuesFormatTestCase.cs:line
3269
   at System.Threading.ThreadHelper.ThreadStart_Context(Object state)
   at System.Threading.ExecutionContext.RunInternal(ExecutionContext executionContext, ContextCallback
callback, Object state, Boolean preserveSyncCtx)
   at System.Threading.ExecutionContext.Run(ExecutionContext executionContext, ContextCallback
callback, Object state, Boolean preserveSyncCtx)
   at System.Threading.ExecutionContext.Run(ExecutionContext executionContext, ContextCallback
callback, Object state)
   at System.Threading.ThreadHelper.ThreadStart()
CheckIndex failed
´╗┐Segments file=segments_12 numSegments=12 version=4.8 format=
  1 of 12: name=_0 docCount=71
    codec=Lucene40
    compound=True
    numFiles=4
    size (MB)=0.00472068786621094
    diagnostics = System.Collections.Generic.Dictionary`2[System.String,System.String]
    has deletions [delGen=1]
    test: open reader.........OK
    test: check integrity.....OK
    test: check live docs.....OK [8 deleted docs]
    test: fields..............OK [6 fields]
    test: field norms.........OK [0 fields]
    test: terms, freq, prox...OK [63 terms; 63 terms/docs pairs; 0 tokens]
    test (ignoring deletes): terms, freq, prox...OK [71 terms; 71 terms/docs pairs; 0 tokens]
    test: stored fields.......OK [126 total field count; avg 2 fields per doc]
    test: term vectors........OK [0 total vector count; avg 0 term/freq vector fields per
doc]
    test: docvalues...........ERROR [did not read all bytes from file: read 31 vs size 307
(resource: MockIndexInputWrapper(SlicedIndexInput(SlicedIndexInput(_0_2_dv.dat in RAMInputStream(name=_0.cfs))
in RAMInputStream(name=_0.cfs) slice=1967:2274)))]
   at Lucene.Net.Codecs.CodecUtil.CheckEOF(IndexInput in) in z:\Builds\work\bcdbe6b8cc677a49\src\Lucene.Net.Core\Codecs\CodecUtil.cs:line
255
   at Lucene.Net.Codecs.Lucene40.Lucene40DocValuesReader.LoadBytesFixedDeref(FieldInfo field)
in z:\Builds\work\bcdbe6b8cc677a49\src\Lucene.Net.Core\Codecs\Lucene40\Lucene40DocValuesReader.cs:line
565
   at Lucene.Net.Codecs.Lucene40.Lucene40DocValuesReader.GetBinary(FieldInfo field) in z:\Builds\work\bcdbe6b8cc677a49\src\Lucene.Net.Core\Codecs\Lucene40\Lucene40DocValuesReader.cs:line
426
   at Lucene.Net.Index.SegmentReader.GetBinaryDocValues(String field) in z:\Builds\work\bcdbe6b8cc677a49\src\Lucene.Net.Core\Index\SegmentReader.cs:line
590
   at Lucene.Net.Index.CheckIndex.CheckDocValues(FieldInfo fi, AtomicReader reader, DocValuesStatus
status) in z:\Builds\work\bcdbe6b8cc677a49\src\Lucene.Net.Core\Index\CheckIndex.cs:line 1937
   at Lucene.Net.Index.CheckIndex.TestDocValues(AtomicReader reader, StreamWriter infoStream)
in z:\Builds\work\bcdbe6b8cc677a49\src\Lucene.Net.Core\Index\CheckIndex.cs:line 1706
FAILED
    WARNING: fixIndex() would remove reference to this segment; full exception:
   at Lucene.Net.Index.CheckIndex.DoCheckIndex(IList`1 onlySegments) in z:\Builds\work\bcdbe6b8cc677a49\src\Lucene.Net.Core\Index\CheckIndex.cs:line
828
  2 of 12: name=_1 docCount=28
    codec=Lucene40
    compound=True
    numFiles=4
    size (MB)=0.00286674499511719
    diagnostics = System.Collections.Generic.Dictionary`2[System.String,System.String]
    has deletions [delGen=1]
    test: open reader.........OK
    test: check integrity.....OK
    test: check live docs.....OK [3 deleted docs]
    test: fields..............OK [6 fields]
    test: field norms.........OK [0 fields]
    test: terms, freq, prox...OK [25 terms; 25 terms/docs pairs; 0 tokens]
    test (ignoring deletes): terms, freq, prox...OK [28 terms; 28 terms/docs pairs; 0 tokens]
    test: stored fields.......OK [50 total field count; avg 2 fields per doc]
    test: term vectors........OK [0 total vector count; avg 0 term/freq vector fields per
doc]
    test: docvalues...........ERROR [did not read all bytes from file: read 143 vs size 160
(resource: MockIndexInputWrapper(SlicedIndexInput(SlicedIndexInput(_1_2_dv.dat in RAMInputStream(name=_1.cfs))
in RAMInputStream(name=_1.cfs) slice=874:1034)))]
   at Lucene.Net.Codecs.CodecUtil.CheckEOF(IndexInput in) in z:\Builds\work\bcdbe6b8cc677a49\src\Lucene.Net.Core\Codecs\CodecUtil.cs:line
255
   at Lucene.Net.Codecs.Lucene40.Lucene40DocValuesReader.LoadBytesFixedDeref(FieldInfo field)
in z:\Builds\work\bcdbe6b8cc677a49\src\Lucene.Net.Core\Codecs\Lucene40\Lucene40DocValuesReader.cs:line
565
   at Lucene.Net.Codecs.Lucene40.Lucene40DocValuesReader.GetBinary(FieldInfo field) in z:\Builds\work\bcdbe6b8cc677a49\src\Lucene.Net.Core\Codecs\Lucene40\Lucene40DocValuesReader.cs:line
426
   at Lucene.Net.Index.SegmentReader.GetBinaryDocValues(String field) in z:\Builds\work\bcdbe6b8cc677a49\src\Lucene.Net.Core\Index\SegmentReader.cs:line
590
   at Lucene.Net.Index.CheckIndex.CheckDocValues(FieldInfo fi, AtomicReader reader, DocValuesStatus
status) in z:\Builds\work\bcdbe6b8cc677a49\src\Lucene.Net.Core\Index\CheckIndex.cs:line 1937
   at Lucene.Net.Index.CheckIndex.TestDocValues(AtomicReader reader, StreamWriter infoStream)
in z:\Builds\work\bcdbe6b8cc677a49\src\Lucene.Net.Core\Index\CheckIndex.cs:line 1706
FAILED
    WARNING: fixIndex() would remove reference to this segment; full exception:
   at Lucene.Net.Index.CheckIndex.DoCheckIndex(IList`1 onlySegments) in z:\Builds\work\bcdbe6b8cc677a49\src\Lucene.Net.Core\Index\CheckIndex.cs:line
828
  3 of 12: name=_2 docCount=4
    codec=Lucene40
    compound=True
    numFiles=4
    size (MB)=0.00179100036621094
    diagnostics = System.Collections.Generic.Dictionary`2[System.String,System.String]
    has deletions [delGen=1]
    test: open reader.........OK
    test: check integrity.....OK
    test: check live docs.....OK [1 deleted docs]
    test: fields..............OK [6 fields]
    test: field norms.........OK [0 fields]
    test: terms, freq, prox...OK [3 terms; 3 terms/docs pairs; 0 tokens]
    test (ignoring deletes): terms, freq, prox...OK [4 terms; 4 terms/docs pairs; 0 tokens]
    test: stored fields.......OK [6 total field count; avg 2 fields per doc]
    test: term vectors........OK [0 total vector count; avg 0 term/freq vector fields per
doc]
    test: docvalues...........ERROR [read past EOF: SlicedIndexInput(SlicedIndexInput(_2_2_dv.dat
in RAMInputStream(name=_2.cfs)) in RAMInputStream(name=_2.cfs) slice=244:302)]
   at Lucene.Net.Store.BufferedIndexInput.ReadBytes(Byte[] b, Int32 offset, Int32 len, Boolean
useBuffer) in z:\Builds\work\bcdbe6b8cc677a49\src\Lucene.Net.Core\Store\BufferedIndexInput.cs:line
192
   at Lucene.Net.Store.MockIndexInputWrapper.ReadBytes(Byte[] b, Int32 offset, Int32 len,
Boolean useBuffer) in z:\Builds\work\bcdbe6b8cc677a49\src\Lucene.Net.TestFramework\Store\MockIndexInputWrapper.cs:line
140
   at Lucene.Net.Util.PagedBytes.Copy(IndexInput in, Int64 byteCount) in z:\Builds\work\bcdbe6b8cc677a49\src\Lucene.Net.Core\Util\PagedBytes.cs:line
202
   at Lucene.Net.Codecs.Lucene40.Lucene40DocValuesReader.LoadBytesFixedDeref(FieldInfo field)
in z:\Builds\work\bcdbe6b8cc677a49\src\Lucene.Net.Core\Codecs\Lucene40\Lucene40DocValuesReader.cs:line
562
   at Lucene.Net.Codecs.Lucene40.Lucene40DocValuesReader.GetBinary(FieldInfo field) in z:\Builds\work\bcdbe6b8cc677a49\src\Lucene.Net.Core\Codecs\Lucene40\Lucene40DocValuesReader.cs:line
426
   at Lucene.Net.Index.SegmentReader.GetBinaryDocValues(String field) in z:\Builds\work\bcdbe6b8cc677a49\src\Lucene.Net.Core\Index\SegmentReader.cs:line
590
   at Lucene.Net.Index.CheckIndex.CheckDocValues(FieldInfo fi, AtomicReader reader, DocValuesStatus
status) in z:\Builds\work\bcdbe6b8cc677a49\src\Lucene.Net.Core\Index\CheckIndex.cs:line 1937
   at Lucene.Net.Index.CheckIndex.TestDocValues(AtomicReader reader, StreamWriter infoStream)
in z:\Builds\work\bcdbe6b8cc677a49\src\Lucene.Net.Core\Index\CheckIndex.cs:line 1706
FAILED
    WARNING: fixIndex() would remove reference to this segment; full exception:
   at Lucene.Net.Index.CheckIndex.DoCheckIndex(IList`1 onlySegments) in z:\Builds\work\bcdbe6b8cc677a49\src\Lucene.Net.Core\Index\CheckIndex.cs:line
828
  4 of 12: name=_3 docCount=7
    codec=Lucene40
    compound=True
    numFiles=3
    size (MB)=0.00183868408203125
    diagnostics = System.Collections.Generic.Dictionary`2[System.String,System.String]
    no deletions
    test: open reader.........OK
    test: check integrity.....OK
    test: check live docs.....OK
    test: fields..............OK [6 fields]
    test: field norms.........OK [0 fields]
    test: terms, freq, prox...OK [7 terms; 7 terms/docs pairs; 0 tokens]
    test: stored fields.......OK [14 total field count; avg 2 fields per doc]
    test: term vectors........OK [0 total vector count; avg 0 term/freq vector fields per
doc]
    test: docvalues...........ERROR [read past EOF: SlicedIndexInput(SlicedIndexInput(_3_2_dv.dat
in RAMInputStream(name=_3.cfs)) in RAMInputStream(name=_3.cfs) slice=309:366)]
   at Lucene.Net.Store.BufferedIndexInput.ReadBytes(Byte[] b, Int32 offset, Int32 len, Boolean
useBuffer) in z:\Builds\work\bcdbe6b8cc677a49\src\Lucene.Net.Core\Store\BufferedIndexInput.cs:line
192
   at Lucene.Net.Store.MockIndexInputWrapper.ReadBytes(Byte[] b, Int32 offset, Int32 len,
Boolean useBuffer) in z:\Builds\work\bcdbe6b8cc677a49\src\Lucene.Net.TestFramework\Store\MockIndexInputWrapper.cs:line
140
   at Lucene.Net.Util.PagedBytes.Copy(IndexInput in, Int64 byteCount) in z:\Builds\work\bcdbe6b8cc677a49\src\Lucene.Net.Core\Util\PagedBytes.cs:line
202
   at Lucene.Net.Codecs.Lucene40.Lucene40DocValuesReader.LoadBytesFixedDeref(FieldInfo field)
in z:\Builds\work\bcdbe6b8cc677a49\src\Lucene.Net.Core\Codecs\Lucene40\Lucene40DocValuesReader.cs:line
562
   at Lucene.Net.Codecs.Lucene40.Lucene40DocValuesReader.GetBinary(FieldInfo field) in z:\Builds\work\bcdbe6b8cc677a49\src\Lucene.Net.Core\Codecs\Lucene40\Lucene40DocValuesReader.cs:line
426
   at Lucene.Net.Index.SegmentReader.GetBinaryDocValues(String field) in z:\Builds\work\bcdbe6b8cc677a49\src\Lucene.Net.Core\Index\SegmentReader.cs:line
590
   at Lucene.Net.Index.CheckIndex.CheckDocValues(FieldInfo fi, AtomicReader reader, DocValuesStatus
status) in z:\Builds\work\bcdbe6b8cc677a49\src\Lucene.Net.Core\Index\CheckIndex.cs:line 1937
   at Lucene.Net.Index.CheckIndex.TestDocValues(AtomicReader reader, StreamWriter infoStream)
in z:\Builds\work\bcdbe6b8cc677a49\src\Lucene.Net.Core\Index\CheckIndex.cs:line 1706
FAILED
    WARNING: fixIndex() would remove reference to this segment; full exception:
   at Lucene.Net.Index.CheckIndex.DoCheckIndex(IList`1 onlySegments) in z:\Builds\work\bcdbe6b8cc677a49\src\Lucene.Net.Core\Index\CheckIndex.cs:line
828
  5 of 12: name=_4 docCount=9
    codec=Lucene40
    compound=True
    numFiles=3
    size (MB)=0.00194454193115234
    diagnostics = System.Collections.Generic.Dictionary`2[System.String,System.String]
    no deletions
    test: open reader.........OK
    test: check integrity.....OK
    test: check live docs.....OK
    test: fields..............OK [6 fields]
    test: field norms.........OK [0 fields]
    test: terms, freq, prox...OK [9 terms; 9 terms/docs pairs; 0 tokens]
    test: stored fields.......OK [18 total field count; avg 2 fields per doc]
    test: term vectors........OK [0 total vector count; avg 0 term/freq vector fields per
doc]
    test: docvalues...........ERROR [read past EOF: SlicedIndexInput(SlicedIndexInput(_4_2_dv.dat
in RAMInputStream(name=_4.cfs)) in RAMInputStream(name=_4.cfs) slice=368:440)]
   at Lucene.Net.Store.BufferedIndexInput.ReadBytes(Byte[] b, Int32 offset, Int32 len, Boolean
useBuffer) in z:\Builds\work\bcdbe6b8cc677a49\src\Lucene.Net.Core\Store\BufferedIndexInput.cs:line
192
   at Lucene.Net.Store.MockIndexInputWrapper.ReadBytes(Byte[] b, Int32 offset, Int32 len,
Boolean useBuffer) in z:\Builds\work\bcdbe6b8cc677a49\src\Lucene.Net.TestFramework\Store\MockIndexInputWrapper.cs:line
140
   at Lucene.Net.Util.PagedBytes.Copy(IndexInput in, Int64 byteCount) in z:\Builds\work\bcdbe6b8cc677a49\src\Lucene.Net.Core\Util\PagedBytes.cs:line
202
   at Lucene.Net.Codecs.Lucene40.Lucene40DocValuesReader.LoadBytesFixedDeref(FieldInfo field)
in z:\Builds\work\bcdbe6b8cc677a49\src\Lucene.Net.Core\Codecs\Lucene40\Lucene40DocValuesReader.cs:line
562
   at Lucene.Net.Codecs.Lucene40.Lucene40DocValuesReader.GetBinary(FieldInfo field) in z:\Builds\work\bcdbe6b8cc677a49\src\Lucene.Net.Core\Codecs\Lucene40\Lucene40DocValuesReader.cs:line
426
   at Lucene.Net.Index.SegmentReader.GetBinaryDocValues(String field) in z:\Builds\work\bcdbe6b8cc677a49\src\Lucene.Net.Core\Index\SegmentReader.cs:line
590
   at Lucene.Net.Index.CheckIndex.CheckDocValues(FieldInfo fi, AtomicReader reader, DocValuesStatus
status) in z:\Builds\work\bcdbe6b8cc677a49\src\Lucene.Net.Core\Index\CheckIndex.cs:line 1937
   at Lucene.Net.Index.CheckIndex.TestDocValues(AtomicReader reader, StreamWriter infoStream)
in z:\Builds\work\bcdbe6b8cc677a49\src\Lucene.Net.Core\Index\CheckIndex.cs:line 1706
FAILED
    WARNING: fixIndex() would remove reference to this segment; full exception:
   at Lucene.Net.Index.CheckIndex.DoCheckIndex(IList`1 onlySegments) in z:\Builds\work\bcdbe6b8cc677a49\src\Lucene.Net.Core\Index\CheckIndex.cs:line
828
  6 of 12: name=_5 docCount=57
    codec=Lucene40
    compound=True
    numFiles=4
    size (MB)=0.00407791137695313
    diagnostics = System.Collections.Generic.Dictionary`2[System.String,System.String]
    has deletions [delGen=1]
    test: open reader.........OK
    test: check integrity.....OK
    test: check live docs.....OK [3 deleted docs]
    test: fields..............OK [6 fields]
    test: field norms.........OK [0 fields]
    test: terms, freq, prox...OK [54 terms; 54 terms/docs pairs; 0 tokens]
    test (ignoring deletes): terms, freq, prox...OK [57 terms; 57 terms/docs pairs; 0 tokens]
    test: stored fields.......OK [108 total field count; avg 2 fields per doc]
    test: term vectors........OK [0 total vector count; avg 0 term/freq vector fields per
doc]
    test: docvalues...........ERROR [did not read all bytes from file: read 81 vs size 242
(resource: MockIndexInputWrapper(SlicedIndexInput(SlicedIndexInput(_5_2_dv.dat in RAMInputStream(name=_5.cfs))
in RAMInputStream(name=_5.cfs) slice=1594:1836)))]
   at Lucene.Net.Codecs.CodecUtil.CheckEOF(IndexInput in) in z:\Builds\work\bcdbe6b8cc677a49\src\Lucene.Net.Core\Codecs\CodecUtil.cs:line
255
   at Lucene.Net.Codecs.Lucene40.Lucene40DocValuesReader.LoadBytesFixedDeref(FieldInfo field)
in z:\Builds\work\bcdbe6b8cc677a49\src\Lucene.Net.Core\Codecs\Lucene40\Lucene40DocValuesReader.cs:line
565
   at Lucene.Net.Codecs.Lucene40.Lucene40DocValuesReader.GetBinary(FieldInfo field) in z:\Builds\work\bcdbe6b8cc677a49\src\Lucene.Net.Core\Codecs\Lucene40\Lucene40DocValuesReader.cs:line
426
   at Lucene.Net.Index.SegmentReader.GetBinaryDocValues(String field) in z:\Builds\work\bcdbe6b8cc677a49\src\Lucene.Net.Core\Index\SegmentReader.cs:line
590
   at Lucene.Net.Index.CheckIndex.CheckDocValues(FieldInfo fi, AtomicReader reader, DocValuesStatus
status) in z:\Builds\work\bcdbe6b8cc677a49\src\Lucene.Net.Core\Index\CheckIndex.cs:line 1937
   at Lucene.Net.Index.CheckIndex.TestDocValues(AtomicReader reader, StreamWriter infoStream)
in z:\Builds\work\bcdbe6b8cc677a49\src\Lucene.Net.Core\Index\CheckIndex.cs:line 1706
FAILED
    WARNING: fixIndex() would remove reference to this segment; full exception:
   at Lucene.Net.Index.CheckIndex.DoCheckIndex(IList`1 onlySegments) in z:\Builds\work\bcdbe6b8cc677a49\src\Lucene.Net.Core\Index\CheckIndex.cs:line
828
  7 of 12: name=_6 docCount=20
    codec=Lucene40
    compound=True
    numFiles=4
    size (MB)=0.00248813629150391
    diagnostics = System.Collections.Generic.Dictionary`2[System.String,System.String]
    has deletions [delGen=1]
    test: open reader.........OK
    test: check integrity.....OK
    test: check live docs.....OK [3 deleted docs]
    test: fields..............OK [6 fields]
    test: field norms.........OK [0 fields]
    test: terms, freq, prox...OK [17 terms; 17 terms/docs pairs; 0 tokens]
    test (ignoring deletes): terms, freq, prox...OK [20 terms; 20 terms/docs pairs; 0 tokens]
    test: stored fields.......OK [34 total field count; avg 2 fields per doc]
    test: term vectors........OK [0 total vector count; avg 0 term/freq vector fields per
doc]
    test: docvalues...........ERROR [did not read all bytes from file: read 107 vs size 115
(resource: MockIndexInputWrapper(SlicedIndexInput(SlicedIndexInput(_6_2_dv.dat in RAMInputStream(name=_6.cfs))
in RAMInputStream(name=_6.cfs) slice=653:768)))]
   at Lucene.Net.Codecs.CodecUtil.CheckEOF(IndexInput in) in z:\Builds\work\bcdbe6b8cc677a49\src\Lucene.Net.Core\Codecs\CodecUtil.cs:line
255
   at Lucene.Net.Codecs.Lucene40.Lucene40DocValuesReader.LoadBytesFixedDeref(FieldInfo field)
in z:\Builds\work\bcdbe6b8cc677a49\src\Lucene.Net.Core\Codecs\Lucene40\Lucene40DocValuesReader.cs:line
565
   at Lucene.Net.Codecs.Lucene40.Lucene40DocValuesReader.GetBinary(FieldInfo field) in z:\Builds\work\bcdbe6b8cc677a49\src\Lucene.Net.Core\Codecs\Lucene40\Lucene40DocValuesReader.cs:line
426
   at Lucene.Net.Index.SegmentReader.GetBinaryDocValues(String field) in z:\Builds\work\bcdbe6b8cc677a49\src\Lucene.Net.Core\Index\SegmentReader.cs:line
590
   at Lucene.Net.Index.CheckIndex.CheckDocValues(FieldInfo fi, AtomicReader reader, DocValuesStatus
status) in z:\Builds\work\bcdbe6b8cc677a49\src\Lucene.Net.Core\Index\CheckIndex.cs:line 1937
   at Lucene.Net.Index.CheckIndex.TestDocValues(AtomicReader reader, StreamWriter infoStream)
in z:\Builds\work\bcdbe6b8cc677a49\src\Lucene.Net.Core\Index\CheckIndex.cs:line 1706
FAILED
    WARNING: fixIndex() would remove reference to this segment; full exception:
   at Lucene.Net.Index.CheckIndex.DoCheckIndex(IList`1 onlySegments) in z:\Builds\work\bcdbe6b8cc677a49\src\Lucene.Net.Core\Index\CheckIndex.cs:line
828
  8 of 12: name=_7 docCount=18
    codec=Lucene40
    compound=True
    numFiles=4
    size (MB)=0.00235271453857422
    diagnostics = System.Collections.Generic.Dictionary`2[System.String,System.String]
    has deletions [delGen=1]
    test: open reader.........OK
    test: check integrity.....OK
    test: check live docs.....OK [3 deleted docs]
    test: fields..............OK [6 fields]
    test: field norms.........OK [0 fields]
    test: terms, freq, prox...OK [15 terms; 15 terms/docs pairs; 0 tokens]
    test (ignoring deletes): terms, freq, prox...OK [18 terms; 18 terms/docs pairs; 0 tokens]
    test: stored fields.......OK [30 total field count; avg 2 fields per doc]
    test: term vectors........OK [0 total vector count; avg 0 term/freq vector fields per
doc]
    test: docvalues...........ERROR [did not read all bytes from file: read 65 vs size 91
(resource: MockIndexInputWrapper(SlicedIndexInput(SlicedIndexInput(_7_2_dv.dat in RAMInputStream(name=_7.cfs))
in RAMInputStream(name=_7.cfs) slice=585:676)))]
   at Lucene.Net.Codecs.CodecUtil.CheckEOF(IndexInput in) in z:\Builds\work\bcdbe6b8cc677a49\src\Lucene.Net.Core\Codecs\CodecUtil.cs:line
255
   at Lucene.Net.Codecs.Lucene40.Lucene40DocValuesReader.LoadBytesFixedDeref(FieldInfo field)
in z:\Builds\work\bcdbe6b8cc677a49\src\Lucene.Net.Core\Codecs\Lucene40\Lucene40DocValuesReader.cs:line
565
   at Lucene.Net.Codecs.Lucene40.Lucene40DocValuesReader.GetBinary(FieldInfo field) in z:\Builds\work\bcdbe6b8cc677a49\src\Lucene.Net.Core\Codecs\Lucene40\Lucene40DocValuesReader.cs:line
426
   at Lucene.Net.Index.SegmentReader.GetBinaryDocValues(String field) in z:\Builds\work\bcdbe6b8cc677a49\src\Lucene.Net.Core\Index\SegmentReader.cs:line
590
   at Lucene.Net.Index.CheckIndex.CheckDocValues(FieldInfo fi, AtomicReader reader, DocValuesStatus
status) in z:\Builds\work\bcdbe6b8cc677a49\src\Lucene.Net.Core\Index\CheckIndex.cs:line 1937
   at Lucene.Net.Index.CheckIndex.TestDocValues(AtomicReader reader, StreamWriter infoStream)
in z:\Builds\work\bcdbe6b8cc677a49\src\Lucene.Net.Core\Index\CheckIndex.cs:line 1706
FAILED
    WARNING: fixIndex() would remove reference to this segment; full exception:
   at Lucene.Net.Index.CheckIndex.DoCheckIndex(IList`1 onlySegments) in z:\Builds\work\bcdbe6b8cc677a49\src\Lucene.Net.Core\Index\CheckIndex.cs:line
828
  9 of 12: name=_8 docCount=48
    codec=Lucene40
    compound=True
    numFiles=4
    size (MB)=0.00366878509521484
    diagnostics = System.Collections.Generic.Dictionary`2[System.String,System.String]
    has deletions [delGen=1]
    test: open reader.........OK
    test: check integrity.....OK
    test: check live docs.....OK [1 deleted docs]
    test: fields..............OK [6 fields]
    test: field norms.........OK [0 fields]
    test: terms, freq, prox...OK [47 terms; 47 terms/docs pairs; 0 tokens]
    test (ignoring deletes): terms, freq, prox...OK [48 terms; 48 terms/docs pairs; 0 tokens]
    test: stored fields.......OK [94 total field count; avg 2 fields per doc]
    test: term vectors........OK [0 total vector count; avg 0 term/freq vector fields per
doc]
    test: docvalues...........ERROR [read past EOF: SlicedIndexInput(SlicedIndexInput(_8_2_dv.dat
in RAMInputStream(name=_8.cfs)) in RAMInputStream(name=_8.cfs) slice=1359:1564)]
   at Lucene.Net.Store.BufferedIndexInput.ReadBytes(Byte[] b, Int32 offset, Int32 len, Boolean
useBuffer) in z:\Builds\work\bcdbe6b8cc677a49\src\Lucene.Net.Core\Store\BufferedIndexInput.cs:line
192
   at Lucene.Net.Store.MockIndexInputWrapper.ReadBytes(Byte[] b, Int32 offset, Int32 len,
Boolean useBuffer) in z:\Builds\work\bcdbe6b8cc677a49\src\Lucene.Net.TestFramework\Store\MockIndexInputWrapper.cs:line
140
   at Lucene.Net.Util.PagedBytes.Copy(IndexInput in, Int64 byteCount) in z:\Builds\work\bcdbe6b8cc677a49\src\Lucene.Net.Core\Util\PagedBytes.cs:line
202
   at Lucene.Net.Codecs.Lucene40.Lucene40DocValuesReader.LoadBytesFixedDeref(FieldInfo field)
in z:\Builds\work\bcdbe6b8cc677a49\src\Lucene.Net.Core\Codecs\Lucene40\Lucene40DocValuesReader.cs:line
562
   at Lucene.Net.Codecs.Lucene40.Lucene40DocValuesReader.GetBinary(FieldInfo field) in z:\Builds\work\bcdbe6b8cc677a49\src\Lucene.Net.Core\Codecs\Lucene40\Lucene40DocValuesReader.cs:line
426
   at Lucene.Net.Index.SegmentReader.GetBinaryDocValues(String field) in z:\Builds\work\bcdbe6b8cc677a49\src\Lucene.Net.Core\Index\SegmentReader.cs:line
590
   at Lucene.Net.Index.CheckIndex.CheckDocValues(FieldInfo fi, AtomicReader reader, DocValuesStatus
status) in z:\Builds\work\bcdbe6b8cc677a49\src\Lucene.Net.Core\Index\CheckIndex.cs:line 1937
   at Lucene.Net.Index.CheckIndex.TestDocValues(AtomicReader reader, StreamWriter infoStream)
in z:\Builds\work\bcdbe6b8cc677a49\src\Lucene.Net.Core\Index\CheckIndex.cs:line 1706
FAILED
    WARNING: fixIndex() would remove reference to this segment; full exception:
   at Lucene.Net.Index.CheckIndex.DoCheckIndex(IList`1 onlySegments) in z:\Builds\work\bcdbe6b8cc677a49\src\Lucene.Net.Core\Index\CheckIndex.cs:line
828
  10 of 12: name=_9 docCount=37
    codec=Lucene40
    compound=True
    numFiles=4
    size (MB)=0.00325679779052734
    diagnostics = System.Collections.Generic.Dictionary`2[System.String,System.String]
    has deletions [delGen=1]
    test: open reader.........OK
    test: check integrity.....OK
    test: check live docs.....OK [2 deleted docs]
    test: fields..............OK [6 fields]
    test: field norms.........OK [0 fields]
    test: terms, freq, prox...OK [35 terms; 35 terms/docs pairs; 0 tokens]
    test (ignoring deletes): terms, freq, prox...OK [37 terms; 37 terms/docs pairs; 0 tokens]
    test: stored fields.......OK [70 total field count; avg 2 fields per doc]
    test: term vectors........OK [0 total vector count; avg 0 term/freq vector fields per
doc]
    test: docvalues...........ERROR [read past EOF: SlicedIndexInput(SlicedIndexInput(_9_2_dv.dat
in RAMInputStream(name=_9.cfs)) in RAMInputStream(name=_9.cfs) slice=1101:1290)]
   at Lucene.Net.Store.BufferedIndexInput.ReadBytes(Byte[] b, Int32 offset, Int32 len, Boolean
useBuffer) in z:\Builds\work\bcdbe6b8cc677a49\src\Lucene.Net.Core\Store\BufferedIndexInput.cs:line
192
   at Lucene.Net.Store.MockIndexInputWrapper.ReadBytes(Byte[] b, Int32 offset, Int32 len,
Boolean useBuffer) in z:\Builds\work\bcdbe6b8cc677a49\src\Lucene.Net.TestFramework\Store\MockIndexInputWrapper.cs:line
140
   at Lucene.Net.Util.PagedBytes.Copy(IndexInput in, Int64 byteCount) in z:\Builds\work\bcdbe6b8cc677a49\src\Lucene.Net.Core\Util\PagedBytes.cs:line
202
   at Lucene.Net.Codecs.Lucene40.Lucene40DocValuesReader.LoadBytesFixedDeref(FieldInfo field)
in z:\Builds\work\bcdbe6b8cc677a49\src\Lucene.Net.Core\Codecs\Lucene40\Lucene40DocValuesReader.cs:line
562
   at Lucene.Net.Codecs.Lucene40.Lucene40DocValuesReader.GetBinary(FieldInfo field) in z:\Builds\work\bcdbe6b8cc677a49\src\Lucene.Net.Core\Codecs\Lucene40\Lucene40DocValuesReader.cs:line
426
   at Lucene.Net.Index.SegmentReader.GetBinaryDocValues(String field) in z:\Builds\work\bcdbe6b8cc677a49\src\Lucene.Net.Core\Index\SegmentReader.cs:line
590
   at Lucene.Net.Index.CheckIndex.CheckDocValues(FieldInfo fi, AtomicReader reader, DocValuesStatus
status) in z:\Builds\work\bcdbe6b8cc677a49\src\Lucene.Net.Core\Index\CheckIndex.cs:line 1937
   at Lucene.Net.Index.CheckIndex.TestDocValues(AtomicReader reader, StreamWriter infoStream)
in z:\Builds\work\bcdbe6b8cc677a49\src\Lucene.Net.Core\Index\CheckIndex.cs:line 1706
FAILED
    WARNING: fixIndex() would remove reference to this segment; full exception:
   at Lucene.Net.Index.CheckIndex.DoCheckIndex(IList`1 onlySegments) in z:\Builds\work\bcdbe6b8cc677a49\src\Lucene.Net.Core\Index\CheckIndex.cs:line
828
  11 of 12: name=_a docCount=49
    codec=Lucene40
    compound=True
    numFiles=4
    size (MB)=0.00374603271484375
    diagnostics = System.Collections.Generic.Dictionary`2[System.String,System.String]
    has deletions [delGen=1]
    test: open reader.........OK
    test: check integrity.....OK
    test: check live docs.....OK [3 deleted docs]
    test: fields..............OK [6 fields]
    test: field norms.........OK [0 fields]
    test: terms, freq, prox...OK [46 terms; 46 terms/docs pairs; 0 tokens]
    test (ignoring deletes): terms, freq, prox...OK [49 terms; 49 terms/docs pairs; 0 tokens]
    test: stored fields.......OK [92 total field count; avg 2 fields per doc]
    test: term vectors........OK [0 total vector count; avg 0 term/freq vector fields per
doc]
    test: docvalues...........ERROR [did not read all bytes from file: read 215 vs size 221
(resource: MockIndexInputWrapper(SlicedIndexInput(SlicedIndexInput(_a_2_dv.dat in RAMInputStream(name=_a.cfs))
in RAMInputStream(name=_a.cfs) slice=1397:1618)))]
   at Lucene.Net.Codecs.CodecUtil.CheckEOF(IndexInput in) in z:\Builds\work\bcdbe6b8cc677a49\src\Lucene.Net.Core\Codecs\CodecUtil.cs:line
255
   at Lucene.Net.Codecs.Lucene40.Lucene40DocValuesReader.LoadBytesFixedDeref(FieldInfo field)
in z:\Builds\work\bcdbe6b8cc677a49\src\Lucene.Net.Core\Codecs\Lucene40\Lucene40DocValuesReader.cs:line
565
   at Lucene.Net.Codecs.Lucene40.Lucene40DocValuesReader.GetBinary(FieldInfo field) in z:\Builds\work\bcdbe6b8cc677a49\src\Lucene.Net.Core\Codecs\Lucene40\Lucene40DocValuesReader.cs:line
426
   at Lucene.Net.Index.SegmentReader.GetBinaryDocValues(String field) in z:\Builds\work\bcdbe6b8cc677a49\src\Lucene.Net.Core\Index\SegmentReader.cs:line
590
   at Lucene.Net.Index.CheckIndex.CheckDocValues(FieldInfo fi, AtomicReader reader, DocValuesStatus
status) in z:\Builds\work\bcdbe6b8cc677a49\src\Lucene.Net.Core\Index\CheckIndex.cs:line 1937
   at Lucene.Net.Index.CheckIndex.TestDocValues(AtomicReader reader, StreamWriter infoStream)
in z:\Builds\work\bcdbe6b8cc677a49\src\Lucene.Net.Core\Index\CheckIndex.cs:line 1706
FAILED
    WARNING: fixIndex() would remove reference to this segment; full exception:
   at Lucene.Net.Index.CheckIndex.DoCheckIndex(IList`1 onlySegments) in z:\Builds\work\bcdbe6b8cc677a49\src\Lucene.Net.Core\Index\CheckIndex.cs:line
828
  12 of 12: name=_b docCount=53
    codec=Lucene40
    compound=True
    numFiles=4
    size (MB)=0.00394916534423828
    diagnostics = System.Collections.Generic.Dictionary`2[System.String,System.String]
    has deletions [delGen=1]
    test: open reader.........OK
    test: check integrity.....OK
    test: check live docs.....OK [7 deleted docs]
    test: fields..............OK [6 fields]
    test: field norms.........OK [0 fields]
    test: terms, freq, prox...OK [46 terms; 46 terms/docs pairs; 0 tokens]
    test (ignoring deletes): terms, freq, prox...OK [53 terms; 53 terms/docs pairs; 0 tokens]
    test: stored fields.......OK [92 total field count; avg 2 fields per doc]
    test: term vectors........OK [0 total vector count; avg 0 term/freq vector fields per
doc]
    test: docvalues...........ERROR [read past EOF: SlicedIndexInput(SlicedIndexInput(_b_2_dv.dat
in RAMInputStream(name=_b.cfs)) in RAMInputStream(name=_b.cfs) slice=1505:1746)]
   at Lucene.Net.Store.BufferedIndexInput.ReadBytes(Byte[] b, Int32 offset, Int32 len, Boolean
useBuffer) in z:\Builds\work\bcdbe6b8cc677a49\src\Lucene.Net.Core\Store\BufferedIndexInput.cs:line
192
   at Lucene.Net.Store.MockIndexInputWrapper.ReadBytes(Byte[] b, Int32 offset, Int32 len,
Boolean useBuffer) in z:\Builds\work\bcdbe6b8cc677a49\src\Lucene.Net.TestFramework\Store\MockIndexInputWrapper.cs:line
140
   at Lucene.Net.Util.PagedBytes.Copy(IndexInput in, Int64 byteCount) in z:\Builds\work\bcdbe6b8cc677a49\src\Lucene.Net.Core\Util\PagedBytes.cs:line
202
   at Lucene.Net.Codecs.Lucene40.Lucene40DocValuesReader.LoadBytesFixedDeref(FieldInfo field)
in z:\Builds\work\bcdbe6b8cc677a49\src\Lucene.Net.Core\Codecs\Lucene40\Lucene40DocValuesReader.cs:line
562
   at Lucene.Net.Codecs.Lucene40.Lucene40DocValuesReader.GetBinary(FieldInfo field) in z:\Builds\work\bcdbe6b8cc677a49\src\Lucene.Net.Core\Codecs\Lucene40\Lucene40DocValuesReader.cs:line
426
   at Lucene.Net.Index.SegmentReader.GetBinaryDocValues(String field) in z:\Builds\work\bcdbe6b8cc677a49\src\Lucene.Net.Core\Index\SegmentReader.cs:line
590
   at Lucene.Net.Index.CheckIndex.CheckDocValues(FieldInfo fi, AtomicReader reader, DocValuesStatus
status) in z:\Builds\work\bcdbe6b8cc677a49\src\Lucene.Net.Core\Index\CheckIndex.cs:line 1937
   at Lucene.Net.Index.CheckIndex.TestDocValues(AtomicReader reader, StreamWriter infoStream)
in z:\Builds\work\bcdbe6b8cc677a49\src\Lucene.Net.Core\Index\CheckIndex.cs:line 1706
FAILED
    WARNING: fixIndex() would remove reference to this segment; full exception:
   at Lucene.Net.Index.CheckIndex.DoCheckIndex(IList`1 onlySegments) in z:\Builds\work\bcdbe6b8cc677a49\src\Lucene.Net.Core\Index\CheckIndex.cs:line
828
WARNING: 12 broken segments (containing 367 documents) detected
Changes included (1 change)
====================================================
Change 141f838f7a780193fee61a7b708b4d9cfb3a3b60 by itamar (2 files):
Temporart cleanup failure should not fail the test

Though we should definitely see why that happened


see more information about changed files: http://teamcity.codebetter.com/viewLog.html?tab=buildChangesDiv&buildId=184934&buildTypeId=LuceneNet_Core

============================================================================
Configure email notifications: http://teamcity.codebetter.com/profile.html?init=1&tab=userNotifications

Mime
  • Unnamed multipart/alternative (inline, None, 0 bytes)
View raw message