lucenenet-dev mailing list archives

Site index · List index
Message view « Date » · « Thread »
Top « Date » · « Thread »
From t.@codebetter.com
Subject [TeamCity, FAILED] Build Lucene.NET :: Lucene.NET Core [master] #363
Date Sun, 08 Mar 2015 00:27:30 GMT
Build Lucene.NET :: Lucene.NET Core [master] #363 failed (Tests failed: 32 (6 new), passed: 2425, ignored: 112).
Agent: JetBrains-dotnet-agent01
Build results: http://teamcity.codebetter.com/viewLog.html?buildId=185377&buildTypeId=LuceneNet_Core

Failed Tests Summary:
Newly failed tests (6 tests, alphabetically ordered)
==================================================================
Lucene.Net.Tests.dll: Lucene.Net.Codecs.Lucene3x.TestLucene3xStoredFieldsFormat.BaseStoredFieldsFormatTestCase.TestConcurrentReads
Lucene.Net.Tests.dll: Lucene.Net.Codecs.Lucene40.TestLucene40DocValuesFormat.BaseIndexFileFormatTestCase.TestMergeStability
Lucene.Net.Tests.dll: Lucene.Net.Index.TestIndexWriterReader.TestMergeWarmer
Lucene.Net.Tests.dll: Lucene.Net.Index.TestTransactions.TestTransactions_Mem
Lucene.Net.Tests.dll: Lucene.Net.Search.TestFilteredQuery.TestFilteredQuery_Mem
Lucene.Net.Tests.dll: Lucene.Net.Search.TestSearchAfter.TestQueries

Other failed tests (26 tests, alphabetically ordered)
==================================================================
Lucene.Net.Tests.dll: Lucene.Net.Codecs.Lucene40.TestLucene40DocValuesFormat.BaseDocValuesFormatTestCase.TestBinaryVariableLengthVsStoredFields
Lucene.Net.Tests.dll: Lucene.Net.Codecs.Lucene40.TestLucene40DocValuesFormat.BaseDocValuesFormatTestCase.TestEmptyBinaryValueOnPageSizes
Lucene.Net.Tests.dll: Lucene.Net.Codecs.Lucene40.TestLucene40DocValuesFormat.BaseDocValuesFormatTestCase.TestThreads
Lucene.Net.Tests.dll: Lucene.Net.Codecs.Lucene41.TestBlockPostingsFormat2
Lucene.Net.Tests.dll: Lucene.Net.Codecs.Lucene42.TestLucene42DocValuesFormat.BaseDocValuesFormatTestCase.TestVeryLargeButLegalSortedBytes
Lucene.Net.Tests.dll: Lucene.Net.Index.TestDirectoryReader.TestNoDir
Lucene.Net.Tests.dll: Lucene.Net.Index.TestDocumentsWriterStallControl.TestSimpleStall
Lucene.Net.Tests.dll: Lucene.Net.Index.TestDuelingCodecs.TestEquals
Lucene.Net.Tests.dll: Lucene.Net.Index.TestIndexWriter.TestTwoThreadsInterruptDeadlock
Lucene.Net.Tests.dll: Lucene.Net.Index.TestIndexWriterExceptions.TestExceptionOnMergeInit
Lucene.Net.Tests.dll: Lucene.Net.Search.Spans.TestSpanMultiTermQueryWrapper.TestFuzzy2
Lucene.Net.Tests.dll: Lucene.Net.Search.TestFuzzyQuery.TestTieBreaker
Lucene.Net.Tests.dll: Lucene.Net.Search.TestNumericRangeQuery32.TestInfiniteValues
Lucene.Net.Tests.dll: Lucene.Net.Search.TestNumericRangeQuery64.TestInfiniteValues
Lucene.Net.Tests.dll: Lucene.Net.Search.TestShardSearching.TestSimple
Lucene.Net.Tests.dll: Lucene.Net.Search.TestSimpleExplanations.TestDMQ8
Lucene.Net.Tests.dll: Lucene.Net.Search.TestTermVectors
Lucene.Net.Tests.dll: Lucene.Net.Search.TestTermVectors.TestMixedVectrosVectors
Lucene.Net.Tests.dll: Lucene.Net.Search.TestTopDocsMerge.TestSort_1
Lucene.Net.Tests.dll: Lucene.Net.Search.TestTopDocsMerge.TestSort_2
Lucene.Net.Tests.dll: Lucene.Net.Store.TestBufferedIndexInput.TestSetBufferSize
Lucene.Net.Tests.dll: Lucene.Net.Store.TestFileSwitchDirectory.TestNoDir
Lucene.Net.Tests.dll: Lucene.Net.Store.TestNRTCachingDirectory.TestNoDir
Lucene.Net.Tests.dll: Lucene.Net.Tests.TestAssertions.TestTokenStreams
Lucene.Net.Tests.dll: Lucene.Net.Util.TestIndexableBinaryStringTools.TestEncodedSortability
Lucene.Net.Tests.dll: Lucene.Net.Util.TestOpenBitSet.TestSmall



Newly failed tests details (only first 3 failures shown here)
==================================================================
Lucene.Net.Tests.dll: Lucene.Net.Codecs.Lucene3x.TestLucene3xStoredFieldsFormat.BaseStoredFieldsFormatTestCase.TestConcurrentReads (new) =================
Test(s) failed. System.InvalidOperationException : Expected 1 hit, got 0
   at Lucene.Net.Index.BaseStoredFieldsFormatTestCase.TestConcurrentReads() in z:\Builds\work\bcdbe6b8cc677a49\src\Lucene.Net.TestFramework\Index\BaseStoredFieldsFormatTestCase.cs:line 453
Lucene.Net.Tests.dll: Lucene.Net.Codecs.Lucene40.TestLucene40DocValuesFormat.BaseIndexFileFormatTestCase.TestMergeStability (new) =================
Test(s) failed. System.IO.IOException : background merge hit exception: _1(4.8):C497 _0(4.8):C201 _2(4.8):C13 into _3 [maxNumSegments=1]
  ----> System.IO.IOException : did not read all bytes from file: read 1551 vs size 2083 (resource: MockIndexInputWrapper(SlicedIndexInput(SlicedIndexInput(_0_1_dv.dat in RAMInputStream(name=_0_dv.cfs)) in RAMInputStream(name=_0_dv.cfs) slice=450:2533)))
   at Lucene.Net.Index.IndexWriter.ForceMerge(Int32 maxNumSegments, Boolean doWait) in z:\Builds\work\bcdbe6b8cc677a49\src\Lucene.Net.Core\Index\IndexWriter.cs:line 2179
   at Lucene.Net.Index.IndexWriter.ForceMerge(Int32 maxNumSegments) in z:\Builds\work\bcdbe6b8cc677a49\src\Lucene.Net.Core\Index\IndexWriter.cs:line 2100
   at Lucene.Net.Index.RandomIndexWriter.ForceMerge(Int32 maxSegmentCount) in z:\Builds\work\bcdbe6b8cc677a49\src\Lucene.Net.TestFramework\Index\RandomIndexWriter.cs:line 510
   at Lucene.Net.Index.BaseIndexFileFormatTestCase.TestMergeStability() in z:\Builds\work\bcdbe6b8cc677a49\src\Lucene.Net.TestFramework\Index\BaseIndexFileFormatTestCase.cs:line 110
--IOException
   at Lucene.Net.Util.IOUtils.ReThrow(Exception th) in z:\Builds\work\bcdbe6b8cc677a49\src\Lucene.Net.Core\Util\IOUtils.cs:line 416
   at Lucene.Net.Index.IndexWriter.HandleMergeException(Exception t, OneMerge merge) in z:\Builds\work\bcdbe6b8cc677a49\src\Lucene.Net.Core\Index\IndexWriter.cs:line 4527
   at Lucene.Net.Index.IndexWriter.Merge(OneMerge merge) in z:\Builds\work\bcdbe6b8cc677a49\src\Lucene.Net.Core\Index\IndexWriter.cs:line 4565
   at Lucene.Net.Index.ConcurrentMergeScheduler.DoMerge(OneMerge merge) in z:\Builds\work\bcdbe6b8cc677a49\src\Lucene.Net.Core\Index\ConcurrentMergeScheduler.cs:line 514
   at Lucene.Net.Index.ConcurrentMergeScheduler.MergeThread.Run() in z:\Builds\work\bcdbe6b8cc677a49\src\Lucene.Net.Core\Index\ConcurrentMergeScheduler.cs:line 638
------- Stderr: -------
Unhandled exception in remote appdomain: Lucene.Net.Index.MergePolicy+MergeException: did not read all bytes from file: read 1551 vs size 2083 (resource: MockIndexInputWrapper(SlicedIndexInput(SlicedIndexInput(_0_1_dv.dat in RAMInputStream(name=_0_dv.cfs)) in RAMInputStream(name=_0_dv.cfs) slice=450:2533)))
   at Lucene.Net.Index.ConcurrentMergeScheduler.HandleMergeException(Exception exc) in z:\Builds\work\bcdbe6b8cc677a49\src\Lucene.Net.Core\Index\ConcurrentMergeScheduler.cs:line 718
   at Lucene.Net.Index.ConcurrentMergeScheduler.MergeThread.Run() in z:\Builds\work\bcdbe6b8cc677a49\src\Lucene.Net.Core\Index\ConcurrentMergeScheduler.cs:line 682
   at System.Threading.ThreadHelper.ThreadStart_Context(Object state)
   at System.Threading.ExecutionContext.RunInternal(ExecutionContext executionContext, ContextCallback callback, Object state, Boolean preserveSyncCtx)
   at System.Threading.ExecutionContext.Run(ExecutionContext executionContext, ContextCallback callback, Object state, Boolean preserveSyncCtx)
   at System.Threading.ExecutionContext.Run(ExecutionContext executionContext, ContextCallback callback, Object state)
   at System.Threading.ThreadHelper.ThreadStart()
Lucene.Net.Tests.dll: Lucene.Net.Index.TestIndexWriterReader.TestMergeWarmer (new) =================
Test(s) failed. Test exceeded Timeout value of 20000ms

see all newly failed tests: http://teamcity.codebetter.com/viewLog.html?buildId=185377&buildTypeId=LuceneNet_Core



Other failed tests details (only first 3 failures shown here)
==================================================================
Lucene.Net.Tests.dll: Lucene.Net.Codecs.Lucene40.TestLucene40DocValuesFormat.BaseDocValuesFormatTestCase.TestBinaryVariableLengthVsStoredFields =================
Test(s) failed. System.IO.IOException : did not read all bytes from file: read 31 vs size 59 (resource: MockIndexInputWrapper(SlicedIndexInput(SlicedIndexInput(_0_2_dv.dat in RAMInputStream(name=_0_dv.cfs)) in RAMInputStream(name=_0_dv.cfs) slice=31:90)))
   at Lucene.Net.Codecs.CodecUtil.CheckEOF(IndexInput in) in z:\Builds\work\bcdbe6b8cc677a49\src\Lucene.Net.Core\Codecs\CodecUtil.cs:line 255
   at Lucene.Net.Codecs.Lucene40.Lucene40DocValuesReader.LoadBytesFixedDeref(FieldInfo field) in z:\Builds\work\bcdbe6b8cc677a49\src\Lucene.Net.Core\Codecs\Lucene40\Lucene40DocValuesReader.cs:line 565
   at Lucene.Net.Codecs.Lucene40.Lucene40DocValuesReader.GetBinary(FieldInfo field) in z:\Builds\work\bcdbe6b8cc677a49\src\Lucene.Net.Core\Codecs\Lucene40\Lucene40DocValuesReader.cs:line 426
   at Lucene.Net.Index.SegmentReader.GetBinaryDocValues(String field) in z:\Builds\work\bcdbe6b8cc677a49\src\Lucene.Net.Core\Index\SegmentReader.cs:line 590
   at Lucene.Net.Index.BaseDocValuesFormatTestCase.DoTestBinaryVsStoredFields(Int32 minLength, Int32 maxLength) in z:\Builds\work\bcdbe6b8cc677a49\src\Lucene.Net.TestFramework\Index\BaseDocValuesFormatTestCase.cs:line 1633
   at Lucene.Net.Index.BaseDocValuesFormatTestCase.TestBinaryVariableLengthVsStoredFields() in z:\Builds\work\bcdbe6b8cc677a49\src\Lucene.Net.TestFramework\Index\BaseDocValuesFormatTestCase.cs:line 1663
Lucene.Net.Tests.dll: Lucene.Net.Codecs.Lucene40.TestLucene40DocValuesFormat.BaseDocValuesFormatTestCase.TestEmptyBinaryValueOnPageSizes =================
Test(s) failed. System.IO.IOException : did not read all bytes from file: read 31 vs size 32 (resource: MockIndexInputWrapper(SlicedIndexInput(SlicedIndexInput(_0_0_dv.dat in RAMInputStream(name=_0.cfs)) in RAMInputStream(name=_0.cfs) slice=184:216)))
   at Lucene.Net.Codecs.CodecUtil.CheckEOF(IndexInput in) in z:\Builds\work\bcdbe6b8cc677a49\src\Lucene.Net.Core\Codecs\CodecUtil.cs:line 255
   at Lucene.Net.Codecs.Lucene40.Lucene40DocValuesReader.LoadBytesFixedDeref(FieldInfo field) in z:\Builds\work\bcdbe6b8cc677a49\src\Lucene.Net.Core\Codecs\Lucene40\Lucene40DocValuesReader.cs:line 565
   at Lucene.Net.Codecs.Lucene40.Lucene40DocValuesReader.GetBinary(FieldInfo field) in z:\Builds\work\bcdbe6b8cc677a49\src\Lucene.Net.Core\Codecs\Lucene40\Lucene40DocValuesReader.cs:line 426
   at Lucene.Net.Index.SegmentReader.GetBinaryDocValues(String field) in z:\Builds\work\bcdbe6b8cc677a49\src\Lucene.Net.Core\Index\SegmentReader.cs:line 590
   at Lucene.Net.Index.MultiDocValues.GetBinaryValues(IndexReader r, String field) in z:\Builds\work\bcdbe6b8cc677a49\src\Lucene.Net.Core\Index\MultiDocValues.cs:line 270
   at Lucene.Net.Index.SlowCompositeReaderWrapper.GetBinaryDocValues(String field) in z:\Builds\work\bcdbe6b8cc677a49\src\Lucene.Net.Core\Index\SlowCompositeReaderWrapper.cs:line 108
   at Lucene.Net.Index.BaseDocValuesFormatTestCase.TestEmptyBinaryValueOnPageSizes() in z:\Builds\work\bcdbe6b8cc677a49\src\Lucene.Net.TestFramework\Index\BaseDocValuesFormatTestCase.cs:line 3497
Lucene.Net.Tests.dll: Lucene.Net.Codecs.Lucene40.TestLucene40DocValuesFormat.BaseDocValuesFormatTestCase.TestThreads =================
Test(s) failed. System.Exception : CheckIndex failed
   at Lucene.Net.Util.TestUtil.CheckIndex(Directory dir, Boolean crossCheckTermVectors) in z:\Builds\work\bcdbe6b8cc677a49\src\Lucene.Net.TestFramework\Util\TestUtil.cs:line 257
   at Lucene.Net.Store.MockDirectoryWrapper.Dispose() in z:\Builds\work\bcdbe6b8cc677a49\src\Lucene.Net.TestFramework\Store\MockDirectoryWrapper.cs:line 943
   at Lucene.Net.Index.BaseDocValuesFormatTestCase.TestThreads() in z:\Builds\work\bcdbe6b8cc677a49\src\Lucene.Net.TestFramework\Index\BaseDocValuesFormatTestCase.cs:line 3225
------- Stderr: -------
Unhandled exception in remote appdomain: System.Exception: read past EOF: SlicedIndexInput(SlicedIndexInput(_0_2_dv.dat in RAMInputStream(name=_0.cfs)) in RAMInputStream(name=_0.cfs) slice=3927:4521) ---> System.IO.EndOfStreamException: read past EOF: SlicedIndexInput(SlicedIndexInput(_0_2_dv.dat in RAMInputStream(name=_0.cfs)) in RAMInputStream(name=_0.cfs) slice=3927:4521)
   at Lucene.Net.Store.BufferedIndexInput.ReadBytes(Byte[] b, Int32 offset, Int32 len, Boolean useBuffer) in z:\Builds\work\bcdbe6b8cc677a49\src\Lucene.Net.Core\Store\BufferedIndexInput.cs:line 192
   at Lucene.Net.Store.MockIndexInputWrapper.ReadBytes(Byte[] b, Int32 offset, Int32 len, Boolean useBuffer) in z:\Builds\work\bcdbe6b8cc677a49\src\Lucene.Net.TestFramework\Store\MockIndexInputWrapper.cs:line 140
   at Lucene.Net.Util.PagedBytes.Copy(IndexInput in, Int64 byteCount) in z:\Builds\work\bcdbe6b8cc677a49\src\Lucene.Net.Core\Util\PagedBytes.cs:line 202
   at Lucene.Net.Codecs.Lucene40.Lucene40DocValuesReader.LoadBytesFixedDeref(FieldInfo field) in z:\Builds\work\bcdbe6b8cc677a49\src\Lucene.Net.Core\Codecs\Lucene40\Lucene40DocValuesReader.cs:line 562
   at Lucene.Net.Codecs.Lucene40.Lucene40DocValuesReader.GetBinary(FieldInfo field) in z:\Builds\work\bcdbe6b8cc677a49\src\Lucene.Net.Core\Codecs\Lucene40\Lucene40DocValuesReader.cs:line 426
   at Lucene.Net.Index.SegmentReader.GetBinaryDocValues(String field) in z:\Builds\work\bcdbe6b8cc677a49\src\Lucene.Net.Core\Index\SegmentReader.cs:line 590
   at Lucene.Net.Index.BaseDocValuesFormatTestCase.ThreadAnonymousInnerClassHelper.Run() in z:\Builds\work\bcdbe6b8cc677a49\src\Lucene.Net.TestFramework\Index\BaseDocValuesFormatTestCase.cs:line 3250
   --- End of inner exception stack trace ---
   at Lucene.Net.Index.BaseDocValuesFormatTestCase.ThreadAnonymousInnerClassHelper.Run() in z:\Builds\work\bcdbe6b8cc677a49\src\Lucene.Net.TestFramework\Index\BaseDocValuesFormatTestCase.cs:line 3269
   at System.Threading.ThreadHelper.ThreadStart_Context(Object state)
   at System.Threading.ExecutionContext.RunInternal(ExecutionContext executionContext, ContextCallback callback, Object state, Boolean preserveSyncCtx)
   at System.Threading.ExecutionContext.Run(ExecutionContext executionContext, ContextCallback callback, Object state, Boolean preserveSyncCtx)
   at System.Threading.ExecutionContext.Run(ExecutionContext executionContext, ContextCallback callback, Object state)
   at System.Threading.ThreadHelper.ThreadStart()
Unhandled exception in remote appdomain: System.Exception: read past EOF: SlicedIndexInput(SlicedIndexInput(_0_2_dv.dat in RAMInputStream(name=_0.cfs)) in RAMInputStream(name=_0.cfs) slice=3927:4521) ---> System.IO.EndOfStreamException: read past EOF: SlicedIndexInput(SlicedIndexInput(_0_2_dv.dat in RAMInputStream(name=_0.cfs)) in RAMInputStream(name=_0.cfs) slice=3927:4521)
   at Lucene.Net.Store.BufferedIndexInput.ReadBytes(Byte[] b, Int32 offset, Int32 len, Boolean useBuffer) in z:\Builds\work\bcdbe6b8cc677a49\src\Lucene.Net.Core\Store\BufferedIndexInput.cs:line 192
   at Lucene.Net.Store.MockIndexInputWrapper.ReadBytes(Byte[] b, Int32 offset, Int32 len, Boolean useBuffer) in z:\Builds\work\bcdbe6b8cc677a49\src\Lucene.Net.TestFramework\Store\MockIndexInputWrapper.cs:line 140
   at Lucene.Net.Util.PagedBytes.Copy(IndexInput in, Int64 byteCount) in z:\Builds\work\bcdbe6b8cc677a49\src\Lucene.Net.Core\Util\PagedBytes.cs:line 202
   at Lucene.Net.Codecs.Lucene40.Lucene40DocValuesReader.LoadBytesFixedDeref(FieldInfo field) in z:\Builds\work\bcdbe6b8cc677a49\src\Lucene.Net.Core\Codecs\Lucene40\Lucene40DocValuesReader.cs:line 562
   at Lucene.Net.Codecs.Lucene40.Lucene40DocValuesReader.GetBinary(FieldInfo field) in z:\Builds\work\bcdbe6b8cc677a49\src\Lucene.Net.Core\Codecs\Lucene40\Lucene40DocValuesReader.cs:line 426
   at Lucene.Net.Index.SegmentReader.GetBinaryDocValues(String field) in z:\Builds\work\bcdbe6b8cc677a49\src\Lucene.Net.Core\Index\SegmentReader.cs:line 590
   at Lucene.Net.Index.BaseDocValuesFormatTestCase.ThreadAnonymousInnerClassHelper.Run() in z:\Builds\work\bcdbe6b8cc677a49\src\Lucene.Net.TestFramework\Index\BaseDocValuesFormatTestCase.cs:line 3250
   --- End of inner exception stack trace ---
   at Lucene.Net.Index.BaseDocValuesFormatTestCase.ThreadAnonymousInnerClassHelper.Run() in z:\Builds\work\bcdbe6b8cc677a49\src\Lucene.Net.TestFramework\Index\BaseDocValuesFormatTestCase.cs:line 3269
   at System.Threading.ThreadHelper.ThreadStart_Context(Object state)
   at System.Threading.ExecutionContext.RunInternal(ExecutionContext executionContext, ContextCallback callback, Object state, Boolean preserveSyncCtx)
   at System.Threading.ExecutionContext.Run(ExecutionContext executionContext, ContextCallback callback, Object state, Boolean preserveSyncCtx)
   at System.Threading.ExecutionContext.Run(ExecutionContext executionContext, ContextCallback callback, Object state)
   at System.Threading.ThreadHelper.ThreadStart()
Unhandled exception in remote appdomain: System.Exception: read past EOF: SlicedIndexInput(SlicedIndexInput(_0_2_dv.dat in RAMInputStream(name=_0.cfs)) in RAMInputStream(name=_0.cfs) slice=3927:4521) ---> System.IO.EndOfStreamException: read past EOF: SlicedIndexInput(SlicedIndexInput(_0_2_dv.dat in RAMInputStream(name=_0.cfs)) in RAMInputStream(name=_0.cfs) slice=3927:4521)
   at Lucene.Net.Store.BufferedIndexInput.ReadBytes(Byte[] b, Int32 offset, Int32 len, Boolean useBuffer) in z:\Builds\work\bcdbe6b8cc677a49\src\Lucene.Net.Core\Store\BufferedIndexInput.cs:line 192
   at Lucene.Net.Store.MockIndexInputWrapper.ReadBytes(Byte[] b, Int32 offset, Int32 len, Boolean useBuffer) in z:\Builds\work\bcdbe6b8cc677a49\src\Lucene.Net.TestFramework\Store\MockIndexInputWrapper.cs:line 140
   at Lucene.Net.Util.PagedBytes.Copy(IndexInput in, Int64 byteCount) in z:\Builds\work\bcdbe6b8cc677a49\src\Lucene.Net.Core\Util\PagedBytes.cs:line 202
   at Lucene.Net.Codecs.Lucene40.Lucene40DocValuesReader.LoadBytesFixedDeref(FieldInfo field) in z:\Builds\work\bcdbe6b8cc677a49\src\Lucene.Net.Core\Codecs\Lucene40\Lucene40DocValuesReader.cs:line 562
   at Lucene.Net.Codecs.Lucene40.Lucene40DocValuesReader.GetBinary(FieldInfo field) in z:\Builds\work\bcdbe6b8cc677a49\src\Lucene.Net.Core\Codecs\Lucene40\Lucene40DocValuesReader.cs:line 426
   at Lucene.Net.Index.SegmentReader.GetBinaryDocValues(String field) in z:\Builds\work\bcdbe6b8cc677a49\src\Lucene.Net.Core\Index\SegmentReader.cs:line 590
   at Lucene.Net.Index.BaseDocValuesFormatTestCase.ThreadAnonymousInnerClassHelper.Run() in z:\Builds\work\bcdbe6b8cc677a49\src\Lucene.Net.TestFramework\Index\BaseDocValuesFormatTestCase.cs:line 3250
   --- End of inner exception stack trace ---
   at Lucene.Net.Index.BaseDocValuesFormatTestCase.ThreadAnonymousInnerClassHelper.Run() in z:\Builds\work\bcdbe6b8cc677a49\src\Lucene.Net.TestFramework\Index\BaseDocValuesFormatTestCase.cs:line 3269
   at System.Threading.ThreadHelper.ThreadStart_Context(Object state)
   at System.Threading.ExecutionContext.RunInternal(ExecutionContext executionContext, ContextCallback callback, Object state, Boolean preserveSyncCtx)
   at System.Threading.ExecutionContext.Run(ExecutionContext executionContext, ContextCallback callback, Object state, Boolean preserveSyncCtx)
   at System.Threading.ExecutionContext.Run(ExecutionContext executionContext, ContextCallback callback, Object state)
   at System.Threading.ThreadHelper.ThreadStart()
Unhandled exception in remote appdomain: System.Exception: read past EOF: SlicedIndexInput(SlicedIndexInput(_0_2_dv.dat in RAMInputStream(name=_0.cfs)) in RAMInputStream(name=_0.cfs) slice=3927:4521) ---> System.IO.EndOfStreamException: read past EOF: SlicedIndexInput(SlicedIndexInput(_0_2_dv.dat in RAMInputStream(name=_0.cfs)) in RAMInputStream(name=_0.cfs) slice=3927:4521)
   at Lucene.Net.Store.BufferedIndexInput.ReadBytes(Byte[] b, Int32 offset, Int32 len, Boolean useBuffer) in z:\Builds\work\bcdbe6b8cc677a49\src\Lucene.Net.Core\Store\BufferedIndexInput.cs:line 192
   at Lucene.Net.Store.MockIndexInputWrapper.ReadBytes(Byte[] b, Int32 offset, Int32 len, Boolean useBuffer) in z:\Builds\work\bcdbe6b8cc677a49\src\Lucene.Net.TestFramework\Store\MockIndexInputWrapper.cs:line 140
   at Lucene.Net.Util.PagedBytes.Copy(IndexInput in, Int64 byteCount) in z:\Builds\work\bcdbe6b8cc677a49\src\Lucene.Net.Core\Util\PagedBytes.cs:line 202
   at Lucene.Net.Codecs.Lucene40.Lucene40DocValuesReader.LoadBytesFixedDeref(FieldInfo field) in z:\Builds\work\bcdbe6b8cc677a49\src\Lucene.Net.Core\Codecs\Lucene40\Lucene40DocValuesReader.cs:line 562
   at Lucene.Net.Codecs.Lucene40.Lucene40DocValuesReader.GetBinary(FieldInfo field) in z:\Builds\work\bcdbe6b8cc677a49\src\Lucene.Net.Core\Codecs\Lucene40\Lucene40DocValuesReader.cs:line 426
   at Lucene.Net.Index.SegmentReader.GetBinaryDocValues(String field) in z:\Builds\work\bcdbe6b8cc677a49\src\Lucene.Net.Core\Index\SegmentReader.cs:line 590
   at Lucene.Net.Index.BaseDocValuesFormatTestCase.ThreadAnonymousInnerClassHelper.Run() in z:\Builds\work\bcdbe6b8cc677a49\src\Lucene.Net.TestFramework\Index\BaseDocValuesFormatTestCase.cs:line 3250
   --- End of inner exception stack trace ---
   at Lucene.Net.Index.BaseDocValuesFormatTestCase.ThreadAnonymousInnerClassHelper.Run() in z:\Builds\work\bcdbe6b8cc677a49\src\Lucene.Net.TestFramework\Index\BaseDocValuesFormatTestCase.cs:line 3269
   at System.Threading.ThreadHelper.ThreadStart_Context(Object state)
   at System.Threading.ExecutionContext.RunInternal(ExecutionContext executionContext, ContextCallback callback, Object state, Boolean preserveSyncCtx)
   at System.Threading.ExecutionContext.Run(ExecutionContext executionContext, ContextCallback callback, Object state, Boolean preserveSyncCtx)
   at System.Threading.ExecutionContext.Run(ExecutionContext executionContext, ContextCallback callback, Object state)
   at System.Threading.ThreadHelper.ThreadStart()
Unhandled exception in remote appdomain: System.Exception: read past EOF: SlicedIndexInput(SlicedIndexInput(_0_2_dv.dat in RAMInputStream(name=_0.cfs)) in RAMInputStream(name=_0.cfs) slice=3927:4521) ---> System.IO.EndOfStreamException: read past EOF: SlicedIndexInput(SlicedIndexInput(_0_2_dv.dat in RAMInputStream(name=_0.cfs)) in RAMInputStream(name=_0.cfs) slice=3927:4521)
   at Lucene.Net.Store.BufferedIndexInput.ReadBytes(Byte[] b, Int32 offset, Int32 len, Boolean useBuffer) in z:\Builds\work\bcdbe6b8cc677a49\src\Lucene.Net.Core\Store\BufferedIndexInput.cs:line 192
   at Lucene.Net.Store.MockIndexInputWrapper.ReadBytes(Byte[] b, Int32 offset, Int32 len, Boolean useBuffer) in z:\Builds\work\bcdbe6b8cc677a49\src\Lucene.Net.TestFramework\Store\MockIndexInputWrapper.cs:line 140
   at Lucene.Net.Util.PagedBytes.Copy(IndexInput in, Int64 byteCount) in z:\Builds\work\bcdbe6b8cc677a49\src\Lucene.Net.Core\Util\PagedBytes.cs:line 202
   at Lucene.Net.Codecs.Lucene40.Lucene40DocValuesReader.LoadBytesFixedDeref(FieldInfo field) in z:\Builds\work\bcdbe6b8cc677a49\src\Lucene.Net.Core\Codecs\Lucene40\Lucene40DocValuesReader.cs:line 562
   at Lucene.Net.Codecs.Lucene40.Lucene40DocValuesReader.GetBinary(FieldInfo field) in z:\Builds\work\bcdbe6b8cc677a49\src\Lucene.Net.Core\Codecs\Lucene40\Lucene40DocValuesReader.cs:line 426
   at Lucene.Net.Index.SegmentReader.GetBinaryDocValues(String field) in z:\Builds\work\bcdbe6b8cc677a49\src\Lucene.Net.Core\Index\SegmentReader.cs:line 590
   at Lucene.Net.Index.BaseDocValuesFormatTestCase.ThreadAnonymousInnerClassHelper.Run() in z:\Builds\work\bcdbe6b8cc677a49\src\Lucene.Net.TestFramework\Index\BaseDocValuesFormatTestCase.cs:line 3250
   --- End of inner exception stack trace ---
   at Lucene.Net.Index.BaseDocValuesFormatTestCase.ThreadAnonymousInnerClassHelper.Run() in z:\Builds\work\bcdbe6b8cc677a49\src\Lucene.Net.TestFramework\Index\BaseDocValuesFormatTestCase.cs:line 3269
   at System.Threading.ThreadHelper.ThreadStart_Context(Object state)
   at System.Threading.ExecutionContext.RunInternal(ExecutionContext executionContext, ContextCallback callback, Object state, Boolean preserveSyncCtx)
   at System.Threading.ExecutionContext.Run(ExecutionContext executionContext, ContextCallback callback, Object state, Boolean preserveSyncCtx)
   at System.Threading.ExecutionContext.Run(ExecutionContext executionContext, ContextCallback callback, Object state)
   at System.Threading.ThreadHelper.ThreadStart()
CheckIndex failed
´╗┐Segments file=segments_11 numSegments=10 version=4.8 format=
  1 of 10: name=_0 docCount=147
    codec=Lucene40
    compound=True
    numFiles=4
    size (MB)=0.008148193359375
    diagnostics = System.Collections.Generic.Dictionary`2[System.String,System.String]
    has deletions [delGen=1]
    test: open reader.........OK
    test: check integrity.....OK
    test: check live docs.....OK [9 deleted docs]
    test: fields..............OK [6 fields]
    test: field norms.........OK [0 fields]
    test: terms, freq, prox...OK [138 terms; 138 terms/docs pairs; 0 tokens]
    test (ignoring deletes): terms, freq, prox...OK [147 terms; 147 terms/docs pairs; 0 tokens]
    test: stored fields.......OK [276 total field count; avg 2 fields per doc]
    test: term vectors........OK [0 total vector count; avg 0 term/freq vector fields per doc]
    test: docvalues...........ERROR [read past EOF: SlicedIndexInput(SlicedIndexInput(_0_2_dv.dat in RAMInputStream(name=_0.cfs)) in RAMInputStream(name=_0.cfs) slice=3927:4521)]
   at Lucene.Net.Store.BufferedIndexInput.ReadBytes(Byte[] b, Int32 offset, Int32 len, Boolean useBuffer) in z:\Builds\work\bcdbe6b8cc677a49\src\Lucene.Net.Core\Store\BufferedIndexInput.cs:line 192
   at Lucene.Net.Store.MockIndexInputWrapper.ReadBytes(Byte[] b, Int32 offset, Int32 len, Boolean useBuffer) in z:\Builds\work\bcdbe6b8cc677a49\src\Lucene.Net.TestFramework\Store\MockIndexInputWrapper.cs:line 140
   at Lucene.Net.Util.PagedBytes.Copy(IndexInput in, Int64 byteCount) in z:\Builds\work\bcdbe6b8cc677a49\src\Lucene.Net.Core\Util\PagedBytes.cs:line 202
   at Lucene.Net.Codecs.Lucene40.Lucene40DocValuesReader.LoadBytesFixedDeref(FieldInfo field) in z:\Builds\work\bcdbe6b8cc677a49\src\Lucene.Net.Core\Codecs\Lucene40\Lucene40DocValuesReader.cs:line 562
   at Lucene.Net.Codecs.Lucene40.Lucene40DocValuesReader.GetBinary(FieldInfo field) in z:\Builds\work\bcdbe6b8cc677a49\src\Lucene.Net.Core\Codecs\Lucene40\Lucene40DocValuesReader.cs:line 426
   at Lucene.Net.Index.SegmentReader.GetBinaryDocValues(String field) in z:\Builds\work\bcdbe6b8cc677a49\src\Lucene.Net.Core\Index\SegmentReader.cs:line 590
   at Lucene.Net.Index.CheckIndex.CheckDocValues(FieldInfo fi, AtomicReader reader, DocValuesStatus status) in z:\Builds\work\bcdbe6b8cc677a49\src\Lucene.Net.Core\Index\CheckIndex.cs:line 1937
   at Lucene.Net.Index.CheckIndex.TestDocValues(AtomicReader reader, StreamWriter infoStream) in z:\Builds\work\bcdbe6b8cc677a49\src\Lucene.Net.Core\Index\CheckIndex.cs:line 1706
FAILED
    WARNING: fixIndex() would remove reference to this segment; full exception:
   at Lucene.Net.Index.CheckIndex.DoCheckIndex(IList`1 onlySegments) in z:\Builds\work\bcdbe6b8cc677a49\src\Lucene.Net.Core\Index\CheckIndex.cs:line 828
  2 of 10: name=_1 docCount=30
    codec=Lucene40
    compound=True
    numFiles=4
    size (MB)=0.00301647186279297
    diagnostics = System.Collections.Generic.Dictionary`2[System.String,System.String]
    has deletions [delGen=1]
    test: open reader.........OK
    test: check integrity.....OK
    test: check live docs.....OK [1 deleted docs]
    test: fields..............OK [6 fields]
    test: field norms.........OK [0 fields]
    test: terms, freq, prox...OK [29 terms; 29 terms/docs pairs; 0 tokens]
    test (ignoring deletes): terms, freq, prox...OK [30 terms; 30 terms/docs pairs; 0 tokens]
    test: stored fields.......OK [58 total field count; avg 2 fields per doc]
    test: term vectors........OK [0 total vector count; avg 0 term/freq vector fields per doc]
    test: docvalues...........ERROR [did not read all bytes from file: read 61 vs size 186 (resource: MockIndexInputWrapper(SlicedIndexInput(SlicedIndexInput(_1_2_dv.dat in RAMInputStream(name=_1.cfs)) in RAMInputStream(name=_1.cfs) slice=944:1130)))]
   at Lucene.Net.Codecs.CodecUtil.CheckEOF(IndexInput in) in z:\Builds\work\bcdbe6b8cc677a49\src\Lucene.Net.Core\Codecs\CodecUtil.cs:line 255
   at Lucene.Net.Codecs.Lucene40.Lucene40DocValuesReader.LoadBytesFixedDeref(FieldInfo field) in z:\Builds\work\bcdbe6b8cc677a49\src\Lucene.Net.Core\Codecs\Lucene40\Lucene40DocValuesReader.cs:line 565
   at Lucene.Net.Codecs.Lucene40.Lucene40DocValuesReader.GetBinary(FieldInfo field) in z:\Builds\work\bcdbe6b8cc677a49\src\Lucene.Net.Core\Codecs\Lucene40\Lucene40DocValuesReader.cs:line 426
   at Lucene.Net.Index.SegmentReader.GetBinaryDocValues(String field) in z:\Builds\work\bcdbe6b8cc677a49\src\Lucene.Net.Core\Index\SegmentReader.cs:line 590
   at Lucene.Net.Index.CheckIndex.CheckDocValues(FieldInfo fi, AtomicReader reader, DocValuesStatus status) in z:\Builds\work\bcdbe6b8cc677a49\src\Lucene.Net.Core\Index\CheckIndex.cs:line 1937
   at Lucene.Net.Index.CheckIndex.TestDocValues(AtomicReader reader, StreamWriter infoStream) in z:\Builds\work\bcdbe6b8cc677a49\src\Lucene.Net.Core\Index\CheckIndex.cs:line 1706
FAILED
    WARNING: fixIndex() would remove reference to this segment; full exception:
   at Lucene.Net.Index.CheckIndex.DoCheckIndex(IList`1 onlySegments) in z:\Builds\work\bcdbe6b8cc677a49\src\Lucene.Net.Core\Index\CheckIndex.cs:line 828
  3 of 10: name=_2 docCount=16
    codec=Lucene40
    compound=True
    numFiles=3
    size (MB)=0.00228023529052734
    diagnostics = System.Collections.Generic.Dictionary`2[System.String,System.String]
    no deletions
    test: open reader.........OK
    test: check integrity.....OK
    test: check live docs.....OK
    test: fields..............OK [6 fields]
    test: field norms.........OK [0 fields]
    test: terms, freq, prox...OK [16 terms; 16 terms/docs pairs; 0 tokens]
    test: stored fields.......OK [32 total field count; avg 2 fields per doc]
    test: term vectors........OK [0 total vector count; avg 0 term/freq vector fields per doc]
    test: docvalues...........ERROR [read past EOF: SlicedIndexInput(SlicedIndexInput(_2_2_dv.dat in RAMInputStream(name=_2.cfs)) in RAMInputStream(name=_2.cfs) slice=559:668)]
   at Lucene.Net.Store.BufferedIndexInput.ReadBytes(Byte[] b, Int32 offset, Int32 len, Boolean useBuffer) in z:\Builds\work\bcdbe6b8cc677a49\src\Lucene.Net.Core\Store\BufferedIndexInput.cs:line 192
   at Lucene.Net.Store.MockIndexInputWrapper.ReadBytes(Byte[] b, Int32 offset, Int32 len, Boolean useBuffer) in z:\Builds\work\bcdbe6b8cc677a49\src\Lucene.Net.TestFramework\Store\MockIndexInputWrapper.cs:line 140
   at Lucene.Net.Util.PagedBytes.Copy(IndexInput in, Int64 byteCount) in z:\Builds\work\bcdbe6b8cc677a49\src\Lucene.Net.Core\Util\PagedBytes.cs:line 202
   at Lucene.Net.Codecs.Lucene40.Lucene40DocValuesReader.LoadBytesFixedDeref(FieldInfo field) in z:\Builds\work\bcdbe6b8cc677a49\src\Lucene.Net.Core\Codecs\Lucene40\Lucene40DocValuesReader.cs:line 562
   at Lucene.Net.Codecs.Lucene40.Lucene40DocValuesReader.GetBinary(FieldInfo field) in z:\Builds\work\bcdbe6b8cc677a49\src\Lucene.Net.Core\Codecs\Lucene40\Lucene40DocValuesReader.cs:line 426
   at Lucene.Net.Index.SegmentReader.GetBinaryDocValues(String field) in z:\Builds\work\bcdbe6b8cc677a49\src\Lucene.Net.Core\Index\SegmentReader.cs:line 590
   at Lucene.Net.Index.CheckIndex.CheckDocValues(FieldInfo fi, AtomicReader reader, DocValuesStatus status) in z:\Builds\work\bcdbe6b8cc677a49\src\Lucene.Net.Core\Index\CheckIndex.cs:line 1937
   at Lucene.Net.Index.CheckIndex.TestDocValues(AtomicReader reader, StreamWriter infoStream) in z:\Builds\work\bcdbe6b8cc677a49\src\Lucene.Net.Core\Index\CheckIndex.cs:line 1706
FAILED
    WARNING: fixIndex() would remove reference to this segment; full exception:
   at Lucene.Net.Index.CheckIndex.DoCheckIndex(IList`1 onlySegments) in z:\Builds\work\bcdbe6b8cc677a49\src\Lucene.Net.Core\Index\CheckIndex.cs:line 828
  4 of 10: name=_3 docCount=28
    codec=Lucene40
    compound=True
    numFiles=4
    size (MB)=0.00283908843994141
    diagnostics = System.Collections.Generic.Dictionary`2[System.String,System.String]
    has deletions [delGen=1]
    test: open reader.........OK
    test: check integrity.....OK
    test: check live docs.....OK [2 deleted docs]
    test: fields..............OK [6 fields]
    test: field norms.........OK [0 fields]
    test: terms, freq, prox...OK [26 terms; 26 terms/docs pairs; 0 tokens]
    test (ignoring deletes): terms, freq, prox...OK [28 terms; 28 terms/docs pairs; 0 tokens]
    test: stored fields.......OK [52 total field count; avg 2 fields per doc]
    test: term vectors........OK [0 total vector count; avg 0 term/freq vector fields per doc]
    test: docvalues...........ERROR [read past EOF: SlicedIndexInput(SlicedIndexInput(_3_2_dv.dat in RAMInputStream(name=_3.cfs)) in RAMInputStream(name=_3.cfs) slice=855:996)]
   at Lucene.Net.Store.BufferedIndexInput.ReadBytes(Byte[] b, Int32 offset, Int32 len, Boolean useBuffer) in z:\Builds\work\bcdbe6b8cc677a49\src\Lucene.Net.Core\Store\BufferedIndexInput.cs:line 192
   at Lucene.Net.Store.MockIndexInputWrapper.ReadBytes(Byte[] b, Int32 offset, Int32 len, Boolean useBuffer) in z:\Builds\work\bcdbe6b8cc677a49\src\Lucene.Net.TestFramework\Store\MockIndexInputWrapper.cs:line 140
   at Lucene.Net.Util.PagedBytes.Copy(IndexInput in, Int64 byteCount) in z:\Builds\work\bcdbe6b8cc677a49\src\Lucene.Net.Core\Util\PagedBytes.cs:line 202
   at Lucene.Net.Codecs.Lucene40.Lucene40DocValuesReader.LoadBytesFixedDeref(FieldInfo field) in z:\Builds\work\bcdbe6b8cc677a49\src\Lucene.Net.Core\Codecs\Lucene40\Lucene40DocValuesReader.cs:line 562
   at Lucene.Net.Codecs.Lucene40.Lucene40DocValuesReader.GetBinary(FieldInfo field) in z:\Builds\work\bcdbe6b8cc677a49\src\Lucene.Net.Core\Codecs\Lucene40\Lucene40DocValuesReader.cs:line 426
   at Lucene.Net.Index.SegmentReader.GetBinaryDocValues(String field) in z:\Builds\work\bcdbe6b8cc677a49\src\Lucene.Net.Core\Index\SegmentReader.cs:line 590
   at Lucene.Net.Index.CheckIndex.CheckDocValues(FieldInfo fi, AtomicReader reader, DocValuesStatus status) in z:\Builds\work\bcdbe6b8cc677a49\src\Lucene.Net.Core\Index\CheckIndex.cs:line 1937
   at Lucene.Net.Index.CheckIndex.TestDocValues(AtomicReader reader, StreamWriter infoStream) in z:\Builds\work\bcdbe6b8cc677a49\src\Lucene.Net.Core\Index\CheckIndex.cs:line 1706
FAILED
    WARNING: fixIndex() would remove reference to this segment; full exception:
   at Lucene.Net.Index.CheckIndex.DoCheckIndex(IList`1 onlySegments) in z:\Builds\work\bcdbe6b8cc677a49\src\Lucene.Net.Core\Index\CheckIndex.cs:line 828
  5 of 10: name=_4 docCount=4
    codec=Lucene40
    compound=True
    numFiles=3
    size (MB)=0.00169563293457031
    diagnostics = System.Collections.Generic.Dictionary`2[System.String,System.String]
    no deletions
    test: open reader.........OK
    test: check integrity.....OK
    test: check live docs.....OK
    test: fields..............OK [6 fields]
    test: field norms.........OK [0 fields]
    test: terms, freq, prox...OK [4 terms; 4 terms/docs pairs; 0 tokens]
    test: stored fields.......OK [8 total field count; avg 2 fields per doc]
    test: term vectors........OK [0 total vector count; avg 0 term/freq vector fields per doc]
    test: docvalues...........ERROR [read past EOF: SlicedIndexInput(SlicedIndexInput(_4_2_dv.dat in RAMInputStream(name=_4.cfs)) in RAMInputStream(name=_4.cfs) slice=226:266)]
   at Lucene.Net.Store.BufferedIndexInput.ReadBytes(Byte[] b, Int32 offset, Int32 len, Boolean useBuffer) in z:\Builds\work\bcdbe6b8cc677a49\src\Lucene.Net.Core\Store\BufferedIndexInput.cs:line 192
   at Lucene.Net.Store.MockIndexInputWrapper.ReadBytes(Byte[] b, Int32 offset, Int32 len, Boolean useBuffer) in z:\Builds\work\bcdbe6b8cc677a49\src\Lucene.Net.TestFramework\Store\MockIndexInputWrapper.cs:line 140
   at Lucene.Net.Util.PagedBytes.Copy(IndexInput in, Int64 byteCount) in z:\Builds\work\bcdbe6b8cc677a49\src\Lucene.Net.Core\Util\PagedBytes.cs:line 202
   at Lucene.Net.Codecs.Lucene40.Lucene40DocValuesReader.LoadBytesFixedDeref(FieldInfo field) in z:\Builds\work\bcdbe6b8cc677a49\src\Lucene.Net.Core\Codecs\Lucene40\Lucene40DocValuesReader.cs:line 562
   at Lucene.Net.Codecs.Lucene40.Lucene40DocValuesReader.GetBinary(FieldInfo field) in z:\Builds\work\bcdbe6b8cc677a49\src\Lucene.Net.Core\Codecs\Lucene40\Lucene40DocValuesReader.cs:line 426
   at Lucene.Net.Index.SegmentReader.GetBinaryDocValues(String field) in z:\Builds\work\bcdbe6b8cc677a49\src\Lucene.Net.Core\Index\SegmentReader.cs:line 590
   at Lucene.Net.Index.CheckIndex.CheckDocValues(FieldInfo fi, AtomicReader reader, DocValuesStatus status) in z:\Builds\work\bcdbe6b8cc677a49\src\Lucene.Net.Core\Index\CheckIndex.cs:line 1937
   at Lucene.Net.Index.CheckIndex.TestDocValues(AtomicReader reader, StreamWriter infoStream) in z:\Builds\work\bcdbe6b8cc677a49\src\Lucene.Net.Core\Index\CheckIndex.cs:line 1706
FAILED
    WARNING: fixIndex() would remove reference to this segment; full exception:
   at Lucene.Net.Index.CheckIndex.DoCheckIndex(IList`1 onlySegments) in z:\Builds\work\bcdbe6b8cc677a49\src\Lucene.Net.Core\Index\CheckIndex.cs:line 828
  6 of 10: name=_5 docCount=35
    codec=Lucene40
    compound=True
    numFiles=4
    size (MB)=0.003082275390625
    diagnostics = System.Collections.Generic.Dictionary`2[System.String,System.String]
    has deletions [delGen=1]
    test: open reader.........OK
    test: check integrity.....OK
    test: check live docs.....OK [1 deleted docs]
    test: fields..............OK [6 fields]
    test: field norms.........OK [0 fields]
    test: terms, freq, prox...OK [34 terms; 34 terms/docs pairs; 0 tokens]
    test (ignoring deletes): terms, freq, prox...OK [35 terms; 35 terms/docs pairs; 0 tokens]
    test: stored fields.......OK [68 total field count; avg 2 fields per doc]
    test: term vectors........OK [0 total vector count; avg 0 term/freq vector fields per doc]
    test: docvalues...........ERROR [read past EOF: SlicedIndexInput(SlicedIndexInput(_5_2_dv.dat in RAMInputStream(name=_5.cfs)) in RAMInputStream(name=_5.cfs) slice=1023:1178)]
   at Lucene.Net.Store.BufferedIndexInput.ReadBytes(Byte[] b, Int32 offset, Int32 len, Boolean useBuffer) in z:\Builds\work\bcdbe6b8cc677a49\src\Lucene.Net.Core\Store\BufferedIndexInput.cs:line 192
   at Lucene.Net.Store.MockIndexInputWrapper.ReadBytes(Byte[] b, Int32 offset, Int32 len, Boolean useBuffer) in z:\Builds\work\bcdbe6b8cc677a49\src\Lucene.Net.TestFramework\Store\MockIndexInputWrapper.cs:line 140
   at Lucene.Net.Util.PagedBytes.Copy(IndexInput in, Int64 byteCount) in z:\Builds\work\bcdbe6b8cc677a49\src\Lucene.Net.Core\Util\PagedBytes.cs:line 202
   at Lucene.Net.Codecs.Lucene40.Lucene40DocValuesReader.LoadBytesFixedDeref(FieldInfo field) in z:\Builds\work\bcdbe6b8cc677a49\src\Lucene.Net.Core\Codecs\Lucene40\Lucene40DocValuesReader.cs:line 562
   at Lucene.Net.Codecs.Lucene40.Lucene40DocValuesReader.GetBinary(FieldInfo field) in z:\Builds\work\bcdbe6b8cc677a49\src\Lucene.Net.Core\Codecs\Lucene40\Lucene40DocValuesReader.cs:line 426
   at Lucene.Net.Index.SegmentReader.GetBinaryDocValues(String field) in z:\Builds\work\bcdbe6b8cc677a49\src\Lucene.Net.Core\Index\SegmentReader.cs:line 590
   at Lucene.Net.Index.CheckIndex.CheckDocValues(FieldInfo fi, AtomicReader reader, DocValuesStatus status) in z:\Builds\work\bcdbe6b8cc677a49\src\Lucene.Net.Core\Index\CheckIndex.cs:line 1937
   at Lucene.Net.Index.CheckIndex.TestDocValues(AtomicReader reader, StreamWriter infoStream) in z:\Builds\work\bcdbe6b8cc677a49\src\Lucene.Net.Core\Index\CheckIndex.cs:line 1706
FAILED
    WARNING: fixIndex() would remove reference to this segment; full exception:
   at Lucene.Net.Index.CheckIndex.DoCheckIndex(IList`1 onlySegments) in z:\Builds\work\bcdbe6b8cc677a49\src\Lucene.Net.Core\Index\CheckIndex.cs:line 828
  7 of 10: name=_6 docCount=18
    codec=Lucene40
    compound=True
    numFiles=4
    size (MB)=0.00238037109375
    diagnostics = System.Collections.Generic.Dictionary`2[System.String,System.String]
    has deletions [delGen=1]
    test: open reader.........OK
    test: check integrity.....OK
    test: check live docs.....OK [1 deleted docs]
    test: fields..............OK [6 fields]
    test: field norms.........OK [0 fields]
    test: terms, freq, prox...OK [17 terms; 17 terms/docs pairs; 0 tokens]
    test (ignoring deletes): terms, freq, prox...OK [18 terms; 18 terms/docs pairs; 0 tokens]
    test: stored fields.......OK [34 total field count; avg 2 fields per doc]
    test: term vectors........OK [0 total vector count; avg 0 term/freq vector fields per doc]
    test: docvalues...........ERROR [read past EOF: SlicedIndexInput(SlicedIndexInput(_6_2_dv.dat in RAMInputStream(name=_6.cfs)) in RAMInputStream(name=_6.cfs) slice=594:694)]
   at Lucene.Net.Store.BufferedIndexInput.ReadBytes(Byte[] b, Int32 offset, Int32 len, Boolean useBuffer) in z:\Builds\work\bcdbe6b8cc677a49\src\Lucene.Net.Core\Store\BufferedIndexInput.cs:line 192
   at Lucene.Net.Store.MockIndexInputWrapper.ReadBytes(Byte[] b, Int32 offset, Int32 len, Boolean useBuffer) in z:\Builds\work\bcdbe6b8cc677a49\src\Lucene.Net.TestFramework\Store\MockIndexInputWrapper.cs:line 140
   at Lucene.Net.Util.PagedBytes.Copy(IndexInput in, Int64 byteCount) in z:\Builds\work\bcdbe6b8cc677a49\src\Lucene.Net.Core\Util\PagedBytes.cs:line 202
   at Lucene.Net.Codecs.Lucene40.Lucene40DocValuesReader.LoadBytesFixedDeref(FieldInfo field) in z:\Builds\work\bcdbe6b8cc677a49\src\Lucene.Net.Core\Codecs\Lucene40\Lucene40DocValuesReader.cs:line 562
   at Lucene.Net.Codecs.Lucene40.Lucene40DocValuesReader.GetBinary(FieldInfo field) in z:\Builds\work\bcdbe6b8cc677a49\src\Lucene.Net.Core\Codecs\Lucene40\Lucene40DocValuesReader.cs:line 426
   at Lucene.Net.Index.SegmentReader.GetBinaryDocValues(String field) in z:\Builds\work\bcdbe6b8cc677a49\src\Lucene.Net.Core\Index\SegmentReader.cs:line 590
   at Lucene.Net.Index.CheckIndex.CheckDocValues(FieldInfo fi, AtomicReader reader, DocValuesStatus status) in z:\Builds\work\bcdbe6b8cc677a49\src\Lucene.Net.Core\Index\CheckIndex.cs:line 1937
   at Lucene.Net.Index.CheckIndex.TestDocValues(AtomicReader reader, StreamWriter infoStream) in z:\Builds\work\bcdbe6b8cc677a49\src\Lucene.Net.Core\Index\CheckIndex.cs:line 1706
FAILED
    WARNING: fixIndex() would remove reference to this segment; full exception:
   at Lucene.Net.Index.CheckIndex.DoCheckIndex(IList`1 onlySegments) in z:\Builds\work\bcdbe6b8cc677a49\src\Lucene.Net.Core\Index\CheckIndex.cs:line 828
  8 of 10: name=_7 docCount=26
    codec=Lucene40
    compound=True
    numFiles=4
    size (MB)=0.00275039672851563
    diagnostics = System.Collections.Generic.Dictionary`2[System.String,System.String]
    has deletions [delGen=1]
    test: open reader.........OK
    test: check integrity.....OK
    test: check live docs.....OK [2 deleted docs]
    test: fields..............OK [6 fields]
    test: field norms.........OK [0 fields]
    test: terms, freq, prox...OK [24 terms; 24 terms/docs pairs; 0 tokens]
    test (ignoring deletes): terms, freq, prox...OK [26 terms; 26 terms/docs pairs; 0 tokens]
    test: stored fields.......OK [48 total field count; avg 2 fields per doc]
    test: term vectors........OK [0 total vector count; avg 0 term/freq vector fields per doc]
    test: docvalues...........ERROR [read past EOF: SlicedIndexInput(SlicedIndexInput(_7_2_dv.dat in RAMInputStream(name=_7.cfs)) in RAMInputStream(name=_7.cfs) slice=803:936)]
   at Lucene.Net.Store.BufferedIndexInput.ReadBytes(Byte[] b, Int32 offset, Int32 len, Boolean useBuffer) in z:\Builds\work\bcdbe6b8cc677a49\src\Lucene.Net.Core\Store\BufferedIndexInput.cs:line 192
   at Lucene.Net.Store.MockIndexInputWrapper.ReadBytes(Byte[] b, Int32 offset, Int32 len, Boolean useBuffer) in z:\Builds\work\bcdbe6b8cc677a49\src\Lucene.Net.TestFramework\Store\MockIndexInputWrapper.cs:line 140
   at Lucene.Net.Util.PagedBytes.Copy(IndexInput in, Int64 byteCount) in z:\Builds\work\bcdbe6b8cc677a49\src\Lucene.Net.Core\Util\PagedBytes.cs:line 202
   at Lucene.Net.Codecs.Lucene40.Lucene40DocValuesReader.LoadBytesFixedDeref(FieldInfo field) in z:\Builds\work\bcdbe6b8cc677a49\src\Lucene.Net.Core\Codecs\Lucene40\Lucene40DocValuesReader.cs:line 562
   at Lucene.Net.Codecs.Lucene40.Lucene40DocValuesReader.GetBinary(FieldInfo field) in z:\Builds\work\bcdbe6b8cc677a49\src\Lucene.Net.Core\Codecs\Lucene40\Lucene40DocValuesReader.cs:line 426
   at Lucene.Net.Index.SegmentReader.GetBinaryDocValues(String field) in z:\Builds\work\bcdbe6b8cc677a49\src\Lucene.Net.Core\Index\SegmentReader.cs:line 590
   at Lucene.Net.Index.CheckIndex.CheckDocValues(FieldInfo fi, AtomicReader reader, DocValuesStatus status) in z:\Builds\work\bcdbe6b8cc677a49\src\Lucene.Net.Core\Index\CheckIndex.cs:line 1937
   at Lucene.Net.Index.CheckIndex.TestDocValues(AtomicReader reader, StreamWriter infoStream) in z:\Builds\work\bcdbe6b8cc677a49\src\Lucene.Net.Core\Index\CheckIndex.cs:line 1706
FAILED
    WARNING: fixIndex() would remove reference to this segment; full exception:
   at Lucene.Net.Index.CheckIndex.DoCheckIndex(IList`1 onlySegments) in z:\Builds\work\bcdbe6b8cc677a49\src\Lucene.Net.Core\Index\CheckIndex.cs:line 828
  9 of 10: name=_8 docCount=2
    codec=Lucene40
    compound=True
    numFiles=3
    size (MB)=0.00155830383300781
    diagnostics = System.Collections.Generic.Dictionary`2[System.String,System.String]
    no deletions
    test: open reader.........OK
    test: check integrity.....OK
    test: check live docs.....OK
    test: fields..............OK [6 fields]
    test: field norms.........OK [0 fields]
    test: terms, freq, prox...OK [2 terms; 2 terms/docs pairs; 0 tokens]
    test: stored fields.......OK [4 total field count; avg 2 fields per doc]
    test: term vectors........OK [0 total vector count; avg 0 term/freq vector fields per doc]
    test: docvalues...........ERROR [read past EOF: SlicedIndexInput(SlicedIndexInput(_8_2_dv.dat in RAMInputStream(name=_8.cfs)) in RAMInputStream(name=_8.cfs) slice=184:226)]
   at Lucene.Net.Store.BufferedIndexInput.ReadBytes(Byte[] b, Int32 offset, Int32 len, Boolean useBuffer) in z:\Builds\work\bcdbe6b8cc677a49\src\Lucene.Net.Core\Store\BufferedIndexInput.cs:line 192
   at Lucene.Net.Store.MockIndexInputWrapper.ReadBytes(Byte[] b, Int32 offset, Int32 len, Boolean useBuffer) in z:\Builds\work\bcdbe6b8cc677a49\src\Lucene.Net.TestFramework\Store\MockIndexInputWrapper.cs:line 140
   at Lucene.Net.Util.PagedBytes.Copy(IndexInput in, Int64 byteCount) in z:\Builds\work\bcdbe6b8cc677a49\src\Lucene.Net.Core\Util\PagedBytes.cs:line 202
   at Lucene.Net.Codecs.Lucene40.Lucene40DocValuesReader.LoadBytesFixedStraight(FieldInfo field) in z:\Builds\work\bcdbe6b8cc677a49\src\Lucene.Net.Core\Codecs\Lucene40\Lucene40DocValuesReader.cs:line 451
   at Lucene.Net.Codecs.Lucene40.Lucene40DocValuesReader.GetBinary(FieldInfo field) in z:\Builds\work\bcdbe6b8cc677a49\src\Lucene.Net.Core\Codecs\Lucene40\Lucene40DocValuesReader.cs:line 418
   at Lucene.Net.Index.SegmentReader.GetBinaryDocValues(String field) in z:\Builds\work\bcdbe6b8cc677a49\src\Lucene.Net.Core\Index\SegmentReader.cs:line 590
   at Lucene.Net.Index.CheckIndex.CheckDocValues(FieldInfo fi, AtomicReader reader, DocValuesStatus status) in z:\Builds\work\bcdbe6b8cc677a49\src\Lucene.Net.Core\Index\CheckIndex.cs:line 1937
   at Lucene.Net.Index.CheckIndex.TestDocValues(AtomicReader reader, StreamWriter infoStream) in z:\Builds\work\bcdbe6b8cc677a49\src\Lucene.Net.Core\Index\CheckIndex.cs:line 1706
FAILED
    WARNING: fixIndex() would remove reference to this segment; full exception:
   at Lucene.Net.Index.CheckIndex.DoCheckIndex(IList`1 onlySegments) in z:\Builds\work\bcdbe6b8cc677a49\src\Lucene.Net.Core\Index\CheckIndex.cs:line 828
  10 of 10: name=_9 docCount=18
    codec=Lucene40
    compound=True
    numFiles=3
    size (MB)=0.00232028961181641
    diagnostics = System.Collections.Generic.Dictionary`2[System.String,System.String]
    no deletions
    test: open reader.........OK
    test: check integrity.....OK
    test: check live docs.....OK
    test: fields..............OK [6 fields]
    test: field norms.........OK [0 fields]
    test: terms, freq, prox...OK [18 terms; 18 terms/docs pairs; 0 tokens]
    test: stored fields.......OK [36 total field count; avg 2 fields per doc]
    test: term vectors........OK [0 total vector count; avg 0 term/freq vector fields per doc]
    test: docvalues...........ERROR [did not read all bytes from file: read 85 vs size 95 (resource: MockIndexInputWrapper(SlicedIndexInput(SlicedIndexInput(_9_2_dv.dat in RAMInputStream(name=_9.cfs)) in RAMInputStream(name=_9.cfs) slice=589:684)))]
   at Lucene.Net.Codecs.CodecUtil.CheckEOF(IndexInput in) in z:\Builds\work\bcdbe6b8cc677a49\src\Lucene.Net.Core\Codecs\CodecUtil.cs:line 255
   at Lucene.Net.Codecs.Lucene40.Lucene40DocValuesReader.LoadBytesFixedDeref(FieldInfo field) in z:\Builds\work\bcdbe6b8cc677a49\src\Lucene.Net.Core\Codecs\Lucene40\Lucene40DocValuesReader.cs:line 565
   at Lucene.Net.Codecs.Lucene40.Lucene40DocValuesReader.GetBinary(FieldInfo field) in z:\Builds\work\bcdbe6b8cc677a49\src\Lucene.Net.Core\Codecs\Lucene40\Lucene40DocValuesReader.cs:line 426
   at Lucene.Net.Index.SegmentReader.GetBinaryDocValues(String field) in z:\Builds\work\bcdbe6b8cc677a49\src\Lucene.Net.Core\Index\SegmentReader.cs:line 590
   at Lucene.Net.Index.CheckIndex.CheckDocValues(FieldInfo fi, AtomicReader reader, DocValuesStatus status) in z:\Builds\work\bcdbe6b8cc677a49\src\Lucene.Net.Core\Index\CheckIndex.cs:line 1937
   at Lucene.Net.Index.CheckIndex.TestDocValues(AtomicReader reader, StreamWriter infoStream) in z:\Builds\work\bcdbe6b8cc677a49\src\Lucene.Net.Core\Index\CheckIndex.cs:line 1706
FAILED
    WARNING: fixIndex() would remove reference to this segment; full exception:
   at Lucene.Net.Index.CheckIndex.DoCheckIndex(IList`1 onlySegments) in z:\Builds\work\bcdbe6b8cc677a49\src\Lucene.Net.Core\Index\CheckIndex.cs:line 828
WARNING: 10 broken segments (containing 308 documents) detected
Changes included (2 changes)
====================================================
Change 52b13ba03ec69b4a5b4a937ade79fbb92b5f6f5a by laimis (1 file):
fix number formatting


Change 0a1964ec50e84a690b7494da3fdd402e91596475 by laimis (1 file):
ignore known failing test, same as in Lucene


see more information about changed files: http://teamcity.codebetter.com/viewLog.html?tab=buildChangesDiv&buildId=185377&buildTypeId=LuceneNet_Core

============================================================================
Configure email notifications: http://teamcity.codebetter.com/profile.html?init=1&tab=userNotifications

Mime
  • Unnamed multipart/alternative (inline, None, 0 bytes)
View raw message