lucenenet-dev mailing list archives

Site index · List index
Message view « Date » · « Thread »
Top « Date » · « Thread »
From t.@codebetter.com
Subject [TeamCity, FAILED] Build Lucene.NET :: Lucene.NET Core [master] #171
Date Fri, 06 Feb 2015 08:40:27 GMT
Build Lucene.NET :: Lucene.NET Core [master] #171 failed (Tests failed: 71 (9 new), passed:
2387, ignored: 110).
Agent: JetBrains-dotnet-agent01
Build results: http://teamcity.codebetter.com/viewLog.html?buildId=180789&buildTypeId=LuceneNet_Core

Failed Tests Summary:
Newly failed tests (9 tests, alphabetically ordered)
==================================================================
Lucene.Net.Tests.dll: Lucene.Net.Index.TestBagOfPositions.Test
Lucene.Net.Tests.dll: Lucene.Net.Index.TestIndexWriterOutOfFileDescriptors.Test
Lucene.Net.Tests.dll: Lucene.Net.Index.TestStressNRT.Test
Lucene.Net.Tests.dll: Lucene.Net.Search.TestFilteredQuery.TestFilteredQuery_Mem
Lucene.Net.Tests.dll: Lucene.Net.Search.TestSimpleExplanations.TestFQ4
Lucene.Net.Tests.dll: Lucene.Net.Search.TestSimpleExplanations.TestFQ6
Lucene.Net.Tests.dll: Lucene.Net.Search.TestSimpleExplanations.TestT2
Lucene.Net.Tests.dll: Lucene.Net.Util.Automaton.TestUTF32ToUTF8.TestRandomRegexes
Lucene.Net.Tests.dll: Lucene.Net.Util.TestIndexableBinaryStringTools.TestEncodedSortability

Other failed tests (62 tests, alphabetically ordered)
==================================================================
Lucene.Net.Tests.dll: Lucene.Net.Codecs.Lucene41.TestBlockPostingsFormat2
Lucene.Net.Tests.dll: Lucene.Net.Codecs.Lucene41.TestBlockPostingsFormat3.Test
Lucene.Net.Tests.dll: Lucene.Net.Codecs.Lucene42.TestLucene42DocValuesFormat.BaseDocValuesFormatTestCase.TestVeryLargeButLegalSortedBytes
Lucene.Net.Tests.dll: Lucene.Net.Index.TestAddIndexes.TestAddIndexMissingCodec
Lucene.Net.Tests.dll: Lucene.Net.Index.TestAtomicUpdate.TestAtomicUpdates
Lucene.Net.Tests.dll: Lucene.Net.Index.TestCustomNorms.TestFloatNorms
Lucene.Net.Tests.dll: Lucene.Net.Index.TestDirectoryReader.TestNoDir
Lucene.Net.Tests.dll: Lucene.Net.Index.TestDocumentsWriterStallControl.TestSimpleStall
Lucene.Net.Tests.dll: Lucene.Net.Index.TestDuelingCodecs.TestEquals
Lucene.Net.Tests.dll: Lucene.Net.Index.TestFilterAtomicReader.TestOverrideMethods
Lucene.Net.Tests.dll: Lucene.Net.Index.TestIndexWriter.TestThreadInterruptDeadlock
Lucene.Net.Tests.dll: Lucene.Net.Index.TestIndexWriter.TestTwoThreadsInterruptDeadlock
Lucene.Net.Tests.dll: Lucene.Net.Index.TestIndexWriterExceptions.TestExceptionOnMergeInit
Lucene.Net.Tests.dll: Lucene.Net.Index.TestIndexWriterReader.TestDuringAddDelete
Lucene.Net.Tests.dll: Lucene.Net.Index.TestIndexWriterReader.TestDuringAddIndexes
Lucene.Net.Tests.dll: Lucene.Net.Index.TestIndexWriterReader.TestNRTOpenExceptions
Lucene.Net.Tests.dll: Lucene.Net.Index.TestIndexWriterUnicode.TestTermUTF16SortOrder
Lucene.Net.Tests.dll: Lucene.Net.Index.TestIndexableField.TestArbitraryFields
Lucene.Net.Tests.dll: Lucene.Net.Index.TestLongPostings.TestLongPostingsNoPositions
Lucene.Net.Tests.dll: Lucene.Net.Index.TestLongPostings.TestLongPostings_Mem
Lucene.Net.Tests.dll: Lucene.Net.Index.TestNRTThreads.TestNRTThreads_Mem
Lucene.Net.Tests.dll: Lucene.Net.Index.TestParallelCompositeReader.TestToStringCompositeComposite
Lucene.Net.Tests.dll: Lucene.Net.Index.TestPersistentSnapshotDeletionPolicy.TestSnapshotDeletionPolicy.TestBasicSnapshots
Lucene.Net.Tests.dll: Lucene.Net.Index.TestPersistentSnapshotDeletionPolicy.TestSnapshotDeletionPolicy.TestRollbackToOldSnapshot
Lucene.Net.Tests.dll: Lucene.Net.Index.TestSegmentMerger.TestMerge
Lucene.Net.Tests.dll: Lucene.Net.Index.TestSegmentReader.TestDocument
Lucene.Net.Tests.dll: Lucene.Net.Index.TestSegmentTermDocs.TestIndexDivisor
Lucene.Net.Tests.dll: Lucene.Net.Index.TestSegmentTermDocs.TestTermDocs
Lucene.Net.Tests.dll: Lucene.Net.Index.TestSnapshotDeletionPolicy.TestRollbackToOldSnapshot
Lucene.Net.Tests.dll: Lucene.Net.Index.TestTermdocPerf.TestTermDocPerf
Lucene.Net.Tests.dll: Lucene.Net.Index.TestTermsEnum.TestFloorBlocks
Lucene.Net.Tests.dll: Lucene.Net.Index.TestTermsEnum.TestRandomTerms
Lucene.Net.Tests.dll: Lucene.Net.Index.TestTransactions.TestTransactions_Mem
Lucene.Net.Tests.dll: Lucene.Net.Search.Payloads.TestPayloadNearQuery.Test
Lucene.Net.Tests.dll: Lucene.Net.Search.Payloads.TestPayloadNearQuery.TestAverageFunction
Lucene.Net.Tests.dll: Lucene.Net.Search.Payloads.TestPayloadNearQuery.TestComplexNested
Lucene.Net.Tests.dll: Lucene.Net.Search.Payloads.TestPayloadNearQuery.TestLongerSpan
Lucene.Net.Tests.dll: Lucene.Net.Search.Payloads.TestPayloadNearQuery.TestMaxFunction
Lucene.Net.Tests.dll: Lucene.Net.Search.Payloads.TestPayloadNearQuery.TestMinFunction
Lucene.Net.Tests.dll: Lucene.Net.Search.Payloads.TestPayloadNearQuery.TestPayloadNear
Lucene.Net.Tests.dll: Lucene.Net.Search.Spans.TestSpanMultiTermQueryWrapper.TestFuzzy2
Lucene.Net.Tests.dll: Lucene.Net.Search.TestAutomatonQuery.TestRewritePrefix
Lucene.Net.Tests.dll: Lucene.Net.Search.TestFuzzyQuery.TestFuzziness
Lucene.Net.Tests.dll: Lucene.Net.Search.TestFuzzyQuery.TestTieBreaker
Lucene.Net.Tests.dll: Lucene.Net.Search.TestMultiPhraseQuery.TestMultiSloppyWithRepeats
Lucene.Net.Tests.dll: Lucene.Net.Search.TestNumericRangeQuery32.TestInfiniteValues
Lucene.Net.Tests.dll: Lucene.Net.Search.TestNumericRangeQuery64.TestInfiniteValues
Lucene.Net.Tests.dll: Lucene.Net.Search.TestRegexpQuery.TestBacktracking
Lucene.Net.Tests.dll: Lucene.Net.Search.TestRegexpQuery.TestRegexComplement
Lucene.Net.Tests.dll: Lucene.Net.Search.TestRegexpRandom.TestRegexps
Lucene.Net.Tests.dll: Lucene.Net.Search.TestSearchAfter.TestQueries
Lucene.Net.Tests.dll: Lucene.Net.Search.TestSearcherManager.TestSearcherManager_Mem
Lucene.Net.Tests.dll: Lucene.Net.Search.TestSimpleExplanations.TestDMQ8
Lucene.Net.Tests.dll: Lucene.Net.Search.TestTermVectors
Lucene.Net.Tests.dll: Lucene.Net.Search.TestTermVectors.TestMixedVectrosVectors
Lucene.Net.Tests.dll: Lucene.Net.Search.TestWildcard.TestPrefixTerm
Lucene.Net.Tests.dll: Lucene.Net.Search.TestWildcardRandom.TestWildcards
Lucene.Net.Tests.dll: Lucene.Net.Store.TestBufferedIndexInput.TestSetBufferSize
Lucene.Net.Tests.dll: Lucene.Net.Store.TestFileSwitchDirectory.TestNoDir
Lucene.Net.Tests.dll: Lucene.Net.Store.TestNRTCachingDirectory.TestNoDir
Lucene.Net.Tests.dll: Lucene.Net.Tests.TestAssertions.TestTokenStreams
Lucene.Net.Tests.dll: Lucene.Net.Util.Packed.TestEliasFanoSequence.TestMonotoneSequences



Newly failed tests details (only first 3 failures shown here)
==================================================================
Lucene.Net.Tests.dll: Lucene.Net.Index.TestBagOfPositions.Test (new) =================
Test(s) failed. Test exceeded Timeout value of 20000ms

Lucene.Net.Tests.dll: Lucene.Net.Index.TestIndexWriterOutOfFileDescriptors.Test (new) =================
TearDown method failed. Lucene.Net.Index.CorruptIndexException : failed to locate current
segments_N file "segments_23"
TearDown : System.UnauthorizedAccessException : Access to the path '_0.cfs' is denied.
   at Lucene.Net.Index.IndexFileDeleter..ctor(Directory directory, IndexDeletionPolicy policy,
SegmentInfos segmentInfos, InfoStream infoStream, IndexWriter writer, Boolean initialIndexExists)
in z:\Builds\work\bcdbe6b8cc677a49\src\Lucene.Net.Core\Index\IndexFileDeleter.cs:line 247
   at Lucene.Net.Index.IndexWriter..ctor(Directory d, IndexWriterConfig conf) in z:\Builds\work\bcdbe6b8cc677a49\src\Lucene.Net.Core\Index\IndexWriter.cs:line
933
   at Lucene.Net.Index.TestIndexWriterOutOfFileDescriptors.Test() in z:\Builds\work\bcdbe6b8cc677a49\src\Lucene.Net.Tests\core\Index\TestIndexWriterOutOfFileDescriptors.cs:line
78
--TearDown
   at System.IO.Directory.DeleteHelper(String fullPath, String userPath, Boolean recursive,
Boolean throwOnTopLevelDirectoryNotFound)
   at System.IO.Directory.Delete(String fullPath, String userPath, Boolean recursive, Boolean
checkHost)
   at Lucene.Net.Util.LuceneTestCase.CleanupTemporaryFiles() in z:\Builds\work\bcdbe6b8cc677a49\src\Lucene.Net.TestFramework\Util\LuceneTestCase.cs:line
2647
   at Lucene.Net.Util.LuceneTestCase.TearDown() in z:\Builds\work\bcdbe6b8cc677a49\src\Lucene.Net.TestFramework\Util\LuceneTestCase.cs:line
581
Lucene.Net.Tests.dll: Lucene.Net.Index.TestStressNRT.Test (new) =================
Test(s) failed. System.Exception : MockDirectoryWrapper: cannot close: there are still open
files: _1.cfs ,_0.cfs
  ----> System.Exception : unclosed IndexSlice: _0.cfs
   at Lucene.Net.Store.MockDirectoryWrapper.Dispose() in z:\Builds\work\bcdbe6b8cc677a49\src\Lucene.Net.TestFramework\Store\MockDirectoryWrapper.cs:line
918
   at Lucene.Net.Index.TestStressNRT.Test() in z:\Builds\work\bcdbe6b8cc677a49\src\Lucene.Net.Tests\core\Index\TestStressNRT.cs:line
152
--Exception

------- Stderr: -------
READER1: FAILED: unexpected exception
   at System.ThrowHelper.ThrowInvalidOperationException(ExceptionResource resource)
   at System.Collections.Generic.Dictionary`2.KeyCollection.Enumerator.MoveNext()
   at Lucene.Net.Util.WeakIdentityMap`2.Reap() in z:\Builds\work\bcdbe6b8cc677a49\src\Lucene.Net.Core\Util\WeakIdentityMap.cs:line
336
   at Lucene.Net.Util.WeakIdentityMap`2.Put(K key, V value) in z:\Builds\work\bcdbe6b8cc677a49\src\Lucene.Net.Core\Util\WeakIdentityMap.cs:line
148
   at Lucene.Net.Util.VirtualMethod`1.GetImplementationDistance(Type subclazz) in z:\Builds\work\bcdbe6b8cc677a49\src\Lucene.Net.Core\Util\VirtualMethod.cs:line
107
   at Lucene.Net.Search.AssertingBulkScorer.ShouldWrap(BulkScorer inScorer) in z:\Builds\work\bcdbe6b8cc677a49\src\Lucene.Net.TestFramework\Search\AssertingBulkScorer.cs:line
45
   at Lucene.Net.Search.AssertingWeight.BulkScorer(AtomicReaderContext context, Boolean scoreDocsInOrder,
Bits acceptDocs) in z:\Builds\work\bcdbe6b8cc677a49\src\Lucene.Net.TestFramework\Search\AssertingWeight.cs:line
109
   at Lucene.Net.Search.IndexSearcher.Search(IList`1 leaves, Weight weight, Collector collector)
in z:\Builds\work\bcdbe6b8cc677a49\src\Lucene.Net.Core\Search\IndexSearcher.cs:line 653
   at Lucene.Net.Search.AssertingIndexSearcher.Search(IList`1 leaves, Weight weight, Collector
collector) in z:\Builds\work\bcdbe6b8cc677a49\src\Lucene.Net.TestFramework\Search\AssertingIndexSearcher.cs:line
116
   at Lucene.Net.Search.IndexSearcher.Search(IList`1 leaves, Weight weight, ScoreDoc after,
Int32 nDocs) in z:\Builds\work\bcdbe6b8cc677a49\src\Lucene.Net.Core\Search\IndexSearcher.cs:line
526
   at Lucene.Net.Search.IndexSearcher.Search(Weight weight, ScoreDoc after, Int32 nDocs) in
z:\Builds\work\bcdbe6b8cc677a49\src\Lucene.Net.Core\Search\IndexSearcher.cs:line 474
   at Lucene.Net.Search.IndexSearcher.Search(Query query, Filter filter, Int32 n) in z:\Builds\work\bcdbe6b8cc677a49\src\Lucene.Net.Core\Search\IndexSearcher.cs:line
301
   at Lucene.Net.Search.IndexSearcher.Search(Query query, Int32 n) in z:\Builds\work\bcdbe6b8cc677a49\src\Lucene.Net.Core\Search\IndexSearcher.cs:line
290
   at Lucene.Net.Index.TestStressNRT.ThreadAnonymousInnerClassHelper2.Run() in z:\Builds\work\bcdbe6b8cc677a49\src\Lucene.Net.Tests\core\Index\TestStressNRT.cs:line
479
Unhandled exception in remote appdomain: System.Exception: Collection was modified; enumeration
operation may not execute. ---> System.InvalidOperationException: Collection was modified;
enumeration operation may not execute.
   at System.ThrowHelper.ThrowInvalidOperationException(ExceptionResource resource)
   at System.Collections.Generic.Dictionary`2.KeyCollection.Enumerator.MoveNext()
   at Lucene.Net.Util.WeakIdentityMap`2.Reap() in z:\Builds\work\bcdbe6b8cc677a49\src\Lucene.Net.Core\Util\WeakIdentityMap.cs:line
336
   at Lucene.Net.Util.WeakIdentityMap`2.Put(K key, V value) in z:\Builds\work\bcdbe6b8cc677a49\src\Lucene.Net.Core\Util\WeakIdentityMap.cs:line
148
   at Lucene.Net.Util.VirtualMethod`1.GetImplementationDistance(Type subclazz) in z:\Builds\work\bcdbe6b8cc677a49\src\Lucene.Net.Core\Util\VirtualMethod.cs:line
107
   at Lucene.Net.Search.AssertingBulkScorer.ShouldWrap(BulkScorer inScorer) in z:\Builds\work\bcdbe6b8cc677a49\src\Lucene.Net.TestFramework\Search\AssertingBulkScorer.cs:line
45
   at Lucene.Net.Search.AssertingWeight.BulkScorer(AtomicReaderContext context, Boolean scoreDocsInOrder,
Bits acceptDocs) in z:\Builds\work\bcdbe6b8cc677a49\src\Lucene.Net.TestFramework\Search\AssertingWeight.cs:line
109
   at Lucene.Net.Search.IndexSearcher.Search(IList`1 leaves, Weight weight, Collector collector)
in z:\Builds\work\bcdbe6b8cc677a49\src\Lucene.Net.Core\Search\IndexSearcher.cs:line 653
   at Lucene.Net.Search.AssertingIndexSearcher.Search(IList`1 leaves, Weight weight, Collector
collector) in z:\Builds\work\bcdbe6b8cc677a49\src\Lucene.Net.TestFramework\Search\AssertingIndexSearcher.cs:line
116
   at Lucene.Net.Search.IndexSearcher.Search(IList`1 leaves, Weight weight, ScoreDoc after,
Int32 nDocs) in z:\Builds\work\bcdbe6b8cc677a49\src\Lucene.Net.Core\Search\IndexSearcher.cs:line
526
   at Lucene.Net.Search.IndexSearcher.Search(Weight weight, ScoreDoc after, Int32 nDocs) in
z:\Builds\work\bcdbe6b8cc677a49\src\Lucene.Net.Core\Search\IndexSearcher.cs:line 474
   at Lucene.Net.Search.IndexSearcher.Search(Query query, Filter filter, Int32 n) in z:\Builds\work\bcdbe6b8cc677a49\src\Lucene.Net.Core\Search\IndexSearcher.cs:line
301
   at Lucene.Net.Search.IndexSearcher.Search(Query query, Int32 n) in z:\Builds\work\bcdbe6b8cc677a49\src\Lucene.Net.Core\Search\IndexSearcher.cs:line
290
   at Lucene.Net.Index.TestStressNRT.ThreadAnonymousInnerClassHelper2.Run() in z:\Builds\work\bcdbe6b8cc677a49\src\Lucene.Net.Tests\core\Index\TestStressNRT.cs:line
479
   --- End of inner exception stack trace ---
   at Lucene.Net.Index.TestStressNRT.ThreadAnonymousInnerClassHelper2.Run() in z:\Builds\work\bcdbe6b8cc677a49\src\Lucene.Net.Tests\core\Index\TestStressNRT.cs:line
525
   at System.Threading.ThreadHelper.ThreadStart_Context(Object state)
   at System.Threading.ExecutionContext.RunInternal(ExecutionContext executionContext, ContextCallback
callback, Object state, Boolean preserveSyncCtx)
   at System.Threading.ExecutionContext.Run(ExecutionContext executionContext, ContextCallback
callback, Object state, Boolean preserveSyncCtx)
   at System.Threading.ExecutionContext.Run(ExecutionContext executionContext, ContextCallback
callback, Object state)
   at System.Threading.ThreadHelper.ThreadStart()
see all newly failed tests: http://teamcity.codebetter.com/viewLog.html?buildId=180789&buildTypeId=LuceneNet_Core



Other failed tests details (only first 3 failures shown here)
==================================================================
Lucene.Net.Tests.dll: Lucene.Net.Codecs.Lucene41.TestBlockPostingsFormat2 =================
TearDown method failed. CheckIndex failed
   at Lucene.Net.Util.TestUtil.CheckIndex(Directory dir, Boolean crossCheckTermVectors) in
z:\Builds\work\bcdbe6b8cc677a49\src\Lucene.Net.TestFramework\Util\TestUtil.cs:line 257
   at Lucene.Net.Codecs.Lucene41.TestBlockPostingsFormat2.TearDown() in z:\Builds\work\bcdbe6b8cc677a49\src\Lucene.Net.Tests\core\Codecs\Lucene41\TestBlockPostingsFormat2.cs:line
65
Lucene.Net.Tests.dll: Lucene.Net.Codecs.Lucene41.TestBlockPostingsFormat3.Test =================
Test(s) failed. Test exceeded Timeout value of 20000ms

Lucene.Net.Tests.dll: Lucene.Net.Codecs.Lucene42.TestLucene42DocValuesFormat.BaseDocValuesFormatTestCase.TestVeryLargeButLegalSortedBytes
=================
Test(s) failed. System.ArgumentOutOfRangeException : Index was out of range. Must be non-negative
and less than the size of the collection.
Parameter name: index
   at System.ThrowHelper.ThrowArgumentOutOfRangeException()
   at Lucene.Net.Util.Fst.BytesStore.ReverseBytesReaderAnonymousInner.ReadByte() in z:\Builds\work\bcdbe6b8cc677a49\src\Lucene.Net.Core\Util\Fst\BytesStore.cs:line
534
   at Lucene.Net.Util.Fst.FST`1.SeekToNextNode(BytesReader in) in z:\Builds\work\bcdbe6b8cc677a49\src\Lucene.Net.Core\Util\Fst\FST.cs:line
1431
   at Lucene.Net.Util.Fst.FST`1.ReadNextRealArc(Arc`1 arc, BytesReader in) in z:\Builds\work\bcdbe6b8cc677a49\src\Lucene.Net.Core\Util\Fst\FST.cs:line
1243
   at Lucene.Net.Util.Fst.FST`1.ReadFirstRealTargetArc(Int64 node, Arc`1 arc, BytesReader
in) in z:\Builds\work\bcdbe6b8cc677a49\src\Lucene.Net.Core\Util\Fst\FST.cs:line 1077
   at Lucene.Net.Util.Fst.NodeHash`1.Hash(Int64 node) in z:\Builds\work\bcdbe6b8cc677a49\src\Lucene.Net.Core\Util\Fst\NodeHash.cs:line
108
   at Lucene.Net.Util.Fst.NodeHash`1.AddNew(Int64 address) in z:\Builds\work\bcdbe6b8cc677a49\src\Lucene.Net.Core\Util\Fst\NodeHash.cs:line
172
   at Lucene.Net.Util.Fst.NodeHash`1.Rehash() in z:\Builds\work\bcdbe6b8cc677a49\src\Lucene.Net.Core\Util\Fst\NodeHash.cs:line
198
   at Lucene.Net.Util.Fst.NodeHash`1.Add(UnCompiledNode`1 nodeIn) in z:\Builds\work\bcdbe6b8cc677a49\src\Lucene.Net.Core\Util\Fst\NodeHash.cs:line
154
   at Lucene.Net.Util.Fst.Builder`1.CompileNode(UnCompiledNode`1 nodeIn, Int32 tailLength)
in z:\Builds\work\bcdbe6b8cc677a49\src\Lucene.Net.Core\Util\Fst\Builder.cs:line 218
   at Lucene.Net.Util.Fst.Builder`1.DoFreezeTail(Int32 prefixLenPlus1) in z:\Builds\work\bcdbe6b8cc677a49\src\Lucene.Net.Core\Util\Fst\Builder.cs:line
329
   at Lucene.Net.Util.Fst.Builder`1.Finish() in z:\Builds\work\bcdbe6b8cc677a49\src\Lucene.Net.Core\Util\Fst\Builder.cs:line
518
   at Lucene.Net.Codecs.Lucene42.Lucene42DocValuesConsumer.WriteFST(FieldInfo field, IEnumerable`1
values) in z:\Builds\work\bcdbe6b8cc677a49\src\Lucene.Net.TestFramework\Codecs\lucene42\Lucene42DocValuesConsumer.cs:line
299
   at Lucene.Net.Codecs.Lucene42.Lucene42DocValuesConsumer.AddSortedField(FieldInfo field,
IEnumerable`1 values, IEnumerable`1 docToOrd) in z:\Builds\work\bcdbe6b8cc677a49\src\Lucene.Net.TestFramework\Codecs\lucene42\Lucene42DocValuesConsumer.cs:line
348
   at Lucene.Net.Codecs.Perfield.PerFieldDocValuesFormat.FieldsWriter.AddSortedField(FieldInfo
field, IEnumerable`1 values, IEnumerable`1 docToOrd) in z:\Builds\work\bcdbe6b8cc677a49\src\Lucene.Net.Core\Codecs\Perfield\PerFieldDocValuesFormat.cs:line
122
   at Lucene.Net.Index.SortedDocValuesWriter.Flush(SegmentWriteState state, DocValuesConsumer
dvConsumer) in z:\Builds\work\bcdbe6b8cc677a49\src\Lucene.Net.Core\Index\SortedDocValuesWriter.cs:line
125
   at Lucene.Net.Index.DocValuesProcessor.Flush(SegmentWriteState state) in z:\Builds\work\bcdbe6b8cc677a49\src\Lucene.Net.Core\Index\DocValuesProcessor.cs:line
99
   at Lucene.Net.Index.TwoStoredFieldsConsumers.Flush(SegmentWriteState state) in z:\Builds\work\bcdbe6b8cc677a49\src\Lucene.Net.Core\Index\TwoStoredFieldsConsumers.cs:line
45
   at Lucene.Net.Index.DocFieldProcessor.Flush(SegmentWriteState state) in z:\Builds\work\bcdbe6b8cc677a49\src\Lucene.Net.Core\Index\DocFieldProcessor.cs:line
81
   at Lucene.Net.Index.DocumentsWriterPerThread.Flush() in z:\Builds\work\bcdbe6b8cc677a49\src\Lucene.Net.Core\Index\DocumentsWriterPerThread.cs:line
550
   at Lucene.Net.Index.DocumentsWriter.DoFlush(DocumentsWriterPerThread flushingDWPT) in z:\Builds\work\bcdbe6b8cc677a49\src\Lucene.Net.Core\Index\DocumentsWriter.cs:line
635
   at Lucene.Net.Index.DocumentsWriter.FlushAllThreads(IndexWriter indexWriter) in z:\Builds\work\bcdbe6b8cc677a49\src\Lucene.Net.Core\Index\DocumentsWriter.cs:line
769
   at Lucene.Net.Index.IndexWriter.DoFlush(Boolean applyAllDeletes) in z:\Builds\work\bcdbe6b8cc677a49\src\Lucene.Net.Core\Index\IndexWriter.cs:line
3883
   at Lucene.Net.Index.IndexWriter.CloseInternal(Boolean waitForMerges, Boolean doFlush) in
z:\Builds\work\bcdbe6b8cc677a49\src\Lucene.Net.Core\Index\IndexWriter.cs:line 1178
   at Lucene.Net.Index.IndexWriter.Dispose(Boolean waitForMerges) in z:\Builds\work\bcdbe6b8cc677a49\src\Lucene.Net.Core\Index\IndexWriter.cs:line
1103
   at Lucene.Net.Index.RandomIndexWriter.Dispose() in z:\Builds\work\bcdbe6b8cc677a49\src\Lucene.Net.TestFramework\Index\RandomIndexWriter.cs:line
499
   at Lucene.Net.Index.BaseDocValuesFormatTestCase.TestVeryLargeButLegalSortedBytes() in z:\Builds\work\bcdbe6b8cc677a49\src\Lucene.Net.TestFramework\Index\BaseDocValuesFormatTestCase.cs:line
1027
Changes included (10 changes)
====================================================
Change dbeeb6c8b1de71c35d011cf1c6db6134d2d39b94 by chand (1 file):
Remove the debug statement I accidentally left in.


Change 6fc96d5aff1744fb0793884d1c69f8855bdcaf91 by chand (1 file):
Fix for TestSegmentsChecksumError()

Change to throw IOException instead of Exception. The code in FindSegmentsFile.Run expects
the reads to throw an IOException when the file is corrupt or in some other way invalid like
failing the crc32 check. Based on this exception type, the code will ignore the last segment
and continue. This is what the unit test is looking for.


Change e6b5b5e86b7cd005c98e78dba465edbfa01de502 by itamar (0 file):
Merge remote-tracking branch 'wwwb/long-running-tests2'


Change dd89c8b362f664a0976989bc67625fe49676fdf5 by itamar (0 file):
Merge remote-tracking branch 'wwwb/long-running-test-marking'


Change 3bbcce207e32b95a658e2300e4f4d289fa69a291 by itamar (0 file):
Merge remote-tracking branch 'wwwb/facet-test-fix2'


Change 4d5b50184dd6877d1fc7e1108db94fe43d7aa0ac by wyatt.barnett (6 files):
adding long running test flag to TestRandomUnicodeStrings (+4 squashed commit)

Squashed commit:

[8a98f37] Marking StressIndexing test long running

[8cd97a5] Marking TestPagedBytes long-running

[7994c25] changing TestRandomRegexps() that crashes vs when test runned.

[deab1e3] covering test intersect random (+3 squashed commit)

Squashed commit:

[7994c25] changing TestRandomRegexps() that crashes vs when test runned.

[deab1e3] covering test intersect random

[995b4cf] marking TestLookaheadTokenFilter (+1 squashed commits)

Squashed commits:

[995b4cf] marking TestLookaheadTokenFilter


Change 37e7601255645150227bd41ff825b05eca54e718 by wyatt.barnett (2 files):
also needed to fix Classification tests


Change 01e346566987bf26b62deaccfcbbd29c77fe2039 by wyatt.barnett (2 files):
removing unnecessary bindingredirects causing Facet tests to be unrunnable.


Change 77160d7420538130458cdd767245005a86a75331 by laimis (1 file):
set lock factory directly and not through setter


Change 8d48818fbf3fad2d26f552c7386f7b5666c6e2d4 by wyatt.barnett (10 files):
pulling out nightly attributes and pulling in LongRunningTest attributes.

Squashed commit:

[0906c1a] removing unused attribute.

[6ebe34b] don't need weekly.


see more information about changed files: http://teamcity.codebetter.com/viewLog.html?tab=buildChangesDiv&buildId=180789&buildTypeId=LuceneNet_Core

============================================================================
Configure email notifications: http://teamcity.codebetter.com/profile.html?init=1&tab=userNotifications

Mime
  • Unnamed multipart/alternative (inline, None, 0 bytes)
View raw message