lucenenet-dev mailing list archives

Site index · List index
Message view « Date » · « Thread »
Top « Date » · « Thread »
From t.@codebetter.com
Subject [TeamCity, FAILED] Build Lucene.NET :: Lucene.NET Core [master] #133
Date Sun, 01 Feb 2015 13:13:36 GMT
Build Lucene.NET :: Lucene.NET Core [master] #133 failed (Tests failed: 106 (16 new), passed:
2366, ignored: 112).
Agent: JetBrains-dotnet-agent01
Build results: http://teamcity.codebetter.com/viewLog.html?buildId=180236&buildTypeId=LuceneNet_Core

Failed Tests Summary:
Newly failed tests (16 tests, alphabetically ordered)
==================================================================
Lucene.Net.Tests.dll: Lucene.Net.Index.TestAddIndexes.TestAddIndexesWithRollback
Lucene.Net.Tests.dll: Lucene.Net.Index.TestAddIndexes.TestAddIndexesWithThreads
Lucene.Net.Tests.dll: Lucene.Net.Index.TestBinaryDocValuesUpdates.TestStressMultiThreading
Lucene.Net.Tests.dll: Lucene.Net.Index.TestForceMergeForever.Test
Lucene.Net.Tests.dll: Lucene.Net.Index.TestIndexWriterExceptions.TestExceptionDuringRollback
Lucene.Net.Tests.dll: Lucene.Net.Index.TestIndexWriterExceptions.TestRandomExceptionDuringRollback
Lucene.Net.Tests.dll: Lucene.Net.Index.TestStressNRT.Test
Lucene.Net.Tests.dll: Lucene.Net.Search.Spans.TestSpanExplanations.TestSF2
Lucene.Net.Tests.dll: Lucene.Net.Search.Spans.TestSpanExplanations.TestSF6
Lucene.Net.Tests.dll: Lucene.Net.Search.Spans.TestSpanExplanations.TestSNot2
Lucene.Net.Tests.dll: Lucene.Net.Search.Spans.TestSpanExplanations.TestSNot5
Lucene.Net.Tests.dll: Lucene.Net.Search.Spans.TestSpanExplanations.TestST2
Lucene.Net.Tests.dll: Lucene.Net.Search.Spans.TestSpanExplanations.TestST5
Lucene.Net.Tests.dll: Lucene.Net.Store.TestMockDirectoryWrapper.TestDiskFull
Lucene.Net.Tests.dll: Lucene.Net.Util.TestDocIdBitSet.BaseDocIdSetTestCase`1.TestAgainstBitSet
Lucene.Net.Tests.dll: Lucene.Net.Util.TestPagedBytes.TestDataInputOutput2

Other failed tests (90 tests, alphabetically ordered)
==================================================================
Lucene.Net.Tests.dll: Lucene.Net.Analysis.TestLookaheadTokenFilter.TestRandomStrings
Lucene.Net.Tests.dll: Lucene.Net.Analysis.TestMockAnalyzer.TestRandomRegexps
Lucene.Net.Tests.dll: Lucene.Net.Codecs.Lucene41.TestBlockPostingsFormat2
Lucene.Net.Tests.dll: Lucene.Net.Codecs.Lucene41.TestBlockPostingsFormat3.Test
Lucene.Net.Tests.dll: Lucene.Net.Codecs.Lucene42.TestLucene42DocValuesFormat.BaseDocValuesFormatTestCase.TestVeryLargeButLegalSortedBytes
Lucene.Net.Tests.dll: Lucene.Net.Index.TestAddIndexes.TestAddIndexMissingCodec
Lucene.Net.Tests.dll: Lucene.Net.Index.TestAtomicUpdate.TestAtomicUpdates
Lucene.Net.Tests.dll: Lucene.Net.Index.TestBinaryDocValuesUpdates.TestTonsOfUpdates
Lucene.Net.Tests.dll: Lucene.Net.Index.TestBinaryDocValuesUpdates.TestUpdateSegmentWithNoDocValues
Lucene.Net.Tests.dll: Lucene.Net.Index.TestBinaryDocValuesUpdates.TestUpdatesAndDeletes
Lucene.Net.Tests.dll: Lucene.Net.Index.TestCustomNorms.TestFloatNorms
Lucene.Net.Tests.dll: Lucene.Net.Index.TestDirectoryReader.TestNoDir
Lucene.Net.Tests.dll: Lucene.Net.Index.TestDocumentsWriterDeleteQueue.TestStressDeleteQueue
Lucene.Net.Tests.dll: Lucene.Net.Index.TestDocumentsWriterStallControl.TestSimpleStall
Lucene.Net.Tests.dll: Lucene.Net.Index.TestDuelingCodecs.TestEquals
Lucene.Net.Tests.dll: Lucene.Net.Index.TestFieldsReader.TestExceptions
Lucene.Net.Tests.dll: Lucene.Net.Index.TestFilterAtomicReader.TestOverrideMethods
Lucene.Net.Tests.dll: Lucene.Net.Index.TestIndexWriter.TestThreadInterruptDeadlock
Lucene.Net.Tests.dll: Lucene.Net.Index.TestIndexWriter.TestTwoThreadsInterruptDeadlock
Lucene.Net.Tests.dll: Lucene.Net.Index.TestIndexWriterConfig.TestSettersChaining
Lucene.Net.Tests.dll: Lucene.Net.Index.TestIndexWriterExceptions.TestDocumentsWriterAbort
Lucene.Net.Tests.dll: Lucene.Net.Index.TestIndexWriterExceptions.TestExceptionDuringSync
Lucene.Net.Tests.dll: Lucene.Net.Index.TestIndexWriterExceptions.TestExceptionOnMergeInit
Lucene.Net.Tests.dll: Lucene.Net.Index.TestIndexWriterExceptions.TestExceptionsDuringCommit
Lucene.Net.Tests.dll: Lucene.Net.Index.TestIndexWriterExceptions.TestSegmentsChecksumError
Lucene.Net.Tests.dll: Lucene.Net.Index.TestIndexWriterReader.TestDuringAddDelete
Lucene.Net.Tests.dll: Lucene.Net.Index.TestIndexWriterReader.TestDuringAddIndexes
Lucene.Net.Tests.dll: Lucene.Net.Index.TestIndexWriterReader.TestNRTOpenExceptions
Lucene.Net.Tests.dll: Lucene.Net.Index.TestIndexWriterUnicode.TestRandomUnicodeStrings
Lucene.Net.Tests.dll: Lucene.Net.Index.TestIndexWriterUnicode.TestTermUTF16SortOrder
Lucene.Net.Tests.dll: Lucene.Net.Index.TestIndexableField.TestArbitraryFields
Lucene.Net.Tests.dll: Lucene.Net.Index.TestLongPostings.TestLongPostingsNoPositions
Lucene.Net.Tests.dll: Lucene.Net.Index.TestLongPostings.TestLongPostings_Mem
Lucene.Net.Tests.dll: Lucene.Net.Index.TestMixedDocValuesUpdates.TestStressMultiThreading
Lucene.Net.Tests.dll: Lucene.Net.Index.TestMixedDocValuesUpdates.TestTonsOfUpdates
Lucene.Net.Tests.dll: Lucene.Net.Index.TestMultiLevelSkipList.TestSimpleSkip
Lucene.Net.Tests.dll: Lucene.Net.Index.TestNRTThreads.TestNRTThreads_Mem
Lucene.Net.Tests.dll: Lucene.Net.Index.TestNumericDocValuesUpdates.TestUpdatesOrder
Lucene.Net.Tests.dll: Lucene.Net.Index.TestParallelCompositeReader.TestToStringCompositeComposite
Lucene.Net.Tests.dll: Lucene.Net.Index.TestPersistentSnapshotDeletionPolicy.TestSnapshotDeletionPolicy.TestBasicSnapshots
Lucene.Net.Tests.dll: Lucene.Net.Index.TestPersistentSnapshotDeletionPolicy.TestSnapshotDeletionPolicy.TestRollbackToOldSnapshot
Lucene.Net.Tests.dll: Lucene.Net.Index.TestRollingUpdates.TestUpdateSameDoc
Lucene.Net.Tests.dll: Lucene.Net.Index.TestSegmentMerger.TestMerge
Lucene.Net.Tests.dll: Lucene.Net.Index.TestSegmentReader.TestDocument
Lucene.Net.Tests.dll: Lucene.Net.Index.TestSegmentTermDocs.TestIndexDivisor
Lucene.Net.Tests.dll: Lucene.Net.Index.TestSegmentTermDocs.TestTermDocs
Lucene.Net.Tests.dll: Lucene.Net.Index.TestSnapshotDeletionPolicy.TestRollbackToOldSnapshot
Lucene.Net.Tests.dll: Lucene.Net.Index.TestStressIndexing.TestStressIndexAndSearching
Lucene.Net.Tests.dll: Lucene.Net.Index.TestStressIndexing2.TestMultiConfig
Lucene.Net.Tests.dll: Lucene.Net.Index.TestTermdocPerf.TestTermDocPerf
Lucene.Net.Tests.dll: Lucene.Net.Index.TestTermsEnum.TestFloorBlocks
Lucene.Net.Tests.dll: Lucene.Net.Index.TestTermsEnum.TestRandomTerms
Lucene.Net.Tests.dll: Lucene.Net.Index.TestThreadedForceMerge.TestThreadedForceMerge_Mem
Lucene.Net.Tests.dll: Lucene.Net.Search.Payloads.TestPayloadNearQuery.Test
Lucene.Net.Tests.dll: Lucene.Net.Search.Payloads.TestPayloadNearQuery.TestAverageFunction
Lucene.Net.Tests.dll: Lucene.Net.Search.Payloads.TestPayloadNearQuery.TestComplexNested
Lucene.Net.Tests.dll: Lucene.Net.Search.Payloads.TestPayloadNearQuery.TestLongerSpan
Lucene.Net.Tests.dll: Lucene.Net.Search.Payloads.TestPayloadNearQuery.TestMaxFunction
Lucene.Net.Tests.dll: Lucene.Net.Search.Payloads.TestPayloadNearQuery.TestMinFunction
Lucene.Net.Tests.dll: Lucene.Net.Search.Payloads.TestPayloadNearQuery.TestPayloadNear
Lucene.Net.Tests.dll: Lucene.Net.Search.Spans.TestSpanMultiTermQueryWrapper.TestFuzzy2
Lucene.Net.Tests.dll: Lucene.Net.Search.TestAutomatonQuery.TestRewritePrefix
Lucene.Net.Tests.dll: Lucene.Net.Search.TestConstantScoreQuery.TestQueryWrapperFilter
Lucene.Net.Tests.dll: Lucene.Net.Search.TestFuzzyQuery.TestFuzziness
Lucene.Net.Tests.dll: Lucene.Net.Search.TestFuzzyQuery.TestTieBreaker
Lucene.Net.Tests.dll: Lucene.Net.Search.TestMultiPhraseQuery.TestMultiSloppyWithRepeats
Lucene.Net.Tests.dll: Lucene.Net.Search.TestNumericRangeQuery32.TestInfiniteValues
Lucene.Net.Tests.dll: Lucene.Net.Search.TestNumericRangeQuery64.TestInfiniteValues
Lucene.Net.Tests.dll: Lucene.Net.Search.TestRegexpQuery.TestBacktracking
Lucene.Net.Tests.dll: Lucene.Net.Search.TestRegexpQuery.TestRegexComplement
Lucene.Net.Tests.dll: Lucene.Net.Search.TestRegexpRandom.TestRegexps
Lucene.Net.Tests.dll: Lucene.Net.Search.TestSearchAfter.TestQueries
Lucene.Net.Tests.dll: Lucene.Net.Search.TestSearcherManager.TestSearcherManager_Mem
Lucene.Net.Tests.dll: Lucene.Net.Search.TestSimpleExplanations.TestDMQ8
Lucene.Net.Tests.dll: Lucene.Net.Search.TestSubScorerFreqs.TestBooleanQuery
Lucene.Net.Tests.dll: Lucene.Net.Search.TestTermVectors
Lucene.Net.Tests.dll: Lucene.Net.Search.TestTermVectors.TestMixedVectrosVectors
Lucene.Net.Tests.dll: Lucene.Net.Search.TestWildcard.TestPrefixTerm
Lucene.Net.Tests.dll: Lucene.Net.Search.TestWildcardRandom.TestWildcards
Lucene.Net.Tests.dll: Lucene.Net.Store.TestBufferedIndexInput.TestSetBufferSize
Lucene.Net.Tests.dll: Lucene.Net.Store.TestFileSwitchDirectory.TestNoDir
Lucene.Net.Tests.dll: Lucene.Net.Store.TestNRTCachingDirectory.TestNoDir
Lucene.Net.Tests.dll: Lucene.Net.Tests.TestAssertions.TestTokenStreams
Lucene.Net.Tests.dll: Lucene.Net.Util.Packed.TestEliasFanoSequence.TestMonotoneSequences



Newly failed tests details (only first 3 failures shown here)
==================================================================
Lucene.Net.Tests.dll: Lucene.Net.Index.TestAddIndexes.TestAddIndexesWithRollback (new) =================
Test(s) failed.   Expected: True
  But was:  False

   at NUnit.Framework.Assert.That(Object actual, IResolveConstraint expression, String message,
Object[] args)
   at NUnit.Framework.Assert.IsTrue(Boolean condition)
   at Lucene.Net.Index.TestAddIndexes.TestAddIndexesWithRollback() in z:\Builds\work\bcdbe6b8cc677a49\src\Lucene.Net.Tests\core\Index\TestAddIndexes.cs:line
1032
------- Stderr: -------
   at System.Collections.Generic.Dictionary`2.Insert(TKey key, TValue value, Boolean add)
   at System.Collections.Generic.Dictionary`2.set_Item(TKey key, TValue value)
   at Lucene.Net.Index.IndexWriter.ForceMerge(Int32 maxNumSegments, Boolean doWait) in z:\Builds\work\bcdbe6b8cc677a49\src\Lucene.Net.Core\Index\IndexWriter.cs:line
2147
   at Lucene.Net.Index.IndexWriter.ForceMerge(Int32 maxNumSegments) in z:\Builds\work\bcdbe6b8cc677a49\src\Lucene.Net.Core\Index\IndexWriter.cs:line
2101
   at Lucene.Net.Index.TestAddIndexes.CommitAndAddIndexes3.DoBody(Int32 j, Directory[] dirs)
in z:\Builds\work\bcdbe6b8cc677a49\src\Lucene.Net.Tests\core\Index\TestAddIndexes.cs:line
914
   at Lucene.Net.Index.TestAddIndexes.RunAddIndexesThreads.ThreadAnonymousInnerClassHelper.Run()
in z:\Builds\work\bcdbe6b8cc677a49\src\Lucene.Net.Tests\core\Index\TestAddIndexes.cs:line
713
Lucene.Net.Tests.dll: Lucene.Net.Index.TestAddIndexes.TestAddIndexesWithThreads (new) =================
Test(s) failed.   expected num docs don't match - failures: 
System.ArgumentNullException: Value cannot be null.
Parameter name: key
   at System.Collections.Generic.Dictionary`2.Insert(TKey key, TValue value, Boolean add)
   at System.Collections.Generic.Dictionary`2.set_Item(TKey key, TValue value)
   at Lucene.Net.Index.IndexWriter.ForceMerge(Int32 maxNumSegments, Boolean doWait) in z:\Builds\work\bcdbe6b8cc677a49\src\Lucene.Net.Core\Index\IndexWriter.cs:line
2147
   at Lucene.Net.Index.IndexWriter.ForceMerge(Int32 maxNumSegments) in z:\Builds\work\bcdbe6b8cc677a49\src\Lucene.Net.Core\Index\IndexWriter.cs:line
2101
   at Lucene.Net.Index.TestAddIndexes.CommitAndAddIndexes.DoBody(Int32 j, Directory[] dirs)
in z:\Builds\work\bcdbe6b8cc677a49\src\Lucene.Net.Tests\core\Index\TestAddIndexes.cs:line
780
   at Lucene.Net.Index.TestAddIndexes.RunAddIndexesThreads.ThreadAnonymousInnerClassHelper.Run()
in z:\Builds\work\bcdbe6b8cc677a49\src\Lucene.Net.Tests\core\Index\TestAddIndexes.cs:line
713
System.ArgumentNullException: Value cannot be null.
Parameter name: key
   at System.Collections.Generic.Dictionary`2.Insert(TKey key, TValue value, Boolean add)
   at System.Collections.Generic.Dictionary`2.set_Item(TKey key, TValue value)
   at Lucene.Net.Index.IndexWriter.ForceMerge(Int32 maxNumSegments, Boolean doWait) in z:\Builds\work\bcdbe6b8cc677a49\src\Lucene.Net.Core\Index\IndexWriter.cs:line
2147
   at Lucene.Net.Index.IndexWriter.ForceMerge(Int32 maxNumSegments) in z:\Builds\work\bcdbe6b8cc677a49\src\Lucene.Net.Core\Index\IndexWriter.cs:line
2101
   at Lucene.Net.Index.TestAddIndexes.CommitAndAddIndexes.DoBody(Int32 j, Directory[] dirs)
in z:\Builds\work\bcdbe6b8cc677a49\src\Lucene.Net.Tests\core\Index\TestAddIndexes.cs:line
780
   at Lucene.Net.Index.TestAddIndexes.RunAddIndexesThreads.ThreadAnonymousInnerClassHelper.Run()
in z:\Builds\work\bcdbe6b8cc677a49\src\Lucene.Net.Tests\core\Index\TestAddIndexes.cs:line
713
System.ArgumentNullException: Value cannot be null.
Parameter name: key
   at System.Collections.Generic.Dictionary`2.Insert(TKey key, TValue value, Boolean add)
   at System.Collections.Generic.Dictionary`2.set_Item(TKey key, TValue value)
   at Lucene.Net.Index.IndexWriter.ForceMerge(Int32 maxNumSegments, Boolean doWait) in z:\Builds\work\bcdbe6b8cc677a49\src\Lucene.Net.Core\Index\IndexWriter.cs:line
2153
   at Lucene.Net.Index.IndexWriter.ForceMerge(Int32 maxNumSegments) in z:\Builds\work\bcdbe6b8cc677a49\src\Lucene.Net.Core\Index\IndexWriter.cs:line
2101
   at Lucene.Net.Index.TestAddIndexes.CommitAndAddIndexes.DoBody(Int32 j, Directory[] dirs)
in z:\Builds\work\bcdbe6b8cc677a49\src\Lucene.Net.Tests\core\Index\TestAddIndexes.cs:line
780
   at Lucene.Net.Index.TestAddIndexes.RunAddIndexesThreads.ThreadAnonymousInnerClassHelper.Run()
in z:\Builds\work\bcdbe6b8cc677a49\src\Lucene.Net.Tests\core\Index\TestAddIndexes.cs:line
713
  Expected: 1120
  But was:  661

   at NUnit.Framework.Assert.That(Object actual, IResolveConstraint expression, String message,
Object[] args)
   at NUnit.Framework.Assert.AreEqual(Int32 expected, Int32 actual, String message)
   at Lucene.Net.Index.TestAddIndexes.TestAddIndexesWithThreads() in z:\Builds\work\bcdbe6b8cc677a49\src\Lucene.Net.Tests\core\Index\TestAddIndexes.cs:line
837
------- Stdout: -------
   at System.Collections.Generic.Dictionary`2.Insert(TKey key, TValue value, Boolean add)
   at System.Collections.Generic.Dictionary`2.set_Item(TKey key, TValue value)
   at Lucene.Net.Index.IndexWriter.ForceMerge(Int32 maxNumSegments, Boolean doWait) in z:\Builds\work\bcdbe6b8cc677a49\src\Lucene.Net.Core\Index\IndexWriter.cs:line
2147
   at Lucene.Net.Index.IndexWriter.ForceMerge(Int32 maxNumSegments) in z:\Builds\work\bcdbe6b8cc677a49\src\Lucene.Net.Core\Index\IndexWriter.cs:line
2101
   at Lucene.Net.Index.TestAddIndexes.CommitAndAddIndexes.DoBody(Int32 j, Directory[] dirs)
in z:\Builds\work\bcdbe6b8cc677a49\src\Lucene.Net.Tests\core\Index\TestAddIndexes.cs:line
780
   at Lucene.Net.Index.TestAddIndexes.RunAddIndexesThreads.ThreadAnonymousInnerClassHelper.Run()
in z:\Builds\work\bcdbe6b8cc677a49\src\Lucene.Net.Tests\core\Index\TestAddIndexes.cs:line
713
   at System.Collections.Generic.Dictionary`2.Insert(TKey key, TValue value, Boolean add)
   at System.Collections.Generic.Dictionary`2.set_Item(TKey key, TValue value)
   at Lucene.Net.Index.IndexWriter.ForceMerge(Int32 maxNumSegments, Boolean doWait) in z:\Builds\work\bcdbe6b8cc677a49\src\Lucene.Net.Core\Index\IndexWriter.cs:line
2147
   at Lucene.Net.Index.IndexWriter.ForceMerge(Int32 maxNumSegments) in z:\Builds\work\bcdbe6b8cc677a49\src\Lucene.Net.Core\Index\IndexWriter.cs:line
2101
   at Lucene.Net.Index.TestAddIndexes.CommitAndAddIndexes.DoBody(Int32 j, Directory[] dirs)
in z:\Builds\work\bcdbe6b8cc677a49\src\Lucene.Net.Tests\core\Index\TestAddIndexes.cs:line
780
   at Lucene.Net.Index.TestAddIndexes.RunAddIndexesThreads.ThreadAnonymousInnerClassHelper.Run()
in z:\Builds\work\bcdbe6b8cc677a49\src\Lucene.Net.Tests\core\Index\TestAddIndexes.cs:line
713
   at System.Collections.Generic.Dictionary`2.Insert(TKey key, TValue value, Boolean add)
   at System.Collections.Generic.Dictionary`2.set_Item(TKey key, TValue value)
   at Lucene.Net.Index.IndexWriter.ForceMerge(Int32 maxNumSegments, Boolean doWait) in z:\Builds\work\bcdbe6b8cc677a49\src\Lucene.Net.Core\Index\IndexWriter.cs:line
2153
   at Lucene.Net.Index.IndexWriter.ForceMerge(Int32 maxNumSegments) in z:\Builds\work\bcdbe6b8cc677a49\src\Lucene.Net.Core\Index\IndexWriter.cs:line
2101
   at Lucene.Net.Index.TestAddIndexes.CommitAndAddIndexes.DoBody(Int32 j, Directory[] dirs)
in z:\Builds\work\bcdbe6b8cc677a49\src\Lucene.Net.Tests\core\Index\TestAddIndexes.cs:line
780
   at Lucene.Net.Index.TestAddIndexes.RunAddIndexesThreads.ThreadAnonymousInnerClassHelper.Run()
in z:\Builds\work\bcdbe6b8cc677a49\src\Lucene.Net.Tests\core\Index\TestAddIndexes.cs:line
713
Lucene.Net.Tests.dll: Lucene.Net.Index.TestBinaryDocValuesUpdates.TestStressMultiThreading
(new) =================
Test(s) failed.   Expected: False
  But was:  True

   at NUnit.Framework.Assert.That(Object actual, IResolveConstraint expression, String message,
Object[] args)
   at NUnit.Framework.Assert.AreEqual(Object expected, Object actual)
   at Lucene.Net.Index.TestBinaryDocValuesUpdates.TestStressMultiThreading() in z:\Builds\work\bcdbe6b8cc677a49\src\Lucene.Net.Tests\core\Index\TestBinaryDocValuesUpdates.cs:line
1224
see all newly failed tests: http://teamcity.codebetter.com/viewLog.html?buildId=180236&buildTypeId=LuceneNet_Core



Other failed tests details (only first 3 failures shown here)
==================================================================
Lucene.Net.Tests.dll: Lucene.Net.Analysis.TestLookaheadTokenFilter.TestRandomStrings =================
Test(s) failed. Test exceeded Timeout value of 20000ms

Lucene.Net.Tests.dll: Lucene.Net.Analysis.TestMockAnalyzer.TestRandomRegexps =================
Test(s) failed. Test exceeded Timeout value of 20000ms

Lucene.Net.Tests.dll: Lucene.Net.Codecs.Lucene41.TestBlockPostingsFormat2 =================
TearDown method failed. CheckIndex failed
   at Lucene.Net.Util.TestUtil.CheckIndex(Directory dir, Boolean crossCheckTermVectors) in
z:\Builds\work\bcdbe6b8cc677a49\src\Lucene.Net.TestFramework\Util\TestUtil.cs:line 257
   at Lucene.Net.Codecs.Lucene41.TestBlockPostingsFormat2.TearDown() in z:\Builds\work\bcdbe6b8cc677a49\src\Lucene.Net.Tests\core\Codecs\Lucene41\TestBlockPostingsFormat2.cs:line
65
Changes included (2 changes)
====================================================
Change 7e134f196d03c0d6e485e3eb57a088b52ff8a281 by itamar (1 file):
Fixing compilation


Change bef6b9d043d606181b993f46be2fa3f1488fa769 by itamar (6 files):
More cleanup


see more information about changed files: http://teamcity.codebetter.com/viewLog.html?tab=buildChangesDiv&buildId=180236&buildTypeId=LuceneNet_Core

============================================================================
Configure email notifications: http://teamcity.codebetter.com/profile.html?init=1&tab=userNotifications

Mime
  • Unnamed multipart/alternative (inline, None, 0 bytes)
View raw message