lucenenet-dev mailing list archives

Site index · List index
Message view « Date » · « Thread »
Top « Date » · « Thread »
From t.@codebetter.com
Subject [TeamCity, FAILED] Build Lucene.NET :: Lucene.NET Core [master] #180
Date Fri, 06 Feb 2015 15:51:00 GMT
Build Lucene.NET :: Lucene.NET Core [master] #180 failed (Tests failed: 65 (6 new), passed:
2393, ignored: 110).
Agent: JetBrains-dotnet-agent01
Build results: http://teamcity.codebetter.com/viewLog.html?buildId=180872&buildTypeId=LuceneNet_Core

Failed Tests Summary:
Newly failed tests (6 tests, alphabetically ordered)
==================================================================
Lucene.Net.Tests.dll: Lucene.Net.Index.TestCodecs.TestRandomPostings
Lucene.Net.Tests.dll: Lucene.Net.Index.TestIndexWriterExceptions.TestRandomExceptionDuringRollback
Lucene.Net.Tests.dll: Lucene.Net.Index.TestIndexableField.TestArbitraryFields
Lucene.Net.Tests.dll: Lucene.Net.Index.TestNumericDocValuesUpdates.TestManyReopensAndFields
Lucene.Net.Tests.dll: Lucene.Net.Index.TestStressIndexing2.TestMultiConfig
Lucene.Net.Tests.dll: Lucene.Net.Search.TestSearchAfter.TestQueries

Other failed tests (59 tests, alphabetically ordered)
==================================================================
Lucene.Net.Tests.dll: Lucene.Net.Codecs.Lucene41.TestBlockPostingsFormat2
Lucene.Net.Tests.dll: Lucene.Net.Codecs.Lucene41.TestBlockPostingsFormat3.Test
Lucene.Net.Tests.dll: Lucene.Net.Codecs.Lucene42.TestLucene42DocValuesFormat.BaseDocValuesFormatTestCase.TestVeryLargeButLegalSortedBytes
Lucene.Net.Tests.dll: Lucene.Net.Index.TestAddIndexes.TestAddIndexMissingCodec
Lucene.Net.Tests.dll: Lucene.Net.Index.TestAtomicUpdate.TestAtomicUpdates
Lucene.Net.Tests.dll: Lucene.Net.Index.TestCustomNorms.TestFloatNorms
Lucene.Net.Tests.dll: Lucene.Net.Index.TestDirectoryReader.TestNoDir
Lucene.Net.Tests.dll: Lucene.Net.Index.TestDocumentsWriterStallControl.TestSimpleStall
Lucene.Net.Tests.dll: Lucene.Net.Index.TestDuelingCodecs.TestEquals
Lucene.Net.Tests.dll: Lucene.Net.Index.TestIndexWriter.TestThreadInterruptDeadlock
Lucene.Net.Tests.dll: Lucene.Net.Index.TestIndexWriter.TestTwoThreadsInterruptDeadlock
Lucene.Net.Tests.dll: Lucene.Net.Index.TestIndexWriterExceptions.TestExceptionOnMergeInit
Lucene.Net.Tests.dll: Lucene.Net.Index.TestIndexWriterReader.TestDuringAddDelete
Lucene.Net.Tests.dll: Lucene.Net.Index.TestIndexWriterReader.TestDuringAddIndexes
Lucene.Net.Tests.dll: Lucene.Net.Index.TestIndexWriterReader.TestNRTOpenExceptions
Lucene.Net.Tests.dll: Lucene.Net.Index.TestLongPostings.TestLongPostingsNoPositions
Lucene.Net.Tests.dll: Lucene.Net.Index.TestNRTThreads.TestNRTThreads_Mem
Lucene.Net.Tests.dll: Lucene.Net.Index.TestParallelCompositeReader.TestToStringCompositeComposite
Lucene.Net.Tests.dll: Lucene.Net.Index.TestPersistentSnapshotDeletionPolicy.TestSnapshotDeletionPolicy.TestBasicSnapshots
Lucene.Net.Tests.dll: Lucene.Net.Index.TestPersistentSnapshotDeletionPolicy.TestSnapshotDeletionPolicy.TestRollbackToOldSnapshot
Lucene.Net.Tests.dll: Lucene.Net.Index.TestSegmentMerger.TestMerge
Lucene.Net.Tests.dll: Lucene.Net.Index.TestSegmentReader.TestDocument
Lucene.Net.Tests.dll: Lucene.Net.Index.TestSegmentTermDocs.TestIndexDivisor
Lucene.Net.Tests.dll: Lucene.Net.Index.TestSegmentTermDocs.TestTermDocs
Lucene.Net.Tests.dll: Lucene.Net.Index.TestSnapshotDeletionPolicy.TestRollbackToOldSnapshot
Lucene.Net.Tests.dll: Lucene.Net.Index.TestStressNRT.Test
Lucene.Net.Tests.dll: Lucene.Net.Index.TestTermdocPerf.TestTermDocPerf
Lucene.Net.Tests.dll: Lucene.Net.Index.TestTermsEnum.TestFloorBlocks
Lucene.Net.Tests.dll: Lucene.Net.Index.TestTermsEnum.TestRandomTerms
Lucene.Net.Tests.dll: Lucene.Net.Index.TestTransactions.TestTransactions_Mem
Lucene.Net.Tests.dll: Lucene.Net.Search.Payloads.TestPayloadNearQuery.Test
Lucene.Net.Tests.dll: Lucene.Net.Search.Payloads.TestPayloadNearQuery.TestAverageFunction
Lucene.Net.Tests.dll: Lucene.Net.Search.Payloads.TestPayloadNearQuery.TestComplexNested
Lucene.Net.Tests.dll: Lucene.Net.Search.Payloads.TestPayloadNearQuery.TestLongerSpan
Lucene.Net.Tests.dll: Lucene.Net.Search.Payloads.TestPayloadNearQuery.TestMaxFunction
Lucene.Net.Tests.dll: Lucene.Net.Search.Payloads.TestPayloadNearQuery.TestMinFunction
Lucene.Net.Tests.dll: Lucene.Net.Search.Payloads.TestPayloadNearQuery.TestPayloadNear
Lucene.Net.Tests.dll: Lucene.Net.Search.Spans.TestSpanMultiTermQueryWrapper.TestFuzzy2
Lucene.Net.Tests.dll: Lucene.Net.Search.TestAutomatonQuery.TestRewritePrefix
Lucene.Net.Tests.dll: Lucene.Net.Search.TestFuzzyQuery.TestFuzziness
Lucene.Net.Tests.dll: Lucene.Net.Search.TestFuzzyQuery.TestTieBreaker
Lucene.Net.Tests.dll: Lucene.Net.Search.TestMultiPhraseQuery.TestMultiSloppyWithRepeats
Lucene.Net.Tests.dll: Lucene.Net.Search.TestNumericRangeQuery32.TestInfiniteValues
Lucene.Net.Tests.dll: Lucene.Net.Search.TestNumericRangeQuery64.TestInfiniteValues
Lucene.Net.Tests.dll: Lucene.Net.Search.TestRegexpQuery.TestBacktracking
Lucene.Net.Tests.dll: Lucene.Net.Search.TestRegexpQuery.TestRegexComplement
Lucene.Net.Tests.dll: Lucene.Net.Search.TestRegexpRandom.TestRegexps
Lucene.Net.Tests.dll: Lucene.Net.Search.TestSearcherManager.TestSearcherManager_Mem
Lucene.Net.Tests.dll: Lucene.Net.Search.TestSimpleExplanations.TestDMQ8
Lucene.Net.Tests.dll: Lucene.Net.Search.TestTermVectors
Lucene.Net.Tests.dll: Lucene.Net.Search.TestTermVectors.TestMixedVectrosVectors
Lucene.Net.Tests.dll: Lucene.Net.Search.TestWildcard.TestPrefixTerm
Lucene.Net.Tests.dll: Lucene.Net.Search.TestWildcardRandom.TestWildcards
Lucene.Net.Tests.dll: Lucene.Net.Store.TestBufferedIndexInput.TestSetBufferSize
Lucene.Net.Tests.dll: Lucene.Net.Store.TestFileSwitchDirectory.TestNoDir
Lucene.Net.Tests.dll: Lucene.Net.Store.TestNRTCachingDirectory.TestNoDir
Lucene.Net.Tests.dll: Lucene.Net.Tests.TestAssertions.TestTokenStreams
Lucene.Net.Tests.dll: Lucene.Net.Util.Packed.TestEliasFanoSequence.TestMonotoneSequences
Lucene.Net.Tests.dll: Lucene.Net.Util.TestIndexableBinaryStringTools.TestEncodedSortability



Newly failed tests details (only first 3 failures shown here)
==================================================================
Lucene.Net.Tests.dll: Lucene.Net.Index.TestCodecs.TestRandomPostings (new) =================
TearDown method failed. System.Exception :   Expected: 227
  But was:  2589

  ----> NUnit.Framework.AssertionException :   Expected: 227
  But was:  2589

TearDown : System.IO.IOException : The process cannot access the file '0_Lucene41_0.doc' because
it is being used by another process.
   at Lucene.Net.Index.TestCodecs.Verify.Run() in z:\Builds\work\bcdbe6b8cc677a49\src\Lucene.Net.Tests\core\Index\TestCodecs.cs:line
582
   at Lucene.Net.Index.TestCodecs.TestRandomPostings() in z:\Builds\work\bcdbe6b8cc677a49\src\Lucene.Net.Tests\core\Index\TestCodecs.cs:line
479
--AssertionException
   at NUnit.Framework.Assert.That(Object actual, IResolveConstraint expression, String message,
Object[] args)
   at NUnit.Framework.Assert.AreEqual(Int32 expected, Int32 actual)
   at Lucene.Net.Index.TestCodecs.Verify._run() in z:\Builds\work\bcdbe6b8cc677a49\src\Lucene.Net.Tests\core\Index\TestCodecs.cs:line
714
   at Lucene.Net.Index.TestCodecs.Verify.Run() in z:\Builds\work\bcdbe6b8cc677a49\src\Lucene.Net.Tests\core\Index\TestCodecs.cs:line
577
--TearDown
   at System.IO.Directory.DeleteHelper(String fullPath, String userPath, Boolean recursive,
Boolean throwOnTopLevelDirectoryNotFound)
   at System.IO.Directory.Delete(String fullPath, String userPath, Boolean recursive, Boolean
checkHost)
   at Lucene.Net.Util.LuceneTestCase.CleanupTemporaryFiles() in z:\Builds\work\bcdbe6b8cc677a49\src\Lucene.Net.TestFramework\Util\LuceneTestCase.cs:line
2659
   at Lucene.Net.Util.LuceneTestCase.TearDown() in z:\Builds\work\bcdbe6b8cc677a49\src\Lucene.Net.TestFramework\Util\LuceneTestCase.cs:line
581
------- Stderr: -------
Unhandled exception in remote appdomain: System.Exception: read past EOF: NIOFSIndexInput(path="Z:\Builds\temp\buildTmp\LuceneTemp\index-NIOFSDirectory-1\0_Lucene41_0.tim")
---> System.IO.EndOfStreamException: read past EOF: NIOFSIndexInput(path="Z:\Builds\temp\buildTmp\LuceneTemp\index-NIOFSDirectory-1\0_Lucene41_0.tim")
   at Lucene.Net.Store.BufferedIndexInput.ReadBytes(Byte[] b, Int32 offset, Int32 len, Boolean
useBuffer) in z:\Builds\work\bcdbe6b8cc677a49\src\Lucene.Net.Core\Store\BufferedIndexInput.cs:line
192
   at Lucene.Net.Store.BufferedIndexInput.ReadBytes(Byte[] b, Int32 offset, Int32 len) in
z:\Builds\work\bcdbe6b8cc677a49\src\Lucene.Net.Core\Store\BufferedIndexInput.cs:line 136
   at Lucene.Net.Store.MockIndexInputWrapper.ReadBytes(Byte[] b, Int32 offset, Int32 len)
in z:\Builds\work\bcdbe6b8cc677a49\src\Lucene.Net.TestFramework\Store\MockIndexInputWrapper.cs:line
134
   at Lucene.Net.Codecs.BlockTreeTermsReader.FieldReader.SegmentTermsEnum.Frame.LoadBlock()
in z:\Builds\work\bcdbe6b8cc677a49\src\Lucene.Net.Core\Codecs\BlockTreeTermsReader.cs:line
2819
   at Lucene.Net.Codecs.BlockTreeTermsReader.FieldReader.SegmentTermsEnum.Next() in z:\Builds\work\bcdbe6b8cc677a49\src\Lucene.Net.Core\Codecs\BlockTreeTermsReader.cs:line
2484
   at Lucene.Net.Index.TestCodecs.Verify._run() in z:\Builds\work\bcdbe6b8cc677a49\src\Lucene.Net.Tests\core\Index\TestCodecs.cs:line
642
   at Lucene.Net.Index.TestCodecs.Verify.Run() in z:\Builds\work\bcdbe6b8cc677a49\src\Lucene.Net.Tests\core\Index\TestCodecs.cs:line
577
   --- End of inner exception stack trace ---
   at Lucene.Net.Index.TestCodecs.Verify.Run() in z:\Builds\work\bcdbe6b8cc677a49\src\Lucene.Net.Tests\core\Index\TestCodecs.cs:line
582
   at System.Threading.ThreadHelper.ThreadStart_Context(Object state)
   at System.Threading.ExecutionContext.RunInternal(ExecutionContext executionContext, ContextCallback
callback, Object state, Boolean preserveSyncCtx)
   at System.Threading.ExecutionContext.Run(ExecutionContext executionContext, ContextCallback
callback, Object state, Boolean preserveSyncCtx)
   at System.Threading.ExecutionContext.Run(ExecutionContext executionContext, ContextCallback
callback, Object state)
   at System.Threading.ThreadHelper.ThreadStart()
Unhandled exception in remote appdomain: System.Exception: read past EOF: NIOFSIndexInput(path="Z:\Builds\temp\buildTmp\LuceneTemp\index-NIOFSDirectory-1\0_Lucene41_0.tim")
---> System.IO.EndOfStreamException: read past EOF: NIOFSIndexInput(path="Z:\Builds\temp\buildTmp\LuceneTemp\index-NIOFSDirectory-1\0_Lucene41_0.tim")
   at Lucene.Net.Store.BufferedIndexInput.ReadBytes(Byte[] b, Int32 offset, Int32 len, Boolean
useBuffer) in z:\Builds\work\bcdbe6b8cc677a49\src\Lucene.Net.Core\Store\BufferedIndexInput.cs:line
192
   at Lucene.Net.Store.BufferedIndexInput.ReadBytes(Byte[] b, Int32 offset, Int32 len) in
z:\Builds\work\bcdbe6b8cc677a49\src\Lucene.Net.Core\Store\BufferedIndexInput.cs:line 136
   at Lucene.Net.Store.MockIndexInputWrapper.ReadBytes(Byte[] b, Int32 offset, Int32 len)
in z:\Builds\work\bcdbe6b8cc677a49\src\Lucene.Net.TestFramework\Store\MockIndexInputWrapper.cs:line
134
   at Lucene.Net.Codecs.BlockTreeTermsReader.FieldReader.SegmentTermsEnum.Frame.LoadBlock()
in z:\Builds\work\bcdbe6b8cc677a49\src\Lucene.Net.Core\Codecs\BlockTreeTermsReader.cs:line
2819
   at Lucene.Net.Codecs.BlockTreeTermsReader.FieldReader.SegmentTermsEnum.SeekCeil(BytesRef
target) in z:\Builds\work\bcdbe6b8cc677a49\src\Lucene.Net.Core\Codecs\BlockTreeTermsReader.cs:line
2308
   at Lucene.Net.Index.TestCodecs.Verify._run() in z:\Builds\work\bcdbe6b8cc677a49\src\Lucene.Net.Tests\core\Index\TestCodecs.cs:line
702
   at Lucene.Net.Index.TestCodecs.Verify.Run() in z:\Builds\work\bcdbe6b8cc677a49\src\Lucene.Net.Tests\core\Index\TestCodecs.cs:line
577
   --- End of inner exception stack trace ---
   at Lucene.Net.Index.TestCodecs.Verify.Run() in z:\Builds\work\bcdbe6b8cc677a49\src\Lucene.Net.Tests\core\Index\TestCodecs.cs:line
582
   at System.Threading.ThreadHelper.ThreadStart_Context(Object state)
   at System.Threading.ExecutionContext.RunInternal(ExecutionContext executionContext, ContextCallback
callback, Object state, Boolean preserveSyncCtx)
   at System.Threading.ExecutionContext.Run(ExecutionContext executionContext, ContextCallback
callback, Object state, Boolean preserveSyncCtx)
   at System.Threading.ExecutionContext.Run(ExecutionContext executionContext, ContextCallback
callback, Object state)
   at System.Threading.ThreadHelper.ThreadStart()
Lucene.Net.Tests.dll: Lucene.Net.Index.TestIndexableField.TestArbitraryFields (new) =================
Test(s) failed.   Expected: -128
  But was:  128

   at NUnit.Framework.Assert.That(Object actual, IResolveConstraint expression, String message,
Object[] args)
   at NUnit.Framework.Assert.AreEqual(Int32 expected, Int32 actual)
   at Lucene.Net.Index.TestIndexableField.TestArbitraryFields() in z:\Builds\work\bcdbe6b8cc677a49\src\Lucene.Net.Tests\core\Index\TestIndexableField.cs:line
310
Lucene.Net.Tests.dll: Lucene.Net.Index.TestIndexWriterExceptions.TestRandomExceptionDuringRollback
(new) =================
Test(s) failed. System.Exception : CheckIndex failed
   at Lucene.Net.Util.TestUtil.CheckIndex(Directory dir, Boolean crossCheckTermVectors) in
z:\Builds\work\bcdbe6b8cc677a49\src\Lucene.Net.TestFramework\Util\TestUtil.cs:line 257
   at Lucene.Net.Store.MockDirectoryWrapper.Dispose() in z:\Builds\work\bcdbe6b8cc677a49\src\Lucene.Net.TestFramework\Store\MockDirectoryWrapper.cs:line
943
   at Lucene.Net.Index.TestIndexWriterExceptions.TestRandomExceptionDuringRollback() in z:\Builds\work\bcdbe6b8cc677a49\src\Lucene.Net.Tests\core\Index\TestIndexWriterExceptions.cs:line
2563
------- Stderr: -------
CheckIndex failed
´╗┐ERROR: could not read any segments file in directory
   at Lucene.Net.Index.SegmentInfos.Read(Directory directory, String segmentFileName) in z:\Builds\work\bcdbe6b8cc677a49\src\Lucene.Net.Core\Index\SegmentInfos.cs:line
438
   at Lucene.Net.Index.SegmentInfos.FindSegmentsFileAnonymousInnerClassHelper.DoBody(String
segmentFileName) in z:\Builds\work\bcdbe6b8cc677a49\src\Lucene.Net.Core\Index\SegmentInfos.cs:line
487
   at Lucene.Net.Index.SegmentInfos.FindSegmentsFile.Run(IndexCommit commit) in z:\Builds\work\bcdbe6b8cc677a49\src\Lucene.Net.Core\Index\SegmentInfos.cs:line
1031
   at Lucene.Net.Index.SegmentInfos.FindSegmentsFile.Run() in z:\Builds\work\bcdbe6b8cc677a49\src\Lucene.Net.Core\Index\SegmentInfos.cs:line
838
   at Lucene.Net.Index.SegmentInfos.Read(Directory directory) in z:\Builds\work\bcdbe6b8cc677a49\src\Lucene.Net.Core\Index\SegmentInfos.cs:line
469
   at Lucene.Net.Index.CheckIndex.DoCheckIndex(IList`1 onlySegments) in z:\Builds\work\bcdbe6b8cc677a49\src\Lucene.Net.Core\Index\CheckIndex.cs:line
490
see all newly failed tests: http://teamcity.codebetter.com/viewLog.html?buildId=180872&buildTypeId=LuceneNet_Core



Other failed tests details (only first 3 failures shown here)
==================================================================
Lucene.Net.Tests.dll: Lucene.Net.Codecs.Lucene41.TestBlockPostingsFormat2 =================
TearDown method failed. CheckIndex failed
   at Lucene.Net.Util.TestUtil.CheckIndex(Directory dir, Boolean crossCheckTermVectors) in
z:\Builds\work\bcdbe6b8cc677a49\src\Lucene.Net.TestFramework\Util\TestUtil.cs:line 257
   at Lucene.Net.Codecs.Lucene41.TestBlockPostingsFormat2.TearDown() in z:\Builds\work\bcdbe6b8cc677a49\src\Lucene.Net.Tests\core\Codecs\Lucene41\TestBlockPostingsFormat2.cs:line
65
Lucene.Net.Tests.dll: Lucene.Net.Codecs.Lucene41.TestBlockPostingsFormat3.Test =================
Test(s) failed. Test exceeded Timeout value of 20000ms

Lucene.Net.Tests.dll: Lucene.Net.Codecs.Lucene42.TestLucene42DocValuesFormat.BaseDocValuesFormatTestCase.TestVeryLargeButLegalSortedBytes
=================
Test(s) failed. System.ArgumentOutOfRangeException : Index was out of range. Must be non-negative
and less than the size of the collection.
Parameter name: index
   at System.ThrowHelper.ThrowArgumentOutOfRangeException()
   at Lucene.Net.Util.Fst.BytesStore.ReverseBytesReaderAnonymousInner.ReadByte() in z:\Builds\work\bcdbe6b8cc677a49\src\Lucene.Net.Core\Util\Fst\BytesStore.cs:line
534
   at Lucene.Net.Store.DataInput.ReadVLong() in z:\Builds\work\bcdbe6b8cc677a49\src\Lucene.Net.Core\Store\DataInput.cs:line
182
   at Lucene.Net.Util.Fst.FST`1.ReadUnpackedNodeTarget(BytesReader in) in z:\Builds\work\bcdbe6b8cc677a49\src\Lucene.Net.Core\Util\Fst\FST.cs:line
1003
   at Lucene.Net.Util.Fst.FST`1.ReadNextRealArc(Arc`1 arc, BytesReader in) in z:\Builds\work\bcdbe6b8cc677a49\src\Lucene.Net.Core\Util\Fst\FST.cs:line
1280
   at Lucene.Net.Util.Fst.FST`1.ReadFirstRealTargetArc(Int64 node, Arc`1 arc, BytesReader
in) in z:\Builds\work\bcdbe6b8cc677a49\src\Lucene.Net.Core\Util\Fst\FST.cs:line 1077
   at Lucene.Net.Util.Fst.NodeHash`1.Hash(Int64 node) in z:\Builds\work\bcdbe6b8cc677a49\src\Lucene.Net.Core\Util\Fst\NodeHash.cs:line
108
   at Lucene.Net.Util.Fst.NodeHash`1.AddNew(Int64 address) in z:\Builds\work\bcdbe6b8cc677a49\src\Lucene.Net.Core\Util\Fst\NodeHash.cs:line
172
   at Lucene.Net.Util.Fst.NodeHash`1.Rehash() in z:\Builds\work\bcdbe6b8cc677a49\src\Lucene.Net.Core\Util\Fst\NodeHash.cs:line
198
   at Lucene.Net.Util.Fst.NodeHash`1.Add(UnCompiledNode`1 nodeIn) in z:\Builds\work\bcdbe6b8cc677a49\src\Lucene.Net.Core\Util\Fst\NodeHash.cs:line
154
   at Lucene.Net.Util.Fst.Builder`1.CompileNode(UnCompiledNode`1 nodeIn, Int32 tailLength)
in z:\Builds\work\bcdbe6b8cc677a49\src\Lucene.Net.Core\Util\Fst\Builder.cs:line 218
   at Lucene.Net.Util.Fst.Builder`1.DoFreezeTail(Int32 prefixLenPlus1) in z:\Builds\work\bcdbe6b8cc677a49\src\Lucene.Net.Core\Util\Fst\Builder.cs:line
329
   at Lucene.Net.Util.Fst.Builder`1.Finish() in z:\Builds\work\bcdbe6b8cc677a49\src\Lucene.Net.Core\Util\Fst\Builder.cs:line
518
   at Lucene.Net.Codecs.Lucene42.Lucene42DocValuesConsumer.WriteFST(FieldInfo field, IEnumerable`1
values) in z:\Builds\work\bcdbe6b8cc677a49\src\Lucene.Net.TestFramework\Codecs\lucene42\Lucene42DocValuesConsumer.cs:line
299
   at Lucene.Net.Codecs.Lucene42.Lucene42DocValuesConsumer.AddSortedField(FieldInfo field,
IEnumerable`1 values, IEnumerable`1 docToOrd) in z:\Builds\work\bcdbe6b8cc677a49\src\Lucene.Net.TestFramework\Codecs\lucene42\Lucene42DocValuesConsumer.cs:line
348
   at Lucene.Net.Codecs.Perfield.PerFieldDocValuesFormat.FieldsWriter.AddSortedField(FieldInfo
field, IEnumerable`1 values, IEnumerable`1 docToOrd) in z:\Builds\work\bcdbe6b8cc677a49\src\Lucene.Net.Core\Codecs\Perfield\PerFieldDocValuesFormat.cs:line
122
   at Lucene.Net.Index.SortedDocValuesWriter.Flush(SegmentWriteState state, DocValuesConsumer
dvConsumer) in z:\Builds\work\bcdbe6b8cc677a49\src\Lucene.Net.Core\Index\SortedDocValuesWriter.cs:line
125
   at Lucene.Net.Index.DocValuesProcessor.Flush(SegmentWriteState state) in z:\Builds\work\bcdbe6b8cc677a49\src\Lucene.Net.Core\Index\DocValuesProcessor.cs:line
99
   at Lucene.Net.Index.TwoStoredFieldsConsumers.Flush(SegmentWriteState state) in z:\Builds\work\bcdbe6b8cc677a49\src\Lucene.Net.Core\Index\TwoStoredFieldsConsumers.cs:line
45
   at Lucene.Net.Index.DocFieldProcessor.Flush(SegmentWriteState state) in z:\Builds\work\bcdbe6b8cc677a49\src\Lucene.Net.Core\Index\DocFieldProcessor.cs:line
81
   at Lucene.Net.Index.DocumentsWriterPerThread.Flush() in z:\Builds\work\bcdbe6b8cc677a49\src\Lucene.Net.Core\Index\DocumentsWriterPerThread.cs:line
550
   at Lucene.Net.Index.DocumentsWriter.DoFlush(DocumentsWriterPerThread flushingDWPT) in z:\Builds\work\bcdbe6b8cc677a49\src\Lucene.Net.Core\Index\DocumentsWriter.cs:line
635
   at Lucene.Net.Index.DocumentsWriter.FlushAllThreads(IndexWriter indexWriter) in z:\Builds\work\bcdbe6b8cc677a49\src\Lucene.Net.Core\Index\DocumentsWriter.cs:line
769
   at Lucene.Net.Index.IndexWriter.DoFlush(Boolean applyAllDeletes) in z:\Builds\work\bcdbe6b8cc677a49\src\Lucene.Net.Core\Index\IndexWriter.cs:line
3883
   at Lucene.Net.Index.IndexWriter.CloseInternal(Boolean waitForMerges, Boolean doFlush) in
z:\Builds\work\bcdbe6b8cc677a49\src\Lucene.Net.Core\Index\IndexWriter.cs:line 1178
   at Lucene.Net.Index.IndexWriter.Dispose(Boolean waitForMerges) in z:\Builds\work\bcdbe6b8cc677a49\src\Lucene.Net.Core\Index\IndexWriter.cs:line
1103
   at Lucene.Net.Index.RandomIndexWriter.Dispose() in z:\Builds\work\bcdbe6b8cc677a49\src\Lucene.Net.TestFramework\Index\RandomIndexWriter.cs:line
499
   at Lucene.Net.Index.BaseDocValuesFormatTestCase.TestVeryLargeButLegalSortedBytes() in z:\Builds\work\bcdbe6b8cc677a49\src\Lucene.Net.TestFramework\Index\BaseDocValuesFormatTestCase.cs:line
1027
Changes included (1 change)
====================================================
Change e2f872dc533d1209f821fc3064e6ada4c4ef740e by itamar (5 files):
Expressions test cases fixed

Closes #78

Squashed and cleaned up, original PR was touching unnecessary files


see more information about changed files: http://teamcity.codebetter.com/viewLog.html?tab=buildChangesDiv&buildId=180872&buildTypeId=LuceneNet_Core

============================================================================
Configure email notifications: http://teamcity.codebetter.com/profile.html?init=1&tab=userNotifications

Mime
  • Unnamed multipart/alternative (inline, None, 0 bytes)
View raw message