lucenenet-dev mailing list archives

Site index · List index
Message view « Date » · « Thread »
Top « Date » · « Thread »
From t.@codebetter.com
Subject [TeamCity, FAILED] Build Lucene.NET :: Lucene.NET Core [master] #203
Date Mon, 09 Feb 2015 01:59:42 GMT
Build Lucene.NET :: Lucene.NET Core [master] #203 failed (Tests failed: 76 (13 new), passed:
2383, ignored: 109).
Agent: JetBrains-dotnet-agent02
Build results: http://teamcity.codebetter.com/viewLog.html?buildId=181074&buildTypeId=LuceneNet_Core

Failed Tests Summary:
Newly failed tests (13 tests, alphabetically ordered)
==================================================================
Lucene.Net.Tests.dll: Lucene.Net.Codecs.Compressing.TestCompressingStoredFieldsFormat.BaseStoredFieldsFormatTestCase.TestConcurrentReads
Lucene.Net.Tests.dll: Lucene.Net.Index.TestIndexWriterExceptions.TestExceptionDuringRollback
Lucene.Net.Tests.dll: Lucene.Net.Index.TestStressNRT.Test
Lucene.Net.Tests.dll: Lucene.Net.Index.TestTransactions.TestTransactions_Mem
Lucene.Net.Tests.dll: Lucene.Net.Search.TestShardSearching.TestSimple
Lucene.Net.Tests.dll: Lucene.Net.Search.TestSimilarity.TestSimilarity_Mem
Lucene.Net.Tests.dll: Lucene.Net.Search.TestSimilarityProvider.TestBasics
Lucene.Net.Tests.dll: Lucene.Net.Search.TestSimpleExplanations.TestBQ1
Lucene.Net.Tests.dll: Lucene.Net.Search.TestSimpleExplanations.TestBQ10
Lucene.Net.Tests.dll: Lucene.Net.Search.TestSimpleExplanations.TestBQ11
Lucene.Net.Tests.dll: Lucene.Net.Search.TestSimpleExplanations.TestBQ14
Lucene.Net.Tests.dll: Lucene.Net.Search.TestSimpleExplanations.TestBQ15
Lucene.Net.Tests.dll: Lucene.Net.Store.TestMockDirectoryWrapper.TestDiskFull

Other failed tests (63 tests, alphabetically ordered)
==================================================================
Lucene.Net.Tests.dll: Lucene.Net.Codecs.Compressing.TestFastCompressionMode.AbstractTestLZ4CompressionMode.TestLongLiterals
Lucene.Net.Tests.dll: Lucene.Net.Codecs.Compressing.TestFastDecompressionMode.AbstractTestLZ4CompressionMode.TestLongLiterals
Lucene.Net.Tests.dll: Lucene.Net.Codecs.Lucene40.TestLucene40DocValuesFormat.BaseIndexFileFormatTestCase.TestMergeStability
Lucene.Net.Tests.dll: Lucene.Net.Codecs.Lucene41.TestBlockPostingsFormat2
Lucene.Net.Tests.dll: Lucene.Net.Codecs.Lucene41.TestBlockPostingsFormat3.Test
Lucene.Net.Tests.dll: Lucene.Net.Codecs.Lucene42.TestLucene42DocValuesFormat.BaseDocValuesFormatTestCase.TestVeryLargeButLegalSortedBytes
Lucene.Net.Tests.dll: Lucene.Net.Index.TestAddIndexes.TestAddIndexMissingCodec
Lucene.Net.Tests.dll: Lucene.Net.Index.TestAtomicUpdate.TestAtomicUpdates
Lucene.Net.Tests.dll: Lucene.Net.Index.TestCustomNorms.TestFloatNorms
Lucene.Net.Tests.dll: Lucene.Net.Index.TestDirectoryReader.TestNoDir
Lucene.Net.Tests.dll: Lucene.Net.Index.TestDocumentsWriterDeleteQueue.TestStressDeleteQueue
Lucene.Net.Tests.dll: Lucene.Net.Index.TestDocumentsWriterDeleteQueue.TestUpdateDelteSlices
Lucene.Net.Tests.dll: Lucene.Net.Index.TestDocumentsWriterStallControl.TestSimpleStall
Lucene.Net.Tests.dll: Lucene.Net.Index.TestDuelingCodecs.TestEquals
Lucene.Net.Tests.dll: Lucene.Net.Index.TestIndexWriter.TestThreadInterruptDeadlock
Lucene.Net.Tests.dll: Lucene.Net.Index.TestIndexWriter.TestTwoThreadsInterruptDeadlock
Lucene.Net.Tests.dll: Lucene.Net.Index.TestIndexWriterExceptions.TestExceptionOnMergeInit
Lucene.Net.Tests.dll: Lucene.Net.Index.TestIndexWriterExceptions.TestNoLostDeletesOrUpdates
Lucene.Net.Tests.dll: Lucene.Net.Index.TestIndexWriterWithThreads.TestIOExceptionDuringWriteSegmentWithThreadsOnlyOnce
Lucene.Net.Tests.dll: Lucene.Net.Index.TestIndexableField.TestArbitraryFields
Lucene.Net.Tests.dll: Lucene.Net.Index.TestNRTThreads.TestNRTThreads_Mem
Lucene.Net.Tests.dll: Lucene.Net.Index.TestParallelCompositeReader.TestToStringCompositeComposite
Lucene.Net.Tests.dll: Lucene.Net.Index.TestPersistentSnapshotDeletionPolicy.TestSnapshotDeletionPolicy.TestBasicSnapshots
Lucene.Net.Tests.dll: Lucene.Net.Index.TestPersistentSnapshotDeletionPolicy.TestSnapshotDeletionPolicy.TestRollbackToOldSnapshot
Lucene.Net.Tests.dll: Lucene.Net.Index.TestPrefixCodedTerms.TestMergeRandom
Lucene.Net.Tests.dll: Lucene.Net.Index.TestSegmentMerger.TestMerge
Lucene.Net.Tests.dll: Lucene.Net.Index.TestSegmentReader.TestDocument
Lucene.Net.Tests.dll: Lucene.Net.Index.TestSnapshotDeletionPolicy.TestRollbackToOldSnapshot
Lucene.Net.Tests.dll: Lucene.Net.Index.TestTermdocPerf.TestTermDocPerf
Lucene.Net.Tests.dll: Lucene.Net.Index.TestTermsEnum.TestFloorBlocks
Lucene.Net.Tests.dll: Lucene.Net.Index.TestTermsEnum.TestRandomTerms
Lucene.Net.Tests.dll: Lucene.Net.Search.Payloads.TestPayloadNearQuery.Test
Lucene.Net.Tests.dll: Lucene.Net.Search.Payloads.TestPayloadNearQuery.TestAverageFunction
Lucene.Net.Tests.dll: Lucene.Net.Search.Payloads.TestPayloadNearQuery.TestComplexNested
Lucene.Net.Tests.dll: Lucene.Net.Search.Payloads.TestPayloadNearQuery.TestLongerSpan
Lucene.Net.Tests.dll: Lucene.Net.Search.Payloads.TestPayloadNearQuery.TestMaxFunction
Lucene.Net.Tests.dll: Lucene.Net.Search.Payloads.TestPayloadNearQuery.TestMinFunction
Lucene.Net.Tests.dll: Lucene.Net.Search.Payloads.TestPayloadNearQuery.TestPayloadNear
Lucene.Net.Tests.dll: Lucene.Net.Search.Spans.TestSpanMultiTermQueryWrapper.TestFuzzy2
Lucene.Net.Tests.dll: Lucene.Net.Search.TestFuzzyQuery.TestFuzziness
Lucene.Net.Tests.dll: Lucene.Net.Search.TestFuzzyQuery.TestTieBreaker
Lucene.Net.Tests.dll: Lucene.Net.Search.TestMultiPhraseQuery.TestMultiSloppyWithRepeats
Lucene.Net.Tests.dll: Lucene.Net.Search.TestMultiValuedNumericRangeQuery.TestMultiValuedNRQ
Lucene.Net.Tests.dll: Lucene.Net.Search.TestNumericRangeQuery32.TestInfiniteValues
Lucene.Net.Tests.dll: Lucene.Net.Search.TestNumericRangeQuery64.TestInfiniteValues
Lucene.Net.Tests.dll: Lucene.Net.Search.TestRegexpQuery.TestBacktracking
Lucene.Net.Tests.dll: Lucene.Net.Search.TestRegexpQuery.TestRegexComplement
Lucene.Net.Tests.dll: Lucene.Net.Search.TestRegexpRandom.TestRegexps
Lucene.Net.Tests.dll: Lucene.Net.Search.TestSearcherManager.TestSearcherManager_Mem
Lucene.Net.Tests.dll: Lucene.Net.Search.TestTermVectors
Lucene.Net.Tests.dll: Lucene.Net.Search.TestTermVectors.TestMixedVectrosVectors
Lucene.Net.Tests.dll: Lucene.Net.Search.TestTopDocsMerge.TestSort_1
Lucene.Net.Tests.dll: Lucene.Net.Search.TestTopDocsMerge.TestSort_2
Lucene.Net.Tests.dll: Lucene.Net.Search.TestWildcardRandom.TestWildcards
Lucene.Net.Tests.dll: Lucene.Net.Store.TestBufferedIndexInput.TestSetBufferSize
Lucene.Net.Tests.dll: Lucene.Net.Store.TestFileSwitchDirectory.TestNoDir
Lucene.Net.Tests.dll: Lucene.Net.Store.TestLockFactory.TestStressLocksNativeFSLockFactory
Lucene.Net.Tests.dll: Lucene.Net.Store.TestNRTCachingDirectory.TestNoDir
Lucene.Net.Tests.dll: Lucene.Net.Tests.TestAssertions.TestTokenStreams
Lucene.Net.Tests.dll: Lucene.Net.Util.Automaton.TestBasicOperations.TestGetRandomAcceptedString
Lucene.Net.Tests.dll: Lucene.Net.Util.Packed.TestEliasFanoSequence.TestMonotoneSequences
Lucene.Net.Tests.dll: Lucene.Net.Util.TestIndexableBinaryStringTools.TestEncodedSortability
Lucene.Net.Tests.dll: Lucene.Net.Util.TestOpenBitSet.TestSmall



Newly failed tests details (only first 3 failures shown here)
==================================================================
Lucene.Net.Tests.dll: Lucene.Net.Codecs.Compressing.TestCompressingStoredFieldsFormat.BaseStoredFieldsFormatTestCase.TestConcurrentReads
(new) =================
Test(s) failed. System.InvalidOperationException : Expected 1 hit, got 0
   at Lucene.Net.Index.BaseStoredFieldsFormatTestCase.TestConcurrentReads() in z:\Builds\work\bcdbe6b8cc677a49\src\Lucene.Net.TestFramework\Index\BaseStoredFieldsFormatTestCase.cs:line
453
Lucene.Net.Tests.dll: Lucene.Net.Index.TestIndexWriterExceptions.TestExceptionDuringRollback
(new) =================
Test(s) failed.   Expected string length 5 but was 0. Strings differ at index 0.
  Expected: "BOOM!"
  But was:  <string.Empty>
  -----------^

   at NUnit.Framework.Assert.That(Object actual, IResolveConstraint expression, String message,
Object[] args)
   at NUnit.Framework.Assert.AreEqual(Object expected, Object actual)
   at Lucene.Net.Index.TestIndexWriterExceptions.TestExceptionDuringRollback() in z:\Builds\work\bcdbe6b8cc677a49\src\Lucene.Net.Tests\core\Index\TestIndexWriterExceptions.cs:line
2474
Lucene.Net.Tests.dll: Lucene.Net.Index.TestStressNRT.Test (new) =================
Test(s) failed. System.Exception : MockDirectoryWrapper: cannot close: there are still open
files: _0_Lucene41_0.doc ,_0.fdt ,_0_Lucene41_0.tim ,_1_Lucene41_0.doc ,_1.fdt ,_1_Lucene41_0.tim
  ----> System.Exception : unclosed IndexInput: _0_Lucene41_0.doc
   at Lucene.Net.Store.MockDirectoryWrapper.Dispose() in z:\Builds\work\bcdbe6b8cc677a49\src\Lucene.Net.TestFramework\Store\MockDirectoryWrapper.cs:line
918
   at Lucene.Net.Index.TestStressNRT.Test() in z:\Builds\work\bcdbe6b8cc677a49\src\Lucene.Net.Tests\core\Index\TestStressNRT.cs:line
152
--Exception

------- Stderr: -------
READER2: FAILED: unexpected exception
   at System.ThrowHelper.ThrowInvalidOperationException(ExceptionResource resource)
   at System.Collections.Generic.Dictionary`2.KeyCollection.Enumerator.MoveNext()
   at Lucene.Net.Util.WeakIdentityMap`2.Reap() in z:\Builds\work\bcdbe6b8cc677a49\src\Lucene.Net.Core\Util\WeakIdentityMap.cs:line
336
   at Lucene.Net.Util.WeakIdentityMap`2.Put(K key, V value) in z:\Builds\work\bcdbe6b8cc677a49\src\Lucene.Net.Core\Util\WeakIdentityMap.cs:line
148
   at Lucene.Net.Util.VirtualMethod`1.GetImplementationDistance(Type subclazz) in z:\Builds\work\bcdbe6b8cc677a49\src\Lucene.Net.Core\Util\VirtualMethod.cs:line
107
   at Lucene.Net.Search.AssertingBulkScorer.ShouldWrap(BulkScorer inScorer) in z:\Builds\work\bcdbe6b8cc677a49\src\Lucene.Net.TestFramework\Search\AssertingBulkScorer.cs:line
45
   at Lucene.Net.Search.AssertingWeight.BulkScorer(AtomicReaderContext context, Boolean scoreDocsInOrder,
Bits acceptDocs) in z:\Builds\work\bcdbe6b8cc677a49\src\Lucene.Net.TestFramework\Search\AssertingWeight.cs:line
109
   at Lucene.Net.Search.IndexSearcher.Search(IList`1 leaves, Weight weight, Collector collector)
in z:\Builds\work\bcdbe6b8cc677a49\src\Lucene.Net.Core\Search\IndexSearcher.cs:line 653
   at Lucene.Net.Search.AssertingIndexSearcher.Search(IList`1 leaves, Weight weight, Collector
collector) in z:\Builds\work\bcdbe6b8cc677a49\src\Lucene.Net.TestFramework\Search\AssertingIndexSearcher.cs:line
116
   at Lucene.Net.Search.IndexSearcher.Search(IList`1 leaves, Weight weight, ScoreDoc after,
Int32 nDocs) in z:\Builds\work\bcdbe6b8cc677a49\src\Lucene.Net.Core\Search\IndexSearcher.cs:line
526
   at Lucene.Net.Search.IndexSearcher.Search(Weight weight, ScoreDoc after, Int32 nDocs) in
z:\Builds\work\bcdbe6b8cc677a49\src\Lucene.Net.Core\Search\IndexSearcher.cs:line 474
   at Lucene.Net.Search.IndexSearcher.Search(Query query, Filter filter, Int32 n) in z:\Builds\work\bcdbe6b8cc677a49\src\Lucene.Net.Core\Search\IndexSearcher.cs:line
301
   at Lucene.Net.Search.IndexSearcher.Search(Query query, Int32 n) in z:\Builds\work\bcdbe6b8cc677a49\src\Lucene.Net.Core\Search\IndexSearcher.cs:line
290
   at Lucene.Net.Index.TestStressNRT.ThreadAnonymousInnerClassHelper2.Run() in z:\Builds\work\bcdbe6b8cc677a49\src\Lucene.Net.Tests\core\Index\TestStressNRT.cs:line
473
Unhandled exception in remote appdomain: System.Exception: Collection was modified; enumeration
operation may not execute. ---> System.InvalidOperationException: Collection was modified;
enumeration operation may not execute.
   at System.ThrowHelper.ThrowInvalidOperationException(ExceptionResource resource)
   at System.Collections.Generic.Dictionary`2.KeyCollection.Enumerator.MoveNext()
   at Lucene.Net.Util.WeakIdentityMap`2.Reap() in z:\Builds\work\bcdbe6b8cc677a49\src\Lucene.Net.Core\Util\WeakIdentityMap.cs:line
336
   at Lucene.Net.Util.WeakIdentityMap`2.Put(K key, V value) in z:\Builds\work\bcdbe6b8cc677a49\src\Lucene.Net.Core\Util\WeakIdentityMap.cs:line
148
   at Lucene.Net.Util.VirtualMethod`1.GetImplementationDistance(Type subclazz) in z:\Builds\work\bcdbe6b8cc677a49\src\Lucene.Net.Core\Util\VirtualMethod.cs:line
107
   at Lucene.Net.Search.AssertingBulkScorer.ShouldWrap(BulkScorer inScorer) in z:\Builds\work\bcdbe6b8cc677a49\src\Lucene.Net.TestFramework\Search\AssertingBulkScorer.cs:line
45
   at Lucene.Net.Search.AssertingWeight.BulkScorer(AtomicReaderContext context, Boolean scoreDocsInOrder,
Bits acceptDocs) in z:\Builds\work\bcdbe6b8cc677a49\src\Lucene.Net.TestFramework\Search\AssertingWeight.cs:line
109
   at Lucene.Net.Search.IndexSearcher.Search(IList`1 leaves, Weight weight, Collector collector)
in z:\Builds\work\bcdbe6b8cc677a49\src\Lucene.Net.Core\Search\IndexSearcher.cs:line 653
   at Lucene.Net.Search.AssertingIndexSearcher.Search(IList`1 leaves, Weight weight, Collector
collector) in z:\Builds\work\bcdbe6b8cc677a49\src\Lucene.Net.TestFramework\Search\AssertingIndexSearcher.cs:line
116
   at Lucene.Net.Search.IndexSearcher.Search(IList`1 leaves, Weight weight, ScoreDoc after,
Int32 nDocs) in z:\Builds\work\bcdbe6b8cc677a49\src\Lucene.Net.Core\Search\IndexSearcher.cs:line
526
   at Lucene.Net.Search.IndexSearcher.Search(Weight weight, ScoreDoc after, Int32 nDocs) in
z:\Builds\work\bcdbe6b8cc677a49\src\Lucene.Net.Core\Search\IndexSearcher.cs:line 474
   at Lucene.Net.Search.IndexSearcher.Search(Query query, Filter filter, Int32 n) in z:\Builds\work\bcdbe6b8cc677a49\src\Lucene.Net.Core\Search\IndexSearcher.cs:line
301
   at Lucene.Net.Search.IndexSearcher.Search(Query query, Int32 n) in z:\Builds\work\bcdbe6b8cc677a49\src\Lucene.Net.Core\Search\IndexSearcher.cs:line
290
   at Lucene.Net.Index.TestStressNRT.ThreadAnonymousInnerClassHelper2.Run() in z:\Builds\work\bcdbe6b8cc677a49\src\Lucene.Net.Tests\core\Index\TestStressNRT.cs:line
473
   --- End of inner exception stack trace ---
   at Lucene.Net.Index.TestStressNRT.ThreadAnonymousInnerClassHelper2.Run() in z:\Builds\work\bcdbe6b8cc677a49\src\Lucene.Net.Tests\core\Index\TestStressNRT.cs:line
525
   at System.Threading.ThreadHelper.ThreadStart_Context(Object state)
   at System.Threading.ExecutionContext.RunInternal(ExecutionContext executionContext, ContextCallback
callback, Object state, Boolean preserveSyncCtx)
   at System.Threading.ExecutionContext.Run(ExecutionContext executionContext, ContextCallback
callback, Object state, Boolean preserveSyncCtx)
   at System.Threading.ExecutionContext.Run(ExecutionContext executionContext, ContextCallback
callback, Object state)
   at System.Threading.ThreadHelper.ThreadStart()
see all newly failed tests: http://teamcity.codebetter.com/viewLog.html?buildId=181074&buildTypeId=LuceneNet_Core



Other failed tests details (only first 3 failures shown here)
==================================================================
Lucene.Net.Tests.dll: Lucene.Net.Codecs.Compressing.TestFastCompressionMode.AbstractTestLZ4CompressionMode.TestLongLiterals
=================
Test(s) failed.   16886 270
  Expected: True
  But was:  False

   at NUnit.Framework.Assert.That(Object actual, IResolveConstraint expression, String message,
Object[] args)
   at NUnit.Framework.Assert.IsTrue(Boolean condition, String message)
   at Lucene.Net.Codecs.Compressing.AbstractTestLZ4CompressionMode.Test(Byte[] decompressed)
in z:\Builds\work\bcdbe6b8cc677a49\src\Lucene.Net.Tests\core\Codecs\Compressing\AbstractTestLZ4CompressionMode.cs:line
64
   at Lucene.Net.Codecs.Compressing.AbstractTestLZ4CompressionMode.TestLongLiterals() in z:\Builds\work\bcdbe6b8cc677a49\src\Lucene.Net.Tests\core\Codecs\Compressing\AbstractTestLZ4CompressionMode.cs:line
122
Lucene.Net.Tests.dll: Lucene.Net.Codecs.Compressing.TestFastDecompressionMode.AbstractTestLZ4CompressionMode.TestLongLiterals
=================
Test(s) failed.   16774 270
  Expected: True
  But was:  False

   at NUnit.Framework.Assert.That(Object actual, IResolveConstraint expression, String message,
Object[] args)
   at NUnit.Framework.Assert.IsTrue(Boolean condition, String message)
   at Lucene.Net.Codecs.Compressing.AbstractTestLZ4CompressionMode.Test(Byte[] decompressed)
in z:\Builds\work\bcdbe6b8cc677a49\src\Lucene.Net.Tests\core\Codecs\Compressing\AbstractTestLZ4CompressionMode.cs:line
64
   at Lucene.Net.Codecs.Compressing.AbstractTestLZ4CompressionMode.TestLongLiterals() in z:\Builds\work\bcdbe6b8cc677a49\src\Lucene.Net.Tests\core\Codecs\Compressing\AbstractTestLZ4CompressionMode.cs:line
122
Lucene.Net.Tests.dll: Lucene.Net.Codecs.Lucene40.TestLucene40DocValuesFormat.BaseIndexFileFormatTestCase.TestMergeStability
=================
Test(s) failed. System.NullReferenceException : Object reference not set to an instance of
an object.
   at Lucene.Net.Codecs.Lucene40.Lucene40DocValuesWriter.AddBinaryField(FieldInfo field, IEnumerable`1
values) in z:\Builds\work\bcdbe6b8cc677a49\src\Lucene.Net.TestFramework\Codecs\lucene40\Lucene40DocValuesWriter.cs:line
184
   at Lucene.Net.Index.BinaryDocValuesWriter.Flush(SegmentWriteState state, DocValuesConsumer
dvConsumer) in z:\Builds\work\bcdbe6b8cc677a49\src\Lucene.Net.Core\Index\BinaryDocValuesWriter.cs:line
130
   at Lucene.Net.Index.DocValuesProcessor.Flush(SegmentWriteState state) in z:\Builds\work\bcdbe6b8cc677a49\src\Lucene.Net.Core\Index\DocValuesProcessor.cs:line
99
   at Lucene.Net.Index.TwoStoredFieldsConsumers.Flush(SegmentWriteState state) in z:\Builds\work\bcdbe6b8cc677a49\src\Lucene.Net.Core\Index\TwoStoredFieldsConsumers.cs:line
45
   at Lucene.Net.Index.DocFieldProcessor.Flush(SegmentWriteState state) in z:\Builds\work\bcdbe6b8cc677a49\src\Lucene.Net.Core\Index\DocFieldProcessor.cs:line
81
   at Lucene.Net.Index.DocumentsWriterPerThread.Flush() in z:\Builds\work\bcdbe6b8cc677a49\src\Lucene.Net.Core\Index\DocumentsWriterPerThread.cs:line
550
   at Lucene.Net.Index.DocumentsWriter.DoFlush(DocumentsWriterPerThread flushingDWPT) in z:\Builds\work\bcdbe6b8cc677a49\src\Lucene.Net.Core\Index\DocumentsWriter.cs:line
635
   at Lucene.Net.Index.DocumentsWriter.FlushAllThreads(IndexWriter indexWriter) in z:\Builds\work\bcdbe6b8cc677a49\src\Lucene.Net.Core\Index\DocumentsWriter.cs:line
769
   at Lucene.Net.Index.IndexWriter.DoFlush(Boolean applyAllDeletes) in z:\Builds\work\bcdbe6b8cc677a49\src\Lucene.Net.Core\Index\IndexWriter.cs:line
3883
   at Lucene.Net.Index.IndexWriter.ForceMerge(Int32 maxNumSegments, Boolean doWait) in z:\Builds\work\bcdbe6b8cc677a49\src\Lucene.Net.Core\Index\IndexWriter.cs:line
2130
   at Lucene.Net.Index.IndexWriter.ForceMerge(Int32 maxNumSegments) in z:\Builds\work\bcdbe6b8cc677a49\src\Lucene.Net.Core\Index\IndexWriter.cs:line
2101
   at Lucene.Net.Index.RandomIndexWriter.ForceMerge(Int32 maxSegmentCount) in z:\Builds\work\bcdbe6b8cc677a49\src\Lucene.Net.TestFramework\Index\RandomIndexWriter.cs:line
510
   at Lucene.Net.Index.BaseIndexFileFormatTestCase.TestMergeStability() in z:\Builds\work\bcdbe6b8cc677a49\src\Lucene.Net.TestFramework\Index\BaseIndexFileFormatTestCase.cs:line
110
Changes included (3 changes)
====================================================
Change c9f901b24237da82dbb137f709eaa5f0e2398192 by itamar (76 files):
Moving the 3.0 spatial module to serve as a basis to Lucene.Net.Spatial


Change 150651bc1be9d5a25f1b87881db0083cc4ea3ea4 by laimis (1 file):
mark as sealed


Change 830932a9de67e9cb1a08a17c52969a59f77d8da4 by laimis (3 files):
match Lucene logic and mark IncrementToken as sealed


see more information about changed files: http://teamcity.codebetter.com/viewLog.html?tab=buildChangesDiv&buildId=181074&buildTypeId=LuceneNet_Core

============================================================================
Configure email notifications: http://teamcity.codebetter.com/profile.html?init=1&tab=userNotifications

Mime
  • Unnamed multipart/alternative (inline, None, 0 bytes)
View raw message