lucenenet-dev mailing list archives

Site index · List index
Message view « Date » · « Thread »
Top « Date » · « Thread »
From t.@codebetter.com
Subject [TeamCity, FAILED] Build Lucene.NET :: Lucene.NET Nightly [master] #288
Date Mon, 23 Feb 2015 10:44:46 GMT
Build Lucene.NET :: Lucene.NET Nightly [master] #288 failed (Tests failed: 137 (8 new), passed:
2634, ignored: 120; snapshot dependency failed: Lucene.NET :: Lucene.NET Core).
Agent: JetBrains-dotnet-agent02
Build results: http://teamcity.codebetter.com/viewLog.html?buildId=182718&buildTypeId=LuceneNet_LuceneNetNightly

Failed Tests Summary:
Newly failed tests (8 tests, alphabetically ordered)
==================================================================
Lucene.Net.Tests.Facet.dll: Lucene.Net.Facet.Taxonomy.Directory.TestAddTaxonomy.TestBig
Lucene.Net.Tests.dll: Lucene.Net.Analysis.TestGraphTokenizers.TestDoubleMockGraphTokenFilterRandom
Lucene.Net.Tests.dll: Lucene.Net.Analysis.TestLookaheadTokenFilter.TestRandomStrings
Lucene.Net.Tests.dll: Lucene.Net.Index.TestTransactions.TestTransactions_Mem
Lucene.Net.Tests.dll: Lucene.Net.Search.BaseTestRangeFilter.TestPad
Lucene.Net.Tests.dll: Lucene.Net.Search.TestShardSearching.TestSimple
Lucene.Net.Tests.dll: Lucene.Net.Search.TestSimilarity.TestSimilarity_Mem
Lucene.Net.Tests.dll: Lucene.Net.Search.TestSimilarityProvider.TestBasics

Other failed tests (129 tests, alphabetically ordered, only first 100 shown)
==================================================================
Lucene.Net.Tests.Facet.dll: Lucene.Net.Facet.Range.TestRangeFacetCounts.TestMixedRangeAndNonRangeTaxonomy
Lucene.Net.Tests.Facet.dll: Lucene.Net.Facet.SortedSet.TestSortedSetDocValuesFacets.TestRandom
Lucene.Net.Tests.Facet.dll: Lucene.Net.Facet.SortedSet.TestSortedSetDocValuesFacets.TestStaleState
Lucene.Net.Tests.Facet.dll: Lucene.Net.Facet.Taxonomy.Directory.TestAddTaxonomy.TestConcurrency
Lucene.Net.Tests.Facet.dll: Lucene.Net.Facet.Taxonomy.Directory.TestAddTaxonomy.TestSimple
Lucene.Net.Tests.Facet.dll: Lucene.Net.Facet.Taxonomy.Directory.TestConcurrentFacetedIndexing.TestConcurrency
Lucene.Net.Tests.Facet.dll: Lucene.Net.Facet.Taxonomy.Directory.TestDirectoryTaxonomyReader.TestFreshReadRecreatedTaxonomy
Lucene.Net.Tests.Facet.dll: Lucene.Net.Facet.Taxonomy.Directory.TestDirectoryTaxonomyReader.TestGetChildren
Lucene.Net.Tests.Facet.dll: Lucene.Net.Facet.Taxonomy.Directory.TestDirectoryTaxonomyReader.TestOpenIfChangedManySegments
Lucene.Net.Tests.Facet.dll: Lucene.Net.Facet.Taxonomy.Directory.TestDirectoryTaxonomyReader.TestOpenIfChangedMergedSegment
Lucene.Net.Tests.Facet.dll: Lucene.Net.Facet.Taxonomy.Directory.TestDirectoryTaxonomyReader.TestOpenIfChangedNoChangesButSegmentMerges
Lucene.Net.Tests.Facet.dll: Lucene.Net.Facet.Taxonomy.Directory.TestDirectoryTaxonomyReader.TestOpenIfChangedReadRecreatedTaxonomy
Lucene.Net.Tests.Facet.dll: Lucene.Net.Facet.Taxonomy.Directory.TestDirectoryTaxonomyWriter.TestConcurrency
Lucene.Net.Tests.Facet.dll: Lucene.Net.Facet.Taxonomy.Directory.TestDirectoryTaxonomyWriter.TestHugeLabel
Lucene.Net.Tests.Facet.dll: Lucene.Net.Facet.Taxonomy.TestLRUHashMap.TestLru
Lucene.Net.Tests.Facet.dll: Lucene.Net.Facet.Taxonomy.TestSearcherTaxonomyManager.TestReplaceTaxonomyNrt
Lucene.Net.Tests.Facet.dll: Lucene.Net.Facet.Taxonomy.TestTaxonomyCombined.TestChildrenArrays
Lucene.Net.Tests.Facet.dll: Lucene.Net.Facet.Taxonomy.TestTaxonomyCombined.TestChildrenArraysGrowth
Lucene.Net.Tests.Facet.dll: Lucene.Net.Facet.Taxonomy.TestTaxonomyCombined.TestChildrenArraysInvariants
Lucene.Net.Tests.Facet.dll: Lucene.Net.Facet.Taxonomy.TestTaxonomyCombined.TestReaderBasic
Lucene.Net.Tests.Facet.dll: Lucene.Net.Facet.Taxonomy.TestTaxonomyCombined.TestReaderParent
Lucene.Net.Tests.Facet.dll: Lucene.Net.Facet.Taxonomy.TestTaxonomyCombined.TestSeparateReaderAndWriter
Lucene.Net.Tests.Facet.dll: Lucene.Net.Facet.Taxonomy.TestTaxonomyCombined.TestWriter
Lucene.Net.Tests.Facet.dll: Lucene.Net.Facet.Taxonomy.TestTaxonomyCombined.TestWriterCheckPaths
Lucene.Net.Tests.Facet.dll: Lucene.Net.Facet.Taxonomy.TestTaxonomyCombined.TestWriterCheckPaths2
Lucene.Net.Tests.Facet.dll: Lucene.Net.Facet.Taxonomy.TestTaxonomyCombined.TestWriterParent1
Lucene.Net.Tests.Facet.dll: Lucene.Net.Facet.Taxonomy.TestTaxonomyCombined.TestWriterParent2
Lucene.Net.Tests.Facet.dll: Lucene.Net.Facet.Taxonomy.TestTaxonomyCombined.TestWriterSimpler
Lucene.Net.Tests.Facet.dll: Lucene.Net.Facet.Taxonomy.TestTaxonomyCombined.TestWriterTwice
Lucene.Net.Tests.Facet.dll: Lucene.Net.Facet.Taxonomy.TestTaxonomyCombined.TestWriterTwice2
Lucene.Net.Tests.Queries.dll: Lucene.Net.Tests.Queries.CommonTermsQueryTest.TestEqualsHashCode
Lucene.Net.Tests.dll: Lucene.Net.Codecs.Compressing.TestFastCompressionMode.AbstractTestLZ4CompressionMode.TestLongLiterals
Lucene.Net.Tests.dll: Lucene.Net.Codecs.Compressing.TestFastDecompressionMode.AbstractTestLZ4CompressionMode.TestLongLiterals
Lucene.Net.Tests.dll: Lucene.Net.Codecs.Lucene40.TestLucene40DocValuesFormat.BaseIndexFileFormatTestCase.TestMergeStability
Lucene.Net.Tests.dll: Lucene.Net.Codecs.Lucene41.TestBlockPostingsFormat2
Lucene.Net.Tests.dll: Lucene.Net.Codecs.Lucene41.TestBlockPostingsFormat3.Test
Lucene.Net.Tests.dll: Lucene.Net.Codecs.Lucene42.TestLucene42DocValuesFormat.BaseDocValuesFormatTestCase.TestVeryLargeButLegalSortedBytes
Lucene.Net.Tests.dll: Lucene.Net.Index.TestAddIndexes.TestAddIndexMissingCodec
Lucene.Net.Tests.dll: Lucene.Net.Index.TestAtomicUpdate.TestAtomicUpdates
Lucene.Net.Tests.dll: Lucene.Net.Index.TestDirectoryReader.TestNoDir
Lucene.Net.Tests.dll: Lucene.Net.Index.TestDocumentsWriterStallControl.TestSimpleStall
Lucene.Net.Tests.dll: Lucene.Net.Index.TestDuelingCodecs.TestEquals
Lucene.Net.Tests.dll: Lucene.Net.Index.TestIndexWriter.TestThreadInterruptDeadlock
Lucene.Net.Tests.dll: Lucene.Net.Index.TestIndexWriter.TestTwoThreadsInterruptDeadlock
Lucene.Net.Tests.dll: Lucene.Net.Index.TestIndexWriterExceptions.TestExceptionOnMergeInit
Lucene.Net.Tests.dll: Lucene.Net.Index.TestNRTThreads.TestNRTThreads_Mem
Lucene.Net.Tests.dll: Lucene.Net.Index.TestParallelCompositeReader.TestToStringCompositeComposite
Lucene.Net.Tests.dll: Lucene.Net.Index.TestPersistentSnapshotDeletionPolicy.TestSnapshotDeletionPolicy.TestBasicSnapshots
Lucene.Net.Tests.dll: Lucene.Net.Index.TestPersistentSnapshotDeletionPolicy.TestSnapshotDeletionPolicy.TestRollbackToOldSnapshot
Lucene.Net.Tests.dll: Lucene.Net.Index.TestSegmentMerger.TestMerge
Lucene.Net.Tests.dll: Lucene.Net.Index.TestSegmentReader.TestDocument
Lucene.Net.Tests.dll: Lucene.Net.Index.TestSnapshotDeletionPolicy.TestRollbackToOldSnapshot
Lucene.Net.Tests.dll: Lucene.Net.Index.TestStoredFieldsFormat.BaseStoredFieldsFormatTestCase.TestConcurrentReads
Lucene.Net.Tests.dll: Lucene.Net.Index.TestStressIndexing.TestStressIndexAndSearching
Lucene.Net.Tests.dll: Lucene.Net.Index.TestTermdocPerf.TestTermDocPerf
Lucene.Net.Tests.dll: Lucene.Net.Index.TestTermsEnum.TestFloorBlocks
Lucene.Net.Tests.dll: Lucene.Net.Index.TestTermsEnum.TestRandomTerms
Lucene.Net.Tests.dll: Lucene.Net.Search.Payloads.TestPayloadNearQuery.Test
Lucene.Net.Tests.dll: Lucene.Net.Search.Payloads.TestPayloadNearQuery.TestAverageFunction
Lucene.Net.Tests.dll: Lucene.Net.Search.Payloads.TestPayloadNearQuery.TestComplexNested
Lucene.Net.Tests.dll: Lucene.Net.Search.Payloads.TestPayloadNearQuery.TestLongerSpan
Lucene.Net.Tests.dll: Lucene.Net.Search.Payloads.TestPayloadNearQuery.TestMaxFunction
Lucene.Net.Tests.dll: Lucene.Net.Search.Payloads.TestPayloadNearQuery.TestMinFunction
Lucene.Net.Tests.dll: Lucene.Net.Search.Payloads.TestPayloadNearQuery.TestPayloadNear
Lucene.Net.Tests.dll: Lucene.Net.Search.Spans.TestSpanMultiTermQueryWrapper.TestFuzzy2
Lucene.Net.Tests.dll: Lucene.Net.Search.TestFuzzyQuery.TestTieBreaker
Lucene.Net.Tests.dll: Lucene.Net.Search.TestMultiPhraseQuery.TestMultiSloppyWithRepeats
Lucene.Net.Tests.dll: Lucene.Net.Search.TestMultiValuedNumericRangeQuery.TestMultiValuedNRQ
Lucene.Net.Tests.dll: Lucene.Net.Search.TestNumericRangeQuery32.TestInfiniteValues
Lucene.Net.Tests.dll: Lucene.Net.Search.TestNumericRangeQuery64.TestInfiniteValues
Lucene.Net.Tests.dll: Lucene.Net.Search.TestRegexpQuery.TestBacktracking
Lucene.Net.Tests.dll: Lucene.Net.Search.TestRegexpQuery.TestRegexComplement
Lucene.Net.Tests.dll: Lucene.Net.Search.TestRegexpRandom.TestRegexps
Lucene.Net.Tests.dll: Lucene.Net.Search.TestSearcherManager.TestSearcherManager_Mem
Lucene.Net.Tests.dll: Lucene.Net.Search.TestSimpleExplanations.TestDMQ8
Lucene.Net.Tests.dll: Lucene.Net.Search.TestTermVectors
Lucene.Net.Tests.dll: Lucene.Net.Search.TestTermVectors.TestMixedVectrosVectors
Lucene.Net.Tests.dll: Lucene.Net.Search.TestTopDocsMerge.TestSort_1
Lucene.Net.Tests.dll: Lucene.Net.Search.TestTopDocsMerge.TestSort_2
Lucene.Net.Tests.dll: Lucene.Net.Search.TestWildcardRandom.TestWildcards
Lucene.Net.Tests.dll: Lucene.Net.Store.TestBufferedIndexInput.TestSetBufferSize
Lucene.Net.Tests.dll: Lucene.Net.Store.TestFileSwitchDirectory.TestNoDir
Lucene.Net.Tests.dll: Lucene.Net.Store.TestNRTCachingDirectory.TestNoDir
Lucene.Net.Tests.dll: Lucene.Net.Tests.TestAssertions.TestTokenStreams
Lucene.Net.Tests.dll: Lucene.Net.Util.Automaton.TestUTF32ToUTF8.TestRandomRegexes
Lucene.Net.Tests.dll: Lucene.Net.Util.Packed.TestEliasFanoSequence.TestMonotoneSequences
Lucene.Net.Tests.dll: Lucene.Net.Util.Packed.TestEliasFanoSequence.TestStrictMonotoneSequencesLonger
Lucene.Net.Tests.dll: Lucene.Net.Util.TestDocIdBitSet.BaseDocIdSetTestCase`1.TestAgainstBitSet
Lucene.Net.Tests.dll: Lucene.Net.Util.TestIndexableBinaryStringTools.TestEncodedSortability
Lucene.Net.Tests.dll: Lucene.Net.Util.TestOpenBitSet.TestSmall
Lucene.Net.Tests.dll: Lucene.Net.Util.TestPagedBytes.TestOverflow
Lucene.Net.Tests.dll: Lucene.Net.Util.TestPriorityQueue.TestStress



Newly failed tests details (only first 3 failures shown here)
==================================================================
Lucene.Net.Tests.dll: Lucene.Net.Analysis.TestGraphTokenizers.TestDoubleMockGraphTokenFilterRandom
(new) =================
Test(s) failed. Test exceeded Timeout value of 20000ms

Lucene.Net.Tests.dll: Lucene.Net.Analysis.TestLookaheadTokenFilter.TestRandomStrings (new)
=================
TearDown method failed. Thread interrupted
TearDown : System.IO.IOException : The process cannot access the file 'write.lock' because
it is being used by another process.
   at NUnit.Framework.Assert.Fail(String message, Object[] args)
   at Lucene.Net.Analysis.BaseTokenStreamTestCase.CheckRandomData(Random random, Analyzer
a, Int32 iterations, Int32 maxWordLength, Boolean simple, Boolean offsetsAreCorrect) in z:\Builds\work\bcdbe6b8cc677a49\src\Lucene.Net.TestFramework\Analysis\BaseTokenStreamTestCase.cs:line
658
   at Lucene.Net.Analysis.TestLookaheadTokenFilter.TestRandomStrings() in z:\Builds\work\bcdbe6b8cc677a49\src\Lucene.Net.Tests\core\Analysis\TestLookaheadTokenFilter.cs:line
32
--TearDown
   at System.IO.Directory.DeleteHelper(String fullPath, String userPath, Boolean recursive,
Boolean throwOnTopLevelDirectoryNotFound)
   at System.IO.Directory.Delete(String fullPath, String userPath, Boolean recursive, Boolean
checkHost)
   at Lucene.Net.Util.LuceneTestCase.CleanupTemporaryFiles() in z:\Builds\work\bcdbe6b8cc677a49\src\Lucene.Net.TestFramework\Util\LuceneTestCase.cs:line
2667
   at Lucene.Net.Util.LuceneTestCase.TearDown() in z:\Builds\work\bcdbe6b8cc677a49\src\Lucene.Net.TestFramework\Util\LuceneTestCase.cs:line
581
------- Stdout: -------
TEST FAIL: useCharFilter=True text='La deuxi\u%04xme remarque est que la coh\u%04xsion \u%04xconomique
et sociale n'est pas seulement la t\u%04xche essentielle de l'Union europ\u%04xenne, mais
\u%04xgalement la responsabilit\u%04x des \u%04xtats membres, car les instruments et les moyens
de l'Union europ\u%04xenne ne peuvent \u%04xtre fournis qu'\u%04x titre auxiliaire et compl\u%04xmentaire.'
------- Stderr: -------
Exception in Thread: System.IndexOutOfRangeException: Index was outside the bounds of the
array.
   at Lucene.Net.Util.Fst.BytesStore.ReverseBytesReaderAnonymousInner.ReadByte() in z:\Builds\work\bcdbe6b8cc677a49\src\Lucene.Net.Core\Util\Fst\BytesStore.cs:line
534
   at Lucene.Net.Util.Fst.FST`1.ReadNextRealArc(Arc`1 arc, BytesReader in) in z:\Builds\work\bcdbe6b8cc677a49\src\Lucene.Net.Core\Util\Fst\FST.cs:line
1198
   at Lucene.Net.Util.Fst.FST`1.ReadFirstRealTargetArc(Int64 node, Arc`1 arc, BytesReader
in) in z:\Builds\work\bcdbe6b8cc677a49\src\Lucene.Net.Core\Util\Fst\FST.cs:line 1077
   at Lucene.Net.Util.Fst.FST`1.ReadRootArcs(Arc`1[] arcs) in z:\Builds\work\bcdbe6b8cc677a49\src\Lucene.Net.Core\Util\Fst\FST.cs:line
395
   at Lucene.Net.Util.Fst.FST`1.CacheRootArcs() in z:\Builds\work\bcdbe6b8cc677a49\src\Lucene.Net.Core\Util\Fst\FST.cs:line
386
   at Lucene.Net.Util.Fst.FST`1.Finish(Int64 newStartNode) in z:\Builds\work\bcdbe6b8cc677a49\src\Lucene.Net.Core\Util\Fst\FST.cs:line
365
   at Lucene.Net.Util.Fst.Builder`1.Finish() in z:\Builds\work\bcdbe6b8cc677a49\src\Lucene.Net.Core\Util\Fst\Builder.cs:line
539
   at Lucene.Net.Codecs.BlockTreeTermsWriter.PendingBlock.CompileIndex(IList`1 floorBlocks,
RAMOutputStream scratchBytes) in z:\Builds\work\bcdbe6b8cc677a49\src\Lucene.Net.Core\Codecs\BlockTreeTermsWriter.cs:line
487
   at Lucene.Net.Codecs.BlockTreeTermsWriter.TermsWriter.WriteBlocks(IntsRef prevTerm, Int32
prefixLength, Int32 count) in z:\Builds\work\bcdbe6b8cc677a49\src\Lucene.Net.Core\Codecs\BlockTreeTermsWriter.cs:line
625
   at Lucene.Net.Codecs.BlockTreeTermsWriter.TermsWriter.FindBlocks.Freeze(UnCompiledNode`1[]
frontier, Int32 prefixLenPlus1, IntsRef lastInput) in z:\Builds\work\bcdbe6b8cc677a49\src\Lucene.Net.Core\Codecs\BlockTreeTermsWriter.cs:line
596
   at Lucene.Net.Util.Fst.Builder`1.DoFreezeTail(Int32 prefixLenPlus1) in z:\Builds\work\bcdbe6b8cc677a49\src\Lucene.Net.Core\Util\Fst\Builder.cs:line
239
   at Lucene.Net.Util.Fst.Builder`1.Finish() in z:\Builds\work\bcdbe6b8cc677a49\src\Lucene.Net.Core\Util\Fst\Builder.cs:line
518
   at Lucene.Net.Codecs.BlockTreeTermsWriter.TermsWriter.Finish(Int64 sumTotalTermFreq, Int64
sumDocFreq, Int32 docCount) in z:\Builds\work\bcdbe6b8cc677a49\src\Lucene.Net.Core\Codecs\BlockTreeTermsWriter.cs:line
1153
   at Lucene.Net.Index.FreqProxTermsWriterPerField.Flush(String fieldName, FieldsConsumer
consumer, SegmentWriteState state) in z:\Builds\work\bcdbe6b8cc677a49\src\Lucene.Net.Core\Index\FreqProxTermsWriterPerField.cs:line
666
   at Lucene.Net.Index.FreqProxTermsWriter.Flush(IDictionary`2 fieldsToFlush, SegmentWriteState
state) in z:\Builds\work\bcdbe6b8cc677a49\src\Lucene.Net.Core\Index\FreqProxTermsWriter.cs:line
87
   at Lucene.Net.Index.TermsHash.Flush(IDictionary`2 fieldsToFlush, SegmentWriteState state)
in z:\Builds\work\bcdbe6b8cc677a49\src\Lucene.Net.Core\Index\TermsHash.cs:line 130
   at Lucene.Net.Index.DocInverter.Flush(IDictionary`2 fieldsToFlush, SegmentWriteState state)
in z:\Builds\work\bcdbe6b8cc677a49\src\Lucene.Net.Core\Index\DocInverter.cs:line 53
   at Lucene.Net.Index.DocFieldProcessor.Flush(SegmentWriteState state) in z:\Builds\work\bcdbe6b8cc677a49\src\Lucene.Net.Core\Index\DocFieldProcessor.cs:line
82
   at Lucene.Net.Index.DocumentsWriterPerThread.Flush() in z:\Builds\work\bcdbe6b8cc677a49\src\Lucene.Net.Core\Index\DocumentsWriterPerThread.cs:line
550
   at Lucene.Net.Index.DocumentsWriter.DoFlush(DocumentsWriterPerThread flushingDWPT) in z:\Builds\work\bcdbe6b8cc677a49\src\Lucene.Net.Core\Index\DocumentsWriter.cs:line
635
   at Lucene.Net.Index.DocumentsWriter.FlushAllThreads(IndexWriter indexWriter) in z:\Builds\work\bcdbe6b8cc677a49\src\Lucene.Net.Core\Index\DocumentsWriter.cs:line
769
   at Lucene.Net.Index.IndexWriter.PrepareCommitInternal() in z:\Builds\work\bcdbe6b8cc677a49\src\Lucene.Net.Core\Index\IndexWriter.cs:line
3576
   at Lucene.Net.Index.IndexWriter.CommitInternal() in z:\Builds\work\bcdbe6b8cc677a49\src\Lucene.Net.Core\Index\IndexWriter.cs:line
3763
   at Lucene.Net.Index.RandomIndexWriter.MaybeCommit() in z:\Builds\work\bcdbe6b8cc677a49\src\Lucene.Net.TestFramework\Index\RandomIndexWriter.cs:line
228
   at Lucene.Net.Index.RandomIndexWriter.AddDocument(IEnumerable`1 doc, Analyzer a) in z:\Builds\work\bcdbe6b8cc677a49\src\Lucene.Net.TestFramework\Index\RandomIndexWriter.cs:line
150
   at Lucene.Net.Index.RandomIndexWriter.AddDocument(IEnumerable`1 doc) in z:\Builds\work\bcdbe6b8cc677a49\src\Lucene.Net.TestFramework\Index\RandomIndexWriter.cs:line
132
   at Lucene.Net.Analysis.BaseTokenStreamTestCase.CheckRandomData(Random random, Analyzer
a, Int32 iterations, Int32 maxWordLength, Boolean useCharFilter, Boolean simple, Boolean offsetsAreCorrect,
RandomIndexWriter iw) in z:\Builds\work\bcdbe6b8cc677a49\src\Lucene.Net.TestFramework\Analysis\BaseTokenStreamTestCase.cs:line
795
   at Lucene.Net.Analysis.BaseTokenStreamTestCase.AnalysisThread.Run() in z:\Builds\work\bcdbe6b8cc677a49\src\Lucene.Net.TestFramework\Analysis\BaseTokenStreamTestCase.cs:line
591
Unhandled exception in remote appdomain: System.IndexOutOfRangeException: Index was outside
the bounds of the array.
   at Lucene.Net.Util.Fst.BytesStore.ReverseBytesReaderAnonymousInner.ReadByte() in z:\Builds\work\bcdbe6b8cc677a49\src\Lucene.Net.Core\Util\Fst\BytesStore.cs:line
534
   at Lucene.Net.Util.Fst.FST`1.ReadNextRealArc(Arc`1 arc, BytesReader in) in z:\Builds\work\bcdbe6b8cc677a49\src\Lucene.Net.Core\Util\Fst\FST.cs:line
1198
   at Lucene.Net.Util.Fst.FST`1.ReadFirstRealTargetArc(Int64 node, Arc`1 arc, BytesReader
in) in z:\Builds\work\bcdbe6b8cc677a49\src\Lucene.Net.Core\Util\Fst\FST.cs:line 1077
   at Lucene.Net.Util.Fst.FST`1.ReadRootArcs(Arc`1[] arcs) in z:\Builds\work\bcdbe6b8cc677a49\src\Lucene.Net.Core\Util\Fst\FST.cs:line
395
   at Lucene.Net.Util.Fst.FST`1.CacheRootArcs() in z:\Builds\work\bcdbe6b8cc677a49\src\Lucene.Net.Core\Util\Fst\FST.cs:line
386
   at Lucene.Net.Util.Fst.FST`1.Finish(Int64 newStartNode) in z:\Builds\work\bcdbe6b8cc677a49\src\Lucene.Net.Core\Util\Fst\FST.cs:line
365
   at Lucene.Net.Util.Fst.Builder`1.Finish() in z:\Builds\work\bcdbe6b8cc677a49\src\Lucene.Net.Core\Util\Fst\Builder.cs:line
539
   at Lucene.Net.Codecs.BlockTreeTermsWriter.PendingBlock.CompileIndex(IList`1 floorBlocks,
RAMOutputStream scratchBytes) in z:\Builds\work\bcdbe6b8cc677a49\src\Lucene.Net.Core\Codecs\BlockTreeTermsWriter.cs:line
487
   at Lucene.Net.Codecs.BlockTreeTermsWriter.TermsWriter.WriteBlocks(IntsRef prevTerm, Int32
prefixLength, Int32 count) in z:\Builds\work\bcdbe6b8cc677a49\src\Lucene.Net.Core\Codecs\BlockTreeTermsWriter.cs:line
625
   at Lucene.Net.Codecs.BlockTreeTermsWriter.TermsWriter.FindBlocks.Freeze(UnCompiledNode`1[]
frontier, Int32 prefixLenPlus1, IntsRef lastInput) in z:\Builds\work\bcdbe6b8cc677a49\src\Lucene.Net.Core\Codecs\BlockTreeTermsWriter.cs:line
596
   at Lucene.Net.Util.Fst.Builder`1.DoFreezeTail(Int32 prefixLenPlus1) in z:\Builds\work\bcdbe6b8cc677a49\src\Lucene.Net.Core\Util\Fst\Builder.cs:line
239
   at Lucene.Net.Util.Fst.Builder`1.Finish() in z:\Builds\work\bcdbe6b8cc677a49\src\Lucene.Net.Core\Util\Fst\Builder.cs:line
518
   at Lucene.Net.Codecs.BlockTreeTermsWriter.TermsWriter.Finish(Int64 sumTotalTermFreq, Int64
sumDocFreq, Int32 docCount) in z:\Builds\work\bcdbe6b8cc677a49\src\Lucene.Net.Core\Codecs\BlockTreeTermsWriter.cs:line
1153
   at Lucene.Net.Index.FreqProxTermsWriterPerField.Flush(String fieldName, FieldsConsumer
consumer, SegmentWriteState state) in z:\Builds\work\bcdbe6b8cc677a49\src\Lucene.Net.Core\Index\FreqProxTermsWriterPerField.cs:line
666
   at Lucene.Net.Index.FreqProxTermsWriter.Flush(IDictionary`2 fieldsToFlush, SegmentWriteState
state) in z:\Builds\work\bcdbe6b8cc677a49\src\Lucene.Net.Core\Index\FreqProxTermsWriter.cs:line
87
   at Lucene.Net.Index.TermsHash.Flush(IDictionary`2 fieldsToFlush, SegmentWriteState state)
in z:\Builds\work\bcdbe6b8cc677a49\src\Lucene.Net.Core\Index\TermsHash.cs:line 130
   at Lucene.Net.Index.DocInverter.Flush(IDictionary`2 fieldsToFlush, SegmentWriteState state)
in z:\Builds\work\bcdbe6b8cc677a49\src\Lucene.Net.Core\Index\DocInverter.cs:line 53
   at Lucene.Net.Index.DocFieldProcessor.Flush(SegmentWriteState state) in z:\Builds\work\bcdbe6b8cc677a49\src\Lucene.Net.Core\Index\DocFieldProcessor.cs:line
82
   at Lucene.Net.Index.DocumentsWriterPerThread.Flush() in z:\Builds\work\bcdbe6b8cc677a49\src\Lucene.Net.Core\Index\DocumentsWriterPerThread.cs:line
550
   at Lucene.Net.Index.DocumentsWriter.DoFlush(DocumentsWriterPerThread flushingDWPT) in z:\Builds\work\bcdbe6b8cc677a49\src\Lucene.Net.Core\Index\DocumentsWriter.cs:line
635
   at Lucene.Net.Index.DocumentsWriter.FlushAllThreads(IndexWriter indexWriter) in z:\Builds\work\bcdbe6b8cc677a49\src\Lucene.Net.Core\Index\DocumentsWriter.cs:line
769
   at Lucene.Net.Index.IndexWriter.PrepareCommitInternal() in z:\Builds\work\bcdbe6b8cc677a49\src\Lucene.Net.Core\Index\IndexWriter.cs:line
3576
   at Lucene.Net.Index.IndexWriter.CommitInternal() in z:\Builds\work\bcdbe6b8cc677a49\src\Lucene.Net.Core\Index\IndexWriter.cs:line
3763
   at Lucene.Net.Index.RandomIndexWriter.MaybeCommit() in z:\Builds\work\bcdbe6b8cc677a49\src\Lucene.Net.TestFramework\Index\RandomIndexWriter.cs:line
228
   at Lucene.Net.Index.RandomIndexWriter.AddDocument(IEnumerable`1 doc, Analyzer a) in z:\Builds\work\bcdbe6b8cc677a49\src\Lucene.Net.TestFramework\Index\RandomIndexWriter.cs:line
150
   at Lucene.Net.Index.RandomIndexWriter.AddDocument(IEnumerable`1 doc) in z:\Builds\work\bcdbe6b8cc677a49\src\Lucene.Net.TestFramework\Index\RandomIndexWriter.cs:line
132
   at Lucene.Net.Analysis.BaseTokenStreamTestCase.CheckRandomData(Random random, Analyzer
a, Int32 iterations, Int32 maxWordLength, Boolean useCharFilter, Boolean simple, Boolean offsetsAreCorrect,
RandomIndexWriter iw) in z:\Builds\work\bcdbe6b8cc677a49\src\Lucene.Net.TestFramework\Analysis\BaseTokenStreamTestCase.cs:line
795
   at Lucene.Net.Analysis.BaseTokenStreamTestCase.AnalysisThread.Run() in z:\Builds\work\bcdbe6b8cc677a49\src\Lucene.Net.TestFramework\Analysis\BaseTokenStreamTestCase.cs:line
597
   at System.Threading.ThreadHelper.ThreadStart_Context(Object state)
   at System.Threading.ExecutionContext.RunInternal(ExecutionContext executionContext, ContextCallback
callback, Object state, Boolean preserveSyncCtx)
   at System.Threading.ExecutionContext.Run(ExecutionContext executionContext, ContextCallback
callback, Object state, Boolean preserveSyncCtx)
   at System.Threading.ExecutionContext.Run(ExecutionContext executionContext, ContextCallback
callback, Object state)
   at System.Threading.ThreadHelper.ThreadStart()
Lucene.Net.Tests.dll: Lucene.Net.Index.TestTransactions.TestTransactions_Mem (new) =================
Test(s) failed. Test exceeded Timeout value of 20000ms

see all newly failed tests: http://teamcity.codebetter.com/viewLog.html?buildId=182718&buildTypeId=LuceneNet_LuceneNetNightly
Changes included (1 change)
====================================================
Change 1581746794362424ec20bf1559abe793fa646c9b by laimis (1 file):
make sure base is not appended as char


see more information about changed files: http://teamcity.codebetter.com/viewLog.html?tab=buildChangesDiv&buildId=182718&buildTypeId=LuceneNet_LuceneNetNightly

============================================================================
Configure email notifications: http://teamcity.codebetter.com/profile.html?init=1&tab=userNotifications

Mime
  • Unnamed multipart/alternative (inline, None, 0 bytes)
View raw message