lucenenet-dev mailing list archives

Site index · List index
Message view « Date » · « Thread »
Top « Date » · « Thread »
From t.@codebetter.com
Subject [TeamCity, FAILED] Build Lucene.NET :: Lucene.NET Core #85
Date Sun, 11 Jan 2015 00:59:47 GMT
Build Lucene.NET :: Lucene.NET Core #85 failed (Tests failed: 245 (28 new), passed: 2221, ignored:
113).
Agent: JetBrains-dotnet-agent02
Build results: http://teamcity.codebetter.com/viewLog.html?buildId=178060&buildTypeId=LuceneNet_Core

Failed Tests Summary:
Newly failed tests (28 tests, alphabetically ordered)
==================================================================
Lucene.Net.Tests.dll: Lucene.Net.Codecs.Lucene42.TestLucene42DocValuesFormat.BaseDocValuesFormatTestCase.TestIntNumericsVsStoredFields
Lucene.Net.Tests.dll: Lucene.Net.Codecs.Lucene45.TestLucene45DocValuesFormat.BaseDocValuesFormatTestCase.TestIntMissingVsFieldCache
Lucene.Net.Tests.dll: Lucene.Net.Codecs.Perfield.TestPerFieldDocValuesFormat.BaseDocValuesFormatTestCase.TestIntMissingVsFieldCache
Lucene.Net.Tests.dll: Lucene.Net.Codecs.Perfield.TestPerFieldDocValuesFormat.BaseDocValuesFormatTestCase.TestLongMissingVsFieldCache
Lucene.Net.Tests.dll: Lucene.Net.Codecs.Perfield.TestPerFieldDocValuesFormat.BaseIndexFileFormatTestCase.TestMergeStability
Lucene.Net.Tests.dll: Lucene.Net.Index.TestBagOfPostings.Test
Lucene.Net.Tests.dll: Lucene.Net.Index.TestBinaryDocValuesUpdates.TestUpdateFewSegments
Lucene.Net.Tests.dll: Lucene.Net.Index.TestCheckIndex.TestDeletedDocs
Lucene.Net.Tests.dll: Lucene.Net.Index.TestConsistentFieldNumbers.TestSameFieldNumbersAcrossSegments
Lucene.Net.Tests.dll: Lucene.Net.Index.TestDeletionPolicy.TestKeepAllDeletionPolicy
Lucene.Net.Tests.dll: Lucene.Net.Index.TestDocValuesFormat.BaseDocValuesFormatTestCase.TestLongMissingVsFieldCache
Lucene.Net.Tests.dll: Lucene.Net.Index.TestDocValuesFormat.BaseDocValuesFormatTestCase.TestSortedSetVariableLengthVsStoredFields
Lucene.Net.Tests.dll: Lucene.Net.Index.TestDocValuesFormat.BaseDocValuesFormatTestCase.TestThreads2
Lucene.Net.Tests.dll: Lucene.Net.Index.TestIndexWriter.TestDeleteUnusedFiles
Lucene.Net.Tests.dll: Lucene.Net.Index.TestIndexWriterConfig.TestLiveChangeToCFS
Lucene.Net.Tests.dll: Lucene.Net.Index.TestIndexWriterExceptions.TestDocumentsWriterExceptions
Lucene.Net.Tests.dll: Lucene.Net.Index.TestIndexWriterExceptions.TestRandomExceptionDuringRollback
Lucene.Net.Tests.dll: Lucene.Net.Index.TestIndexWriterExceptions.TestRandomExceptionsThreads
Lucene.Net.Tests.dll: Lucene.Net.Index.TestIndexableField.TestArbitraryFields
Lucene.Net.Tests.dll: Lucene.Net.Index.TestOmitNorms.TestOmitNormsCombos
Lucene.Net.Tests.dll: Lucene.Net.Index.TestOmitPositions.TestNoPrxFile
Lucene.Net.Tests.dll: Lucene.Net.Index.TestParallelReaderEmptyIndex.TestEmptyIndexWithVectors
Lucene.Net.Tests.dll: Lucene.Net.Search.TestFilteredQuery.TestFilteredQuery_Mem
Lucene.Net.Tests.dll: Lucene.Net.Search.TestTopDocsMerge.TestSort_1
Lucene.Net.Tests.dll: Lucene.Net.Store.TestRAMDirectory.TestRAMDirectoryMem
Lucene.Net.Tests.dll: Lucene.Net.Store.TestRAMDirectory.TestRAMDirectorySize
Lucene.Net.Tests.dll: Lucene.Net.Store.TestRAMDirectory.TestSeekToEOFThenBack
Lucene.Net.Tests.dll: Lucene.Net.Util.TestNumericUtils.TestRandomSplit

Other failed tests (217 tests, alphabetically ordered, only first 100 shown)
==================================================================
Lucene.Net.Tests.dll: Lucene.Net.Analysis.TestGraphTokenizers.TestDoubleMockGraphTokenFilterRandom
Lucene.Net.Tests.dll: Lucene.Net.Analysis.TestLookaheadTokenFilter.TestNeverCallingPeek
Lucene.Net.Tests.dll: Lucene.Net.Analysis.TestLookaheadTokenFilter.TestRandomStrings
Lucene.Net.Tests.dll: Lucene.Net.Analysis.TestMockAnalyzer.TestRandomRegexps
Lucene.Net.Tests.dll: Lucene.Net.Codecs.Lucene3x.TestLucene3xTermVectorsFormat.BaseIndexFileFormatTestCase.TestMergeStability
Lucene.Net.Tests.dll: Lucene.Net.Codecs.Lucene40.TestLucene40DocValuesFormat.BaseDocValuesFormatTestCase.TestBytesTwoDocumentsMerged
Lucene.Net.Tests.dll: Lucene.Net.Codecs.Lucene40.TestLucene40DocValuesFormat.BaseDocValuesFormatTestCase.TestMissingSortedBytes
Lucene.Net.Tests.dll: Lucene.Net.Codecs.Lucene40.TestLucene40DocValuesFormat.BaseDocValuesFormatTestCase.TestRandomSortedBytes
Lucene.Net.Tests.dll: Lucene.Net.Codecs.Lucene40.TestLucene40DocValuesFormat.BaseDocValuesFormatTestCase.TestSortedMergeAwayAllValues
Lucene.Net.Tests.dll: Lucene.Net.Codecs.Lucene40.TestLucene40DocValuesFormat.BaseDocValuesFormatTestCase.TestTwoDocumentsMerged
Lucene.Net.Tests.dll: Lucene.Net.Codecs.Lucene41.TestBlockPostingsFormat2
Lucene.Net.Tests.dll: Lucene.Net.Codecs.Lucene41.TestBlockPostingsFormat3.Test
Lucene.Net.Tests.dll: Lucene.Net.Codecs.Lucene42.TestLucene42DocValuesFormat.BaseDocValuesFormatTestCase.TestBinaryFixedLengthVsStoredFields
Lucene.Net.Tests.dll: Lucene.Net.Codecs.Lucene42.TestLucene42DocValuesFormat.BaseDocValuesFormatTestCase.TestBinaryVariableLengthVsStoredFields
Lucene.Net.Tests.dll: Lucene.Net.Codecs.Lucene42.TestLucene42DocValuesFormat.BaseDocValuesFormatTestCase.TestBytes
Lucene.Net.Tests.dll: Lucene.Net.Codecs.Lucene42.TestLucene42DocValuesFormat.BaseDocValuesFormatTestCase.TestCodecUsesOwnSortedBytes
Lucene.Net.Tests.dll: Lucene.Net.Codecs.Lucene42.TestLucene42DocValuesFormat.BaseDocValuesFormatTestCase.TestCodecUsesOwnSortedBytesEachTime
Lucene.Net.Tests.dll: Lucene.Net.Codecs.Lucene42.TestLucene42DocValuesFormat.BaseDocValuesFormatTestCase.TestEmptyBinaryValueOnPageSizes
Lucene.Net.Tests.dll: Lucene.Net.Codecs.Lucene42.TestLucene42DocValuesFormat.BaseDocValuesFormatTestCase.TestEmptySortedBytes
Lucene.Net.Tests.dll: Lucene.Net.Codecs.Lucene42.TestLucene42DocValuesFormat.BaseDocValuesFormatTestCase.TestHugeBinaryValueLimit
Lucene.Net.Tests.dll: Lucene.Net.Codecs.Lucene42.TestLucene42DocValuesFormat.BaseDocValuesFormatTestCase.TestMissingSortedBytes
Lucene.Net.Tests.dll: Lucene.Net.Codecs.Lucene42.TestLucene42DocValuesFormat.BaseDocValuesFormatTestCase.TestOneFloat
Lucene.Net.Tests.dll: Lucene.Net.Codecs.Lucene42.TestLucene42DocValuesFormat.BaseDocValuesFormatTestCase.TestOneNumber
Lucene.Net.Tests.dll: Lucene.Net.Codecs.Lucene42.TestLucene42DocValuesFormat.BaseDocValuesFormatTestCase.TestRandomSortedBytes
Lucene.Net.Tests.dll: Lucene.Net.Codecs.Lucene42.TestLucene42DocValuesFormat.BaseDocValuesFormatTestCase.TestSortedBytes
Lucene.Net.Tests.dll: Lucene.Net.Codecs.Lucene42.TestLucene42DocValuesFormat.BaseDocValuesFormatTestCase.TestSortedBytesThreeDocuments
Lucene.Net.Tests.dll: Lucene.Net.Codecs.Lucene42.TestLucene42DocValuesFormat.BaseDocValuesFormatTestCase.TestSortedBytesTwoDocuments
Lucene.Net.Tests.dll: Lucene.Net.Codecs.Lucene42.TestLucene42DocValuesFormat.BaseDocValuesFormatTestCase.TestSortedBytesTwoDocumentsMerged
Lucene.Net.Tests.dll: Lucene.Net.Codecs.Lucene42.TestLucene42DocValuesFormat.BaseDocValuesFormatTestCase.TestSortedFixedLengthVsFieldCache
Lucene.Net.Tests.dll: Lucene.Net.Codecs.Lucene42.TestLucene42DocValuesFormat.BaseDocValuesFormatTestCase.TestSortedFixedLengthVsStoredFields
Lucene.Net.Tests.dll: Lucene.Net.Codecs.Lucene42.TestLucene42DocValuesFormat.BaseDocValuesFormatTestCase.TestSortedMergeAwayAllValues
Lucene.Net.Tests.dll: Lucene.Net.Codecs.Lucene42.TestLucene42DocValuesFormat.BaseDocValuesFormatTestCase.TestSortedSetFixedLengthSingleValuedVsStoredFields
Lucene.Net.Tests.dll: Lucene.Net.Codecs.Lucene42.TestLucene42DocValuesFormat.BaseDocValuesFormatTestCase.TestSortedSetFixedLengthVsStoredFields
Lucene.Net.Tests.dll: Lucene.Net.Codecs.Lucene42.TestLucene42DocValuesFormat.BaseDocValuesFormatTestCase.TestSortedSetFixedLengthVsUninvertedField
Lucene.Net.Tests.dll: Lucene.Net.Codecs.Lucene42.TestLucene42DocValuesFormat.BaseDocValuesFormatTestCase.TestSortedSetMergeAwayAllValues
Lucene.Net.Tests.dll: Lucene.Net.Codecs.Lucene42.TestLucene42DocValuesFormat.BaseDocValuesFormatTestCase.TestSortedSetOneValue
Lucene.Net.Tests.dll: Lucene.Net.Codecs.Lucene42.TestLucene42DocValuesFormat.BaseDocValuesFormatTestCase.TestSortedSetTermsEnum
Lucene.Net.Tests.dll: Lucene.Net.Codecs.Lucene42.TestLucene42DocValuesFormat.BaseDocValuesFormatTestCase.TestSortedSetThreeValuesTwoDocs
Lucene.Net.Tests.dll: Lucene.Net.Codecs.Lucene42.TestLucene42DocValuesFormat.BaseDocValuesFormatTestCase.TestSortedSetTwoDocumentsFirstMissing
Lucene.Net.Tests.dll: Lucene.Net.Codecs.Lucene42.TestLucene42DocValuesFormat.BaseDocValuesFormatTestCase.TestSortedSetTwoDocumentsFirstMissingMerge
Lucene.Net.Tests.dll: Lucene.Net.Codecs.Lucene42.TestLucene42DocValuesFormat.BaseDocValuesFormatTestCase.TestSortedSetTwoDocumentsLastMissing
Lucene.Net.Tests.dll: Lucene.Net.Codecs.Lucene42.TestLucene42DocValuesFormat.BaseDocValuesFormatTestCase.TestSortedSetTwoDocumentsLastMissingMerge
Lucene.Net.Tests.dll: Lucene.Net.Codecs.Lucene42.TestLucene42DocValuesFormat.BaseDocValuesFormatTestCase.TestSortedSetTwoDocumentsMerged
Lucene.Net.Tests.dll: Lucene.Net.Codecs.Lucene42.TestLucene42DocValuesFormat.BaseDocValuesFormatTestCase.TestSortedSetTwoFields
Lucene.Net.Tests.dll: Lucene.Net.Codecs.Lucene42.TestLucene42DocValuesFormat.BaseDocValuesFormatTestCase.TestSortedSetTwoValues
Lucene.Net.Tests.dll: Lucene.Net.Codecs.Lucene42.TestLucene42DocValuesFormat.BaseDocValuesFormatTestCase.TestSortedSetTwoValuesUnordered
Lucene.Net.Tests.dll: Lucene.Net.Codecs.Lucene42.TestLucene42DocValuesFormat.BaseDocValuesFormatTestCase.TestSortedSetVariableLengthSingleValuedVsStoredFields
Lucene.Net.Tests.dll: Lucene.Net.Codecs.Lucene42.TestLucene42DocValuesFormat.BaseDocValuesFormatTestCase.TestSortedSetVariableLengthVsStoredFields
Lucene.Net.Tests.dll: Lucene.Net.Codecs.Lucene42.TestLucene42DocValuesFormat.BaseDocValuesFormatTestCase.TestSortedSetVariableLengthVsUninvertedField
Lucene.Net.Tests.dll: Lucene.Net.Codecs.Lucene42.TestLucene42DocValuesFormat.BaseDocValuesFormatTestCase.TestSortedTermsEnum
Lucene.Net.Tests.dll: Lucene.Net.Codecs.Lucene42.TestLucene42DocValuesFormat.BaseDocValuesFormatTestCase.TestSortedVariableLengthVsFieldCache
Lucene.Net.Tests.dll: Lucene.Net.Codecs.Lucene42.TestLucene42DocValuesFormat.BaseDocValuesFormatTestCase.TestSortedVariableLengthVsStoredFields
Lucene.Net.Tests.dll: Lucene.Net.Codecs.Lucene42.TestLucene42DocValuesFormat.BaseDocValuesFormatTestCase.TestThreads
Lucene.Net.Tests.dll: Lucene.Net.Codecs.Lucene42.TestLucene42DocValuesFormat.BaseDocValuesFormatTestCase.TestThreeFieldsMixed
Lucene.Net.Tests.dll: Lucene.Net.Codecs.Lucene42.TestLucene42DocValuesFormat.BaseDocValuesFormatTestCase.TestThreeFieldsMixed2
Lucene.Net.Tests.dll: Lucene.Net.Codecs.Lucene42.TestLucene42DocValuesFormat.BaseDocValuesFormatTestCase.TestTwoBinaryValues
Lucene.Net.Tests.dll: Lucene.Net.Codecs.Lucene42.TestLucene42DocValuesFormat.BaseDocValuesFormatTestCase.TestTwoFieldsMixed
Lucene.Net.Tests.dll: Lucene.Net.Codecs.Lucene42.TestLucene42DocValuesFormat.BaseDocValuesFormatTestCase.TestTwoNumbers
Lucene.Net.Tests.dll: Lucene.Net.Codecs.Lucene42.TestLucene42DocValuesFormat.BaseDocValuesFormatTestCase.TestVeryLargeButLegalSortedBytes
Lucene.Net.Tests.dll: Lucene.Net.Codecs.Lucene42.TestLucene42DocValuesFormat.BaseIndexFileFormatTestCase.TestMergeStability
Lucene.Net.Tests.dll: Lucene.Net.Codecs.Lucene45.TestLucene45DocValuesFormat.BaseDocValuesFormatTestCase.TestSortedMergeAwayAllValues
Lucene.Net.Tests.dll: Lucene.Net.Codecs.Lucene45.TestLucene45DocValuesFormat.BaseDocValuesFormatTestCase.TestSortedSetFixedLengthVsUninvertedField
Lucene.Net.Tests.dll: Lucene.Net.Codecs.Lucene45.TestLucene45DocValuesFormat.BaseDocValuesFormatTestCase.TestSortedSetMergeAwayAllValues
Lucene.Net.Tests.dll: Lucene.Net.Codecs.Lucene45.TestLucene45DocValuesFormat.BaseDocValuesFormatTestCase.TestSortedSetThreeValuesTwoDocs
Lucene.Net.Tests.dll: Lucene.Net.Codecs.Lucene45.TestLucene45DocValuesFormat.BaseDocValuesFormatTestCase.TestSortedSetTwoDocumentsLastMissingMerge
Lucene.Net.Tests.dll: Lucene.Net.Codecs.Lucene45.TestLucene45DocValuesFormat.BaseDocValuesFormatTestCase.TestSortedSetTwoDocumentsMerged
Lucene.Net.Tests.dll: Lucene.Net.Codecs.Lucene45.TestLucene45DocValuesFormat.BaseDocValuesFormatTestCase.TestSortedSetVariableLengthVsUninvertedField
Lucene.Net.Tests.dll: Lucene.Net.Codecs.Lucene45.TestLucene45DocValuesFormat.BaseDocValuesFormatTestCase.TestThreeBytesOneMissingWithMerging
Lucene.Net.Tests.dll: Lucene.Net.Codecs.Lucene45.TestLucene45DocValuesFormat.BaseDocValuesFormatTestCase.TestThreeNumbersOneMissingWithMerging
Lucene.Net.Tests.dll: Lucene.Net.Codecs.Lucene45.TestLucene45DocValuesFormat.BaseDocValuesFormatTestCase.TestTwoBytesOneMissing
Lucene.Net.Tests.dll: Lucene.Net.Codecs.Lucene45.TestLucene45DocValuesFormat.BaseDocValuesFormatTestCase.TestTwoBytesOneMissingWithMerging
Lucene.Net.Tests.dll: Lucene.Net.Codecs.Lucene45.TestLucene45DocValuesFormat.BaseDocValuesFormatTestCase.TestTwoDocumentsMerged



Newly failed tests details (only first 3 failures shown here)
==================================================================
Lucene.Net.Tests.dll: Lucene.Net.Codecs.Lucene42.TestLucene42DocValuesFormat.BaseDocValuesFormatTestCase.TestIntNumericsVsStoredFields
(new) =================
Test(s) failed. System.Exception : CheckIndex failed
   at Lucene.Net.Util.TestUtil.CheckIndex(Directory dir, Boolean crossCheckTermVectors) in
z:\Builds\work\bcdbe6b8cc677a49\src\Lucene.Net.TestFramework\Util\TestUtil.cs:line 257
   at Lucene.Net.Store.MockDirectoryWrapper.Dispose() in z:\Builds\work\bcdbe6b8cc677a49\src\Lucene.Net.TestFramework\Store\MockDirectoryWrapper.cs:line
937
   at Lucene.Net.Index.BaseDocValuesFormatTestCase.DoTestNumericsVsStoredFields(LongProducer
longs) in z:\Builds\work\bcdbe6b8cc677a49\src\Lucene.Net.TestFramework\Index\BaseDocValuesFormatTestCase.cs:line
1400
   at Lucene.Net.Index.BaseDocValuesFormatTestCase.TestIntNumericsVsStoredFields() in z:\Builds\work\bcdbe6b8cc677a49\src\Lucene.Net.TestFramework\Index\BaseDocValuesFormatTestCase.cs:line
1547
------- Stderr: -------
CheckIndex failed
´╗┐Segments file=segments_1 numSegments=4 version=4.8 format=
  1 of 4: name=_0 docCount=125
    codec=Lucene42
    compound=False
    numFiles=9
    size (MB)=0.00195598602294922
    diagnostics = System.Collections.Generic.Dictionary`2[System.String,System.String]
    no deletions
    test: open reader.........OK
    test: check integrity.....OK
    test: check live docs.....OK
    test: fields..............OK [3 fields]
    test: field norms.........OK [0 fields]
    test: terms, freq, prox...OK [126 terms; 250 terms/docs pairs; 0 tokens]
    test: stored fields.......OK [125 total field count; avg 1 fields per doc]
    test: term vectors........OK [0 total vector count; avg 0 term/freq vector fields per
doc]
    test: docvalues...........ERROR [id docsWithField does not exist]
   at Lucene.Net.Index.CheckIndex.CheckDocValues(FieldInfo fi, AtomicReader reader, DocValuesStatus
status) in z:\Builds\work\bcdbe6b8cc677a49\src\Lucene.Net.Core\Index\CheckIndex.cs:line 1909
   at Lucene.Net.Index.CheckIndex.TestDocValues(AtomicReader reader, StreamWriter infoStream)
in z:\Builds\work\bcdbe6b8cc677a49\src\Lucene.Net.Core\Index\CheckIndex.cs:line 1706
FAILED
    WARNING: fixIndex() would remove reference to this segment; full exception:
   at Lucene.Net.Index.CheckIndex.DoCheckIndex(IList`1 onlySegments) in z:\Builds\work\bcdbe6b8cc677a49\src\Lucene.Net.Core\Index\CheckIndex.cs:line
828
  2 of 4: name=_1 docCount=125
    codec=Lucene42
    compound=False
    numFiles=10
    size (MB)=0.00206851959228516
    diagnostics = System.Collections.Generic.Dictionary`2[System.String,System.String]
    has deletions [delGen=1]
    test: open reader.........OK
    test: check integrity.....OK
    test: check live docs.....OK [1 deleted docs]
    test: fields..............OK [3 fields]
    test: field norms.........OK [0 fields]
    test: terms, freq, prox...OK [125 terms; 248 terms/docs pairs; 0 tokens]
    test (ignoring deletes): terms, freq, prox...OK [126 terms; 250 terms/docs pairs; 0 tokens]
    test: stored fields.......OK [124 total field count; avg 1 fields per doc]
    test: term vectors........OK [0 total vector count; avg 0 term/freq vector fields per
doc]
    test: docvalues...........ERROR [id docsWithField does not exist]
   at Lucene.Net.Index.CheckIndex.CheckDocValues(FieldInfo fi, AtomicReader reader, DocValuesStatus
status) in z:\Builds\work\bcdbe6b8cc677a49\src\Lucene.Net.Core\Index\CheckIndex.cs:line 1909
   at Lucene.Net.Index.CheckIndex.TestDocValues(AtomicReader reader, StreamWriter infoStream)
in z:\Builds\work\bcdbe6b8cc677a49\src\Lucene.Net.Core\Index\CheckIndex.cs:line 1706
FAILED
    WARNING: fixIndex() would remove reference to this segment; full exception:
   at Lucene.Net.Index.CheckIndex.DoCheckIndex(IList`1 onlySegments) in z:\Builds\work\bcdbe6b8cc677a49\src\Lucene.Net.Core\Index\CheckIndex.cs:line
828
  3 of 4: name=_2 docCount=125
    codec=Lucene42
    compound=False
    numFiles=9
    size (MB)=0.00200271606445313
    diagnostics = System.Collections.Generic.Dictionary`2[System.String,System.String]
    no deletions
    test: open reader.........OK
    test: check integrity.....OK
    test: check live docs.....OK
    test: fields..............OK [3 fields]
    test: field norms.........OK [0 fields]
    test: terms, freq, prox...OK [126 terms; 250 terms/docs pairs; 0 tokens]
    test: stored fields.......OK [125 total field count; avg 1 fields per doc]
    test: term vectors........OK [0 total vector count; avg 0 term/freq vector fields per
doc]
    test: docvalues...........ERROR [id docsWithField does not exist]
   at Lucene.Net.Index.CheckIndex.CheckDocValues(FieldInfo fi, AtomicReader reader, DocValuesStatus
status) in z:\Builds\work\bcdbe6b8cc677a49\src\Lucene.Net.Core\Index\CheckIndex.cs:line 1909
   at Lucene.Net.Index.CheckIndex.TestDocValues(AtomicReader reader, StreamWriter infoStream)
in z:\Builds\work\bcdbe6b8cc677a49\src\Lucene.Net.Core\Index\CheckIndex.cs:line 1706
FAILED
    WARNING: fixIndex() would remove reference to this segment; full exception:
   at Lucene.Net.Index.CheckIndex.DoCheckIndex(IList`1 onlySegments) in z:\Builds\work\bcdbe6b8cc677a49\src\Lucene.Net.Core\Index\CheckIndex.cs:line
828
  4 of 4: name=_3 docCount=49
    codec=Lucene42
    compound=False
    numFiles=9
    size (MB)=0.00147914886474609
    diagnostics = System.Collections.Generic.Dictionary`2[System.String,System.String]
    no deletions
    test: open reader.........OK
    test: check integrity.....OK
    test: check live docs.....OK
    test: fields..............OK [3 fields]
    test: field norms.........OK [0 fields]
    test: terms, freq, prox...OK [50 terms; 98 terms/docs pairs; 0 tokens]
    test: stored fields.......OK [49 total field count; avg 1 fields per doc]
    test: term vectors........OK [0 total vector count; avg 0 term/freq vector fields per
doc]
    test: docvalues...........ERROR [id docsWithField does not exist]
   at Lucene.Net.Index.CheckIndex.CheckDocValues(FieldInfo fi, AtomicReader reader, DocValuesStatus
status) in z:\Builds\work\bcdbe6b8cc677a49\src\Lucene.Net.Core\Index\CheckIndex.cs:line 1909
   at Lucene.Net.Index.CheckIndex.TestDocValues(AtomicReader reader, StreamWriter infoStream)
in z:\Builds\work\bcdbe6b8cc677a49\src\Lucene.Net.Core\Index\CheckIndex.cs:line 1706
FAILED
    WARNING: fixIndex() would remove reference to this segment; full exception:
   at Lucene.Net.Index.CheckIndex.DoCheckIndex(IList`1 onlySegments) in z:\Builds\work\bcdbe6b8cc677a49\src\Lucene.Net.Core\Index\CheckIndex.cs:line
828
WARNING: 4 broken segments (containing 423 documents) detected
Lucene.Net.Tests.dll: Lucene.Net.Codecs.Lucene45.TestLucene45DocValuesFormat.BaseDocValuesFormatTestCase.TestIntMissingVsFieldCache
(new) =================
Test(s) failed.   Expected: False
  But was:  True

   at NUnit.Framework.Assert.That(Object actual, IResolveConstraint expression, String message,
Object[] args)
   at NUnit.Framework.Assert.AreEqual(Object expected, Object actual)
   at Lucene.Net.Index.BaseDocValuesFormatTestCase.AssertEquals(Bits expected, Bits actual)
in z:\Builds\work\bcdbe6b8cc677a49\src\Lucene.Net.TestFramework\Index\BaseDocValuesFormatTestCase.cs:line
2445
   at Lucene.Net.Index.BaseDocValuesFormatTestCase.DoTestMissingVsFieldCache(LongProducer
longs) in z:\Builds\work\bcdbe6b8cc677a49\src\Lucene.Net.TestFramework\Index\BaseDocValuesFormatTestCase.cs:line
1485
   at Lucene.Net.Index.BaseDocValuesFormatTestCase.TestIntMissingVsFieldCache() in z:\Builds\work\bcdbe6b8cc677a49\src\Lucene.Net.TestFramework\Index\BaseDocValuesFormatTestCase.cs:line
1557
Lucene.Net.Tests.dll: Lucene.Net.Codecs.Perfield.TestPerFieldDocValuesFormat.BaseDocValuesFormatTestCase.TestIntMissingVsFieldCache
(new) =================
Test(s) failed.   Expected: False
  But was:  True

   at NUnit.Framework.Assert.That(Object actual, IResolveConstraint expression, String message,
Object[] args)
   at NUnit.Framework.Assert.AreEqual(Object expected, Object actual)
   at Lucene.Net.Index.BaseDocValuesFormatTestCase.AssertEquals(Bits expected, Bits actual)
in z:\Builds\work\bcdbe6b8cc677a49\src\Lucene.Net.TestFramework\Index\BaseDocValuesFormatTestCase.cs:line
2445
   at Lucene.Net.Index.BaseDocValuesFormatTestCase.DoTestMissingVsFieldCache(LongProducer
longs) in z:\Builds\work\bcdbe6b8cc677a49\src\Lucene.Net.TestFramework\Index\BaseDocValuesFormatTestCase.cs:line
1485
   at Lucene.Net.Index.BaseDocValuesFormatTestCase.TestIntMissingVsFieldCache() in z:\Builds\work\bcdbe6b8cc677a49\src\Lucene.Net.TestFramework\Index\BaseDocValuesFormatTestCase.cs:line
1557
see all newly failed tests: http://teamcity.codebetter.com/viewLog.html?buildId=178060&buildTypeId=LuceneNet_Core
Changes included (6 changes)
====================================================
Change 6c653073c91d7979c68a73e1ed6f6f0429297080 by itamar (0 file):
Merge remote-tracking branch 'laimis/FieldCacheSanitychecker_CompositeReaderContext_fixes'


Change 6aef0b085aa84fd8cc9b1471cfff18ae09eb8ad0 by laimis (3 files):
without using UnmodifiableList


Change da67eb0638e35a210c032f8ab6bc56702e227d36 by laimis (3 files):
use UnmodifiedList as a reference to children array


Change 08fd1990299bbbb1d4128fc71960f3069fb1556e by laimis (1 file):
second param is number of items not max range


Change 7970bb64e609e6feb63030fcfcfe2718291706c0 by laimis (1 file):
use appropriate precision digits


Change b46c67ca7344016a384dc6a101b2a1530fb6503d by itamar (2 files):
Use List.AsReadOnly() when possible


see more information about changed files: http://teamcity.codebetter.com/viewLog.html?tab=buildChangesDiv&buildId=178060&buildTypeId=LuceneNet_Core

============================================================================
Configure email notifications: http://teamcity.codebetter.com/profile.html?init=1&tab=userNotifications

Mime
  • Unnamed multipart/alternative (inline, None, 0 bytes)
View raw message