lucenenet-dev mailing list archives

Site index · List index
Message view « Date » · « Thread »
Top « Date » · « Thread »
From t.@codebetter.com
Subject [TeamCity, FAILED] Build Lucene.NET :: Lucene.NET Core #79
Date Wed, 07 Jan 2015 01:56:21 GMT
Build Lucene.NET :: Lucene.NET Core #79 failed (Tests failed: 263 (28 new), passed: 2204, ignored:
113).
Agent: JetBrains-dotnet-agent02
Build results: http://teamcity.codebetter.com/viewLog.html?buildId=177711&buildTypeId=LuceneNet_Core

Failed Tests Summary:
Newly failed tests (28 tests, alphabetically ordered)
==================================================================
Lucene.Net.Tests.dll: Lucene.Net.Analysis.TestLookaheadTokenFilter.TestNeverCallingPeek
Lucene.Net.Tests.dll: Lucene.Net.Codecs.Lucene40.TestLucene40DocValuesFormat.BaseDocValuesFormatTestCase.TestByteNumericsVsStoredFields
Lucene.Net.Tests.dll: Lucene.Net.Codecs.Lucene42.TestLucene42DocValuesFormat.BaseDocValuesFormatTestCase.TestGCDCompression
Lucene.Net.Tests.dll: Lucene.Net.Codecs.Lucene42.TestLucene42DocValuesFormat.BaseDocValuesFormatTestCase.TestLongNumericsVsStoredFields
Lucene.Net.Tests.dll: Lucene.Net.Codecs.Lucene45.TestLucene45DocValuesFormat.BaseDocValuesFormatTestCase.TestSortedSetFixedLengthVsStoredFields
Lucene.Net.Tests.dll: Lucene.Net.Codecs.Lucene45.TestLucene45DocValuesFormat.BaseDocValuesFormatTestCase.TestSortedSetTwoDocumentsFirstMissingMerge
Lucene.Net.Tests.dll: Lucene.Net.Codecs.Lucene45.TestLucene45DocValuesFormat.BaseDocValuesFormatTestCase.TestTwoDocumentsMerged
Lucene.Net.Tests.dll: Lucene.Net.Codecs.Perfield.TestPerFieldDocValuesFormat.BaseIndexFileFormatTestCase.TestMergeStability
Lucene.Net.Tests.dll: Lucene.Net.Index.TestAddIndexes.TestAddIndexesWithThreads
Lucene.Net.Tests.dll: Lucene.Net.Index.TestBinaryDocValuesUpdates.TestUpdateOldSegments
Lucene.Net.Tests.dll: Lucene.Net.Index.TestDocValuesFormat.BaseDocValuesFormatTestCase.TestHugeBinaryValues
Lucene.Net.Tests.dll: Lucene.Net.Index.TestDocValuesFormat.BaseDocValuesFormatTestCase.TestSortedBytesTwoDocumentsMerged
Lucene.Net.Tests.dll: Lucene.Net.Index.TestDocValuesFormat.BaseDocValuesFormatTestCase.TestTwoDocumentsMerged
Lucene.Net.Tests.dll: Lucene.Net.Index.TestIndexWriterExceptions.TestRandomExceptions
Lucene.Net.Tests.dll: Lucene.Net.Index.TestIndexWriterReader.TestAddIndexesAndDoDeletesThreads
Lucene.Net.Tests.dll: Lucene.Net.Index.TestMultiDocValues.TestSortedSetWithDups
Lucene.Net.Tests.dll: Lucene.Net.Index.TestMultiDocValues.TestSortedWithLotsOfDups
Lucene.Net.Tests.dll: Lucene.Net.Index.TestOmitTf.TestBasic
Lucene.Net.Tests.dll: Lucene.Net.Index.TestOmitTf.TestNoPrxFile
Lucene.Net.Tests.dll: Lucene.Net.Index.TestSegmentTermDocs.TestSkipTo
Lucene.Net.Tests.dll: Lucene.Net.Search.TestLiveFieldValues.Test
Lucene.Net.Tests.dll: Lucene.Net.Search.TestSimpleExplanations.TestFQ4
Lucene.Net.Tests.dll: Lucene.Net.Search.TestSimpleExplanations.TestFQ6
Lucene.Net.Tests.dll: Lucene.Net.Search.TestSimpleExplanations.TestT2
Lucene.Net.Tests.dll: Lucene.Net.Store.TestLockFactory.TestStressLocks
Lucene.Net.Tests.dll: Lucene.Net.Util.TestFixedBitSet.TestSmall
Lucene.Net.Tests.dll: Lucene.Net.Util.TestIndexableBinaryStringTools.TestEncodedSortability
Lucene.Net.Tests.dll: Lucene.Net.Util.TestPagedBytes.TestDataInputOutput

Other failed tests (235 tests, alphabetically ordered, only first 100 shown)
==================================================================
Lucene.Net.Tests.dll: Lucene.Net.Analysis.TestLookaheadTokenFilter.TestRandomStrings
Lucene.Net.Tests.dll: Lucene.Net.Analysis.TestMockAnalyzer.TestRandomRegexps
Lucene.Net.Tests.dll: Lucene.Net.Codecs.Compressing.TestFastCompressionMode.AbstractTestCompressionMode.TestConstant
Lucene.Net.Tests.dll: Lucene.Net.Codecs.Compressing.TestFastCompressionMode.AbstractTestLZ4CompressionMode.TestLongLiterals
Lucene.Net.Tests.dll: Lucene.Net.Codecs.Compressing.TestFastDecompressionMode.AbstractTestCompressionMode.TestConstant
Lucene.Net.Tests.dll: Lucene.Net.Codecs.Compressing.TestFastDecompressionMode.AbstractTestLZ4CompressionMode.TestLongLiterals
Lucene.Net.Tests.dll: Lucene.Net.Codecs.Compressing.TestFastDecompressionMode.AbstractTestLZ4CompressionMode.TestLongMatchs
Lucene.Net.Tests.dll: Lucene.Net.Codecs.Lucene40.TestLucene40DocValuesFormat.BaseDocValuesFormatTestCase.TestBytesTwoDocumentsMerged
Lucene.Net.Tests.dll: Lucene.Net.Codecs.Lucene40.TestLucene40DocValuesFormat.BaseDocValuesFormatTestCase.TestMissingSortedBytes
Lucene.Net.Tests.dll: Lucene.Net.Codecs.Lucene40.TestLucene40DocValuesFormat.BaseDocValuesFormatTestCase.TestRandomSortedBytes
Lucene.Net.Tests.dll: Lucene.Net.Codecs.Lucene40.TestLucene40DocValuesFormat.BaseDocValuesFormatTestCase.TestSortedBytesTwoDocumentsMerged
Lucene.Net.Tests.dll: Lucene.Net.Codecs.Lucene40.TestLucene40DocValuesFormat.BaseDocValuesFormatTestCase.TestSortedMergeAwayAllValues
Lucene.Net.Tests.dll: Lucene.Net.Codecs.Lucene40.TestLucene40DocValuesFormat.BaseDocValuesFormatTestCase.TestTwoDocumentsMerged
Lucene.Net.Tests.dll: Lucene.Net.Codecs.Lucene41.TestBlockPostingsFormat2
Lucene.Net.Tests.dll: Lucene.Net.Codecs.Lucene41.TestBlockPostingsFormat3.Test
Lucene.Net.Tests.dll: Lucene.Net.Codecs.Lucene42.TestLucene42DocValuesFormat.BaseDocValuesFormatTestCase.TestBinaryFixedLengthVsStoredFields
Lucene.Net.Tests.dll: Lucene.Net.Codecs.Lucene42.TestLucene42DocValuesFormat.BaseDocValuesFormatTestCase.TestBinaryVariableLengthVsStoredFields
Lucene.Net.Tests.dll: Lucene.Net.Codecs.Lucene42.TestLucene42DocValuesFormat.BaseDocValuesFormatTestCase.TestBytes
Lucene.Net.Tests.dll: Lucene.Net.Codecs.Lucene42.TestLucene42DocValuesFormat.BaseDocValuesFormatTestCase.TestCodecUsesOwnSortedBytes
Lucene.Net.Tests.dll: Lucene.Net.Codecs.Lucene42.TestLucene42DocValuesFormat.BaseDocValuesFormatTestCase.TestCodecUsesOwnSortedBytesEachTime
Lucene.Net.Tests.dll: Lucene.Net.Codecs.Lucene42.TestLucene42DocValuesFormat.BaseDocValuesFormatTestCase.TestEmptyBinaryValueOnPageSizes
Lucene.Net.Tests.dll: Lucene.Net.Codecs.Lucene42.TestLucene42DocValuesFormat.BaseDocValuesFormatTestCase.TestEmptySortedBytes
Lucene.Net.Tests.dll: Lucene.Net.Codecs.Lucene42.TestLucene42DocValuesFormat.BaseDocValuesFormatTestCase.TestHugeBinaryValueLimit
Lucene.Net.Tests.dll: Lucene.Net.Codecs.Lucene42.TestLucene42DocValuesFormat.BaseDocValuesFormatTestCase.TestMissingSortedBytes
Lucene.Net.Tests.dll: Lucene.Net.Codecs.Lucene42.TestLucene42DocValuesFormat.BaseDocValuesFormatTestCase.TestOneFloat
Lucene.Net.Tests.dll: Lucene.Net.Codecs.Lucene42.TestLucene42DocValuesFormat.BaseDocValuesFormatTestCase.TestOneNumber
Lucene.Net.Tests.dll: Lucene.Net.Codecs.Lucene42.TestLucene42DocValuesFormat.BaseDocValuesFormatTestCase.TestRandomSortedBytes
Lucene.Net.Tests.dll: Lucene.Net.Codecs.Lucene42.TestLucene42DocValuesFormat.BaseDocValuesFormatTestCase.TestSortedBytes
Lucene.Net.Tests.dll: Lucene.Net.Codecs.Lucene42.TestLucene42DocValuesFormat.BaseDocValuesFormatTestCase.TestSortedBytesThreeDocuments
Lucene.Net.Tests.dll: Lucene.Net.Codecs.Lucene42.TestLucene42DocValuesFormat.BaseDocValuesFormatTestCase.TestSortedBytesTwoDocuments
Lucene.Net.Tests.dll: Lucene.Net.Codecs.Lucene42.TestLucene42DocValuesFormat.BaseDocValuesFormatTestCase.TestSortedBytesTwoDocumentsMerged
Lucene.Net.Tests.dll: Lucene.Net.Codecs.Lucene42.TestLucene42DocValuesFormat.BaseDocValuesFormatTestCase.TestSortedFixedLengthVsFieldCache
Lucene.Net.Tests.dll: Lucene.Net.Codecs.Lucene42.TestLucene42DocValuesFormat.BaseDocValuesFormatTestCase.TestSortedFixedLengthVsStoredFields
Lucene.Net.Tests.dll: Lucene.Net.Codecs.Lucene42.TestLucene42DocValuesFormat.BaseDocValuesFormatTestCase.TestSortedMergeAwayAllValues
Lucene.Net.Tests.dll: Lucene.Net.Codecs.Lucene42.TestLucene42DocValuesFormat.BaseDocValuesFormatTestCase.TestSortedSetFixedLengthSingleValuedVsStoredFields
Lucene.Net.Tests.dll: Lucene.Net.Codecs.Lucene42.TestLucene42DocValuesFormat.BaseDocValuesFormatTestCase.TestSortedSetFixedLengthVsStoredFields
Lucene.Net.Tests.dll: Lucene.Net.Codecs.Lucene42.TestLucene42DocValuesFormat.BaseDocValuesFormatTestCase.TestSortedSetFixedLengthVsUninvertedField
Lucene.Net.Tests.dll: Lucene.Net.Codecs.Lucene42.TestLucene42DocValuesFormat.BaseDocValuesFormatTestCase.TestSortedSetMergeAwayAllValues
Lucene.Net.Tests.dll: Lucene.Net.Codecs.Lucene42.TestLucene42DocValuesFormat.BaseDocValuesFormatTestCase.TestSortedSetOneValue
Lucene.Net.Tests.dll: Lucene.Net.Codecs.Lucene42.TestLucene42DocValuesFormat.BaseDocValuesFormatTestCase.TestSortedSetTermsEnum
Lucene.Net.Tests.dll: Lucene.Net.Codecs.Lucene42.TestLucene42DocValuesFormat.BaseDocValuesFormatTestCase.TestSortedSetThreeValuesTwoDocs
Lucene.Net.Tests.dll: Lucene.Net.Codecs.Lucene42.TestLucene42DocValuesFormat.BaseDocValuesFormatTestCase.TestSortedSetTwoDocumentsFirstMissing
Lucene.Net.Tests.dll: Lucene.Net.Codecs.Lucene42.TestLucene42DocValuesFormat.BaseDocValuesFormatTestCase.TestSortedSetTwoDocumentsFirstMissingMerge
Lucene.Net.Tests.dll: Lucene.Net.Codecs.Lucene42.TestLucene42DocValuesFormat.BaseDocValuesFormatTestCase.TestSortedSetTwoDocumentsLastMissing
Lucene.Net.Tests.dll: Lucene.Net.Codecs.Lucene42.TestLucene42DocValuesFormat.BaseDocValuesFormatTestCase.TestSortedSetTwoDocumentsLastMissingMerge
Lucene.Net.Tests.dll: Lucene.Net.Codecs.Lucene42.TestLucene42DocValuesFormat.BaseDocValuesFormatTestCase.TestSortedSetTwoDocumentsMerged
Lucene.Net.Tests.dll: Lucene.Net.Codecs.Lucene42.TestLucene42DocValuesFormat.BaseDocValuesFormatTestCase.TestSortedSetTwoFields
Lucene.Net.Tests.dll: Lucene.Net.Codecs.Lucene42.TestLucene42DocValuesFormat.BaseDocValuesFormatTestCase.TestSortedSetTwoValues
Lucene.Net.Tests.dll: Lucene.Net.Codecs.Lucene42.TestLucene42DocValuesFormat.BaseDocValuesFormatTestCase.TestSortedSetTwoValuesUnordered
Lucene.Net.Tests.dll: Lucene.Net.Codecs.Lucene42.TestLucene42DocValuesFormat.BaseDocValuesFormatTestCase.TestSortedSetVariableLengthSingleValuedVsStoredFields
Lucene.Net.Tests.dll: Lucene.Net.Codecs.Lucene42.TestLucene42DocValuesFormat.BaseDocValuesFormatTestCase.TestSortedSetVariableLengthVsStoredFields
Lucene.Net.Tests.dll: Lucene.Net.Codecs.Lucene42.TestLucene42DocValuesFormat.BaseDocValuesFormatTestCase.TestSortedSetVariableLengthVsUninvertedField
Lucene.Net.Tests.dll: Lucene.Net.Codecs.Lucene42.TestLucene42DocValuesFormat.BaseDocValuesFormatTestCase.TestSortedTermsEnum
Lucene.Net.Tests.dll: Lucene.Net.Codecs.Lucene42.TestLucene42DocValuesFormat.BaseDocValuesFormatTestCase.TestSortedVariableLengthVsFieldCache
Lucene.Net.Tests.dll: Lucene.Net.Codecs.Lucene42.TestLucene42DocValuesFormat.BaseDocValuesFormatTestCase.TestSortedVariableLengthVsStoredFields
Lucene.Net.Tests.dll: Lucene.Net.Codecs.Lucene42.TestLucene42DocValuesFormat.BaseDocValuesFormatTestCase.TestThreads
Lucene.Net.Tests.dll: Lucene.Net.Codecs.Lucene42.TestLucene42DocValuesFormat.BaseDocValuesFormatTestCase.TestThreeFieldsMixed
Lucene.Net.Tests.dll: Lucene.Net.Codecs.Lucene42.TestLucene42DocValuesFormat.BaseDocValuesFormatTestCase.TestThreeFieldsMixed2
Lucene.Net.Tests.dll: Lucene.Net.Codecs.Lucene42.TestLucene42DocValuesFormat.BaseDocValuesFormatTestCase.TestTwoBinaryValues
Lucene.Net.Tests.dll: Lucene.Net.Codecs.Lucene42.TestLucene42DocValuesFormat.BaseDocValuesFormatTestCase.TestTwoFieldsMixed
Lucene.Net.Tests.dll: Lucene.Net.Codecs.Lucene42.TestLucene42DocValuesFormat.BaseDocValuesFormatTestCase.TestTwoNumbers
Lucene.Net.Tests.dll: Lucene.Net.Codecs.Lucene42.TestLucene42DocValuesFormat.BaseDocValuesFormatTestCase.TestVeryLargeButLegalSortedBytes
Lucene.Net.Tests.dll: Lucene.Net.Codecs.Lucene42.TestLucene42DocValuesFormat.BaseIndexFileFormatTestCase.TestMergeStability
Lucene.Net.Tests.dll: Lucene.Net.Codecs.Lucene45.TestLucene45DocValuesFormat.BaseDocValuesFormatTestCase.TestLongMissingVsFieldCache
Lucene.Net.Tests.dll: Lucene.Net.Codecs.Lucene45.TestLucene45DocValuesFormat.BaseDocValuesFormatTestCase.TestShortMissingVsFieldCache
Lucene.Net.Tests.dll: Lucene.Net.Codecs.Lucene45.TestLucene45DocValuesFormat.BaseDocValuesFormatTestCase.TestSortedMergeAwayAllValues
Lucene.Net.Tests.dll: Lucene.Net.Codecs.Lucene45.TestLucene45DocValuesFormat.BaseDocValuesFormatTestCase.TestSortedSetFixedLengthVsUninvertedField
Lucene.Net.Tests.dll: Lucene.Net.Codecs.Lucene45.TestLucene45DocValuesFormat.BaseDocValuesFormatTestCase.TestSortedSetMergeAwayAllValues
Lucene.Net.Tests.dll: Lucene.Net.Codecs.Lucene45.TestLucene45DocValuesFormat.BaseDocValuesFormatTestCase.TestSortedSetThreeValuesTwoDocs
Lucene.Net.Tests.dll: Lucene.Net.Codecs.Lucene45.TestLucene45DocValuesFormat.BaseDocValuesFormatTestCase.TestSortedSetTwoDocumentsLastMissingMerge
Lucene.Net.Tests.dll: Lucene.Net.Codecs.Lucene45.TestLucene45DocValuesFormat.BaseDocValuesFormatTestCase.TestSortedSetTwoDocumentsMerged
Lucene.Net.Tests.dll: Lucene.Net.Codecs.Lucene45.TestLucene45DocValuesFormat.BaseDocValuesFormatTestCase.TestSortedSetVariableLengthVsUninvertedField



Newly failed tests details (only first 3 failures shown here)
==================================================================
Lucene.Net.Tests.dll: Lucene.Net.Analysis.TestLookaheadTokenFilter.TestNeverCallingPeek (new)
=================
Test(s) failed. Test exceeded Timeout value of 20000ms

Lucene.Net.Tests.dll: Lucene.Net.Codecs.Lucene40.TestLucene40DocValuesFormat.BaseDocValuesFormatTestCase.TestByteNumericsVsStoredFields
(new) =================
Test(s) failed.   Expected: -123
  But was:  133

   at NUnit.Framework.Assert.That(Object actual, IResolveConstraint expression, String message,
Object[] args)
   at NUnit.Framework.Assert.AreEqual(Int64 expected, Int64 actual)
   at Lucene.Net.Index.BaseDocValuesFormatTestCase.DoTestNumericsVsStoredFields(LongProducer
longs) in z:\Builds\work\bcdbe6b8cc677a49\src\Lucene.Net.TestFramework\Index\BaseDocValuesFormatTestCase.cs:line
1396
   at Lucene.Net.Index.BaseDocValuesFormatTestCase.TestByteNumericsVsStoredFields() in z:\Builds\work\bcdbe6b8cc677a49\src\Lucene.Net.TestFramework\Index\BaseDocValuesFormatTestCase.cs:line
1507
Lucene.Net.Tests.dll: Lucene.Net.Codecs.Lucene42.TestLucene42DocValuesFormat.BaseDocValuesFormatTestCase.TestGCDCompression
(new) =================
Test(s) failed. System.Exception : CheckIndex failed
   at Lucene.Net.Util.TestUtil.CheckIndex(Directory dir, Boolean crossCheckTermVectors) in
z:\Builds\work\bcdbe6b8cc677a49\src\Lucene.Net.TestFramework\Util\TestUtil.cs:line 257
   at Lucene.Net.Store.MockDirectoryWrapper.Dispose() in z:\Builds\work\bcdbe6b8cc677a49\src\Lucene.Net.TestFramework\Store\MockDirectoryWrapper.cs:line
937
   at Lucene.Net.Index.BaseDocValuesFormatTestCase.DoTestNumericsVsStoredFields(LongProducer
longs) in z:\Builds\work\bcdbe6b8cc677a49\src\Lucene.Net.TestFramework\Index\BaseDocValuesFormatTestCase.cs:line
1400
   at Lucene.Net.Index.BaseDocValuesFormatTestCase.TestGCDCompression() in z:\Builds\work\bcdbe6b8cc677a49\src\Lucene.Net.TestFramework\Index\BaseDocValuesFormatTestCase.cs:line
2683
------- Stderr: -------
CheckIndex failed
´╗┐Segments file=segments_1 numSegments=2 version=4.8 format=
  1 of 2: name=_0 docCount=360
    codec=Lucene42
    compound=False
    numFiles=10
    size (MB)=0.00380706787109375
    diagnostics = System.Collections.Generic.Dictionary`2[System.String,System.String]
    has deletions [delGen=1]
    test: open reader.........OK
    test: check integrity.....OK
    test: check live docs.....OK [1 deleted docs]
    test: fields..............OK [3 fields]
    test: field norms.........OK [0 fields]
    test: terms, freq, prox...OK [361 terms; 718 terms/docs pairs; 0 tokens]
    test (ignoring deletes): terms, freq, prox...OK [362 terms; 720 terms/docs pairs; 0 tokens]
    test: stored fields.......OK [359 total field count; avg 1 fields per doc]
    test: term vectors........OK [0 total vector count; avg 0 term/freq vector fields per
doc]
    test: docvalues...........ERROR [id docsWithField does not exist]
   at Lucene.Net.Index.CheckIndex.CheckDocValues(FieldInfo fi, AtomicReader reader, DocValuesStatus
status) in z:\Builds\work\bcdbe6b8cc677a49\src\Lucene.Net.Core\Index\CheckIndex.cs:line 1909
   at Lucene.Net.Index.CheckIndex.TestDocValues(AtomicReader reader, StreamWriter infoStream)
in z:\Builds\work\bcdbe6b8cc677a49\src\Lucene.Net.Core\Index\CheckIndex.cs:line 1706
FAILED
    WARNING: fixIndex() would remove reference to this segment; full exception:
   at Lucene.Net.Index.CheckIndex.DoCheckIndex(IList`1 onlySegments) in z:\Builds\work\bcdbe6b8cc677a49\src\Lucene.Net.Core\Index\CheckIndex.cs:line
828
  2 of 2: name=_1 docCount=40
    codec=Lucene42
    compound=False
    numFiles=9
    size (MB)=0.00140190124511719
    diagnostics = System.Collections.Generic.Dictionary`2[System.String,System.String]
    no deletions
    test: open reader.........OK
    test: check integrity.....OK
    test: check live docs.....OK
    test: fields..............OK [3 fields]
    test: field norms.........OK [0 fields]
    test: terms, freq, prox...OK [41 terms; 80 terms/docs pairs; 0 tokens]
    test: stored fields.......OK [40 total field count; avg 1 fields per doc]
    test: term vectors........OK [0 total vector count; avg 0 term/freq vector fields per
doc]
    test: docvalues...........ERROR [id docsWithField does not exist]
   at Lucene.Net.Index.CheckIndex.CheckDocValues(FieldInfo fi, AtomicReader reader, DocValuesStatus
status) in z:\Builds\work\bcdbe6b8cc677a49\src\Lucene.Net.Core\Index\CheckIndex.cs:line 1909
   at Lucene.Net.Index.CheckIndex.TestDocValues(AtomicReader reader, StreamWriter infoStream)
in z:\Builds\work\bcdbe6b8cc677a49\src\Lucene.Net.Core\Index\CheckIndex.cs:line 1706
FAILED
    WARNING: fixIndex() would remove reference to this segment; full exception:
   at Lucene.Net.Index.CheckIndex.DoCheckIndex(IList`1 onlySegments) in z:\Builds\work\bcdbe6b8cc677a49\src\Lucene.Net.Core\Index\CheckIndex.cs:line
828
WARNING: 2 broken segments (containing 399 documents) detected
see all newly failed tests: http://teamcity.codebetter.com/viewLog.html?buildId=177711&buildTypeId=LuceneNet_Core
Changes included (4 changes)
====================================================
Change e6f76bb95a4b6dc5ae6b9082d84f38ed3a4160d7 by itamar (1 file):
Remove endless iterations, Repeat(10) should be enough

The iterations have been removed from the test in later versions of Java Lucene too


Change a9585694a7968148f9910c65e3c89cd3b5aae5d4 by itamar (2 files):
Minor


Change c9426e746c41c2498df6616753236c6899034d65 by itamar (4 files):
Fixing some more tests by asserting on the right things

I've extended the test framework to support Java style asserts, and will bring more as needed.
This will help porting tests in the future (less style changes), abstract away the testing
framework, and most importantly make sure we don't assert differently than in the Java world


Change f79148cfb9e02c155a2998c66b9277b914203209 by itamar (1 file):
Another confirmed long running test


see more information about changed files: http://teamcity.codebetter.com/viewLog.html?tab=buildChangesDiv&buildId=177711&buildTypeId=LuceneNet_Core

============================================================================
Configure email notifications: http://teamcity.codebetter.com/profile.html?init=1&tab=userNotifications

Mime
  • Unnamed multipart/alternative (inline, None, 0 bytes)
View raw message