lucenenet-dev mailing list archives

Site index · List index
Message view « Date » · « Thread »
Top « Date » · « Thread »
From t.@codebetter.com
Subject [TeamCity, FAILED] Build Lucene.NET :: Lucene.NET Core #83
Date Wed, 07 Jan 2015 20:05:20 GMT
Build Lucene.NET :: Lucene.NET Core #83 failed (Tests failed: 255 (39 new), passed: 2207, ignored:
119).
Agent: JetBrains-dotnet-agent02
Build results: http://teamcity.codebetter.com/viewLog.html?buildId=177815&buildTypeId=LuceneNet_Core

Failed Tests Summary:
Newly failed tests (39 tests, alphabetically ordered)
==================================================================
Lucene.Net.Tests.dll: Lucene.Net.Analysis.TestLookaheadTokenFilter.TestNeverCallingPeek
Lucene.Net.Tests.dll: Lucene.Net.Codecs.Lucene42.TestLucene42DocValuesFormat.BaseDocValuesFormatTestCase.TestGCDCompression
Lucene.Net.Tests.dll: Lucene.Net.Codecs.Lucene42.TestLucene42DocValuesFormat.BaseDocValuesFormatTestCase.TestSortedSetVariableLengthSingleValuedVsStoredFields
Lucene.Net.Tests.dll: Lucene.Net.Codecs.Lucene42.TestLucene42DocValuesFormat.BaseDocValuesFormatTestCase.TestTwoDocumentsMerged
Lucene.Net.Tests.dll: Lucene.Net.Codecs.Lucene45.TestLucene45DocValuesFormat.BaseDocValuesFormatTestCase.TestSortedSetTwoDocumentsLastMissingMerge
Lucene.Net.Tests.dll: Lucene.Net.Codecs.Lucene45.TestLucene45DocValuesFormat.BaseDocValuesFormatTestCase.TestTwoDocumentsMerged
Lucene.Net.Tests.dll: Lucene.Net.Codecs.Perfield.TestPerFieldDocValuesFormat.BaseDocValuesFormatTestCase.TestByteMissingVsFieldCache
Lucene.Net.Tests.dll: Lucene.Net.Codecs.Perfield.TestPerFieldDocValuesFormat.BaseDocValuesFormatTestCase.TestSortedBytesTwoDocumentsMerged
Lucene.Net.Tests.dll: Lucene.Net.Codecs.Perfield.TestPerFieldDocValuesFormat.BaseDocValuesFormatTestCase.TestSortedSetVariableLengthVsStoredFields
Lucene.Net.Tests.dll: Lucene.Net.Index.TestAddIndexes.TestAddIndexesWithRollback
Lucene.Net.Tests.dll: Lucene.Net.Index.TestBinaryDocValuesUpdates.TestSegmentMerges
Lucene.Net.Tests.dll: Lucene.Net.Index.TestBinaryDocValuesUpdates.TestUpdateFewSegments
Lucene.Net.Tests.dll: Lucene.Net.Index.TestBinaryDocValuesUpdates.TestUpdateOldSegments
Lucene.Net.Tests.dll: Lucene.Net.Index.TestCodecHoldsOpenFiles.Test
Lucene.Net.Tests.dll: Lucene.Net.Index.TestCodecHoldsOpenFiles.TestExposeUnclosedFiles
Lucene.Net.Tests.dll: Lucene.Net.Index.TestDirectoryReader.TestFilesOpenClose
Lucene.Net.Tests.dll: Lucene.Net.Index.TestDocTermOrds.TestRandomWithPrefix
Lucene.Net.Tests.dll: Lucene.Net.Index.TestDocValuesFormat.BaseDocValuesFormatTestCase.TestBytesTwoDocumentsMerged
Lucene.Net.Tests.dll: Lucene.Net.Index.TestDocValuesFormat.BaseDocValuesFormatTestCase.TestIntMissingVsFieldCache
Lucene.Net.Tests.dll: Lucene.Net.Index.TestDocValuesFormat.BaseDocValuesFormatTestCase.TestSortedSetVariableLengthVsStoredFields
Lucene.Net.Tests.dll: Lucene.Net.Index.TestIndexWriterExceptions.TestDocumentsWriterExceptions
Lucene.Net.Tests.dll: Lucene.Net.Index.TestIndexWriterExceptions.TestNoLostDeletesOrUpdates
Lucene.Net.Tests.dll: Lucene.Net.Index.TestIndexWriterExceptions.TestRandomExceptionDuringRollback
Lucene.Net.Tests.dll: Lucene.Net.Index.TestIndexWriterForceMerge.TestBackgroundForceMerge
Lucene.Net.Tests.dll: Lucene.Net.Index.TestIndexWriterMerging.TestNoWaitClose
Lucene.Net.Tests.dll: Lucene.Net.Index.TestIndexWriterWithThreads.TestIOExceptionDuringWriteSegmentWithThreadsOnlyOnce
Lucene.Net.Tests.dll: Lucene.Net.Index.TestMultiDocValues.TestSortedWithLotsOfDups
Lucene.Net.Tests.dll: Lucene.Net.Index.TestOmitPositions.TestNoPrxFile
Lucene.Net.Tests.dll: Lucene.Net.Index.TestOmitTf.TestBasic
Lucene.Net.Tests.dll: Lucene.Net.Index.TestOmitTf.TestMixedMerge
Lucene.Net.Tests.dll: Lucene.Net.Index.TestTermsEnum.TestIntersectRandom
Lucene.Net.Tests.dll: Lucene.Net.Index.TestTransactions.TestTransactions_Mem
Lucene.Net.Tests.dll: Lucene.Net.Search.TestMultiPhraseQuery.TestBooleanQueryContainingSingleTermPrefixQuery
Lucene.Net.Tests.dll: Lucene.Net.Search.TestMultiTermConstantScore.BaseTestRangeFilter.TestPad
Lucene.Net.Tests.dll: Lucene.Net.Search.TestMultiTermConstantScore.TestBooleanOrderUnAffected
Lucene.Net.Tests.dll: Lucene.Net.Search.TestSearchAfter.TestQueries
Lucene.Net.Tests.dll: Lucene.Net.Store.TestRAMDirectory.TestRAMDirectoryMem
Lucene.Net.Tests.dll: Lucene.Net.Util.TestFixedBitSet.BaseDocIdSetTestCase`1.TestAgainstBitSet
Lucene.Net.Tests.dll: Lucene.Net.Util.TestPagedBytes.TestDataInputOutput

Other failed tests (216 tests, alphabetically ordered, only first 100 shown)
==================================================================
Lucene.Net.Tests.dll: Lucene.Net.Analysis.TestLookaheadTokenFilter.TestRandomStrings
Lucene.Net.Tests.dll: Lucene.Net.Analysis.TestMockAnalyzer.TestRandomRegexps
Lucene.Net.Tests.dll: Lucene.Net.Codecs.Lucene3x.TestLucene3xTermVectorsFormat.BaseIndexFileFormatTestCase.TestMergeStability
Lucene.Net.Tests.dll: Lucene.Net.Codecs.Lucene40.TestLucene40DocValuesFormat.BaseDocValuesFormatTestCase.TestMissingSortedBytes
Lucene.Net.Tests.dll: Lucene.Net.Codecs.Lucene40.TestLucene40DocValuesFormat.BaseDocValuesFormatTestCase.TestRandomSortedBytes
Lucene.Net.Tests.dll: Lucene.Net.Codecs.Lucene40.TestLucene40DocValuesFormat.BaseDocValuesFormatTestCase.TestSortedMergeAwayAllValues
Lucene.Net.Tests.dll: Lucene.Net.Codecs.Lucene40.TestLucene40DocValuesFormat.BaseDocValuesFormatTestCase.TestTwoDocumentsMerged
Lucene.Net.Tests.dll: Lucene.Net.Codecs.Lucene41.TestBlockPostingsFormat2
Lucene.Net.Tests.dll: Lucene.Net.Codecs.Lucene41.TestBlockPostingsFormat3.Test
Lucene.Net.Tests.dll: Lucene.Net.Codecs.Lucene42.TestLucene42DocValuesFormat.BaseDocValuesFormatTestCase.TestBinaryFixedLengthVsStoredFields
Lucene.Net.Tests.dll: Lucene.Net.Codecs.Lucene42.TestLucene42DocValuesFormat.BaseDocValuesFormatTestCase.TestBinaryVariableLengthVsStoredFields
Lucene.Net.Tests.dll: Lucene.Net.Codecs.Lucene42.TestLucene42DocValuesFormat.BaseDocValuesFormatTestCase.TestBytes
Lucene.Net.Tests.dll: Lucene.Net.Codecs.Lucene42.TestLucene42DocValuesFormat.BaseDocValuesFormatTestCase.TestCodecUsesOwnSortedBytes
Lucene.Net.Tests.dll: Lucene.Net.Codecs.Lucene42.TestLucene42DocValuesFormat.BaseDocValuesFormatTestCase.TestCodecUsesOwnSortedBytesEachTime
Lucene.Net.Tests.dll: Lucene.Net.Codecs.Lucene42.TestLucene42DocValuesFormat.BaseDocValuesFormatTestCase.TestEmptyBinaryValueOnPageSizes
Lucene.Net.Tests.dll: Lucene.Net.Codecs.Lucene42.TestLucene42DocValuesFormat.BaseDocValuesFormatTestCase.TestEmptySortedBytes
Lucene.Net.Tests.dll: Lucene.Net.Codecs.Lucene42.TestLucene42DocValuesFormat.BaseDocValuesFormatTestCase.TestHugeBinaryValueLimit
Lucene.Net.Tests.dll: Lucene.Net.Codecs.Lucene42.TestLucene42DocValuesFormat.BaseDocValuesFormatTestCase.TestLongNumericsVsStoredFields
Lucene.Net.Tests.dll: Lucene.Net.Codecs.Lucene42.TestLucene42DocValuesFormat.BaseDocValuesFormatTestCase.TestMissingSortedBytes
Lucene.Net.Tests.dll: Lucene.Net.Codecs.Lucene42.TestLucene42DocValuesFormat.BaseDocValuesFormatTestCase.TestOneFloat
Lucene.Net.Tests.dll: Lucene.Net.Codecs.Lucene42.TestLucene42DocValuesFormat.BaseDocValuesFormatTestCase.TestOneNumber
Lucene.Net.Tests.dll: Lucene.Net.Codecs.Lucene42.TestLucene42DocValuesFormat.BaseDocValuesFormatTestCase.TestRandomSortedBytes
Lucene.Net.Tests.dll: Lucene.Net.Codecs.Lucene42.TestLucene42DocValuesFormat.BaseDocValuesFormatTestCase.TestSortedBytes
Lucene.Net.Tests.dll: Lucene.Net.Codecs.Lucene42.TestLucene42DocValuesFormat.BaseDocValuesFormatTestCase.TestSortedBytesThreeDocuments
Lucene.Net.Tests.dll: Lucene.Net.Codecs.Lucene42.TestLucene42DocValuesFormat.BaseDocValuesFormatTestCase.TestSortedBytesTwoDocuments
Lucene.Net.Tests.dll: Lucene.Net.Codecs.Lucene42.TestLucene42DocValuesFormat.BaseDocValuesFormatTestCase.TestSortedBytesTwoDocumentsMerged
Lucene.Net.Tests.dll: Lucene.Net.Codecs.Lucene42.TestLucene42DocValuesFormat.BaseDocValuesFormatTestCase.TestSortedFixedLengthVsFieldCache
Lucene.Net.Tests.dll: Lucene.Net.Codecs.Lucene42.TestLucene42DocValuesFormat.BaseDocValuesFormatTestCase.TestSortedFixedLengthVsStoredFields
Lucene.Net.Tests.dll: Lucene.Net.Codecs.Lucene42.TestLucene42DocValuesFormat.BaseDocValuesFormatTestCase.TestSortedMergeAwayAllValues
Lucene.Net.Tests.dll: Lucene.Net.Codecs.Lucene42.TestLucene42DocValuesFormat.BaseDocValuesFormatTestCase.TestSortedSetFixedLengthSingleValuedVsStoredFields
Lucene.Net.Tests.dll: Lucene.Net.Codecs.Lucene42.TestLucene42DocValuesFormat.BaseDocValuesFormatTestCase.TestSortedSetFixedLengthVsStoredFields
Lucene.Net.Tests.dll: Lucene.Net.Codecs.Lucene42.TestLucene42DocValuesFormat.BaseDocValuesFormatTestCase.TestSortedSetFixedLengthVsUninvertedField
Lucene.Net.Tests.dll: Lucene.Net.Codecs.Lucene42.TestLucene42DocValuesFormat.BaseDocValuesFormatTestCase.TestSortedSetMergeAwayAllValues
Lucene.Net.Tests.dll: Lucene.Net.Codecs.Lucene42.TestLucene42DocValuesFormat.BaseDocValuesFormatTestCase.TestSortedSetOneValue
Lucene.Net.Tests.dll: Lucene.Net.Codecs.Lucene42.TestLucene42DocValuesFormat.BaseDocValuesFormatTestCase.TestSortedSetTermsEnum
Lucene.Net.Tests.dll: Lucene.Net.Codecs.Lucene42.TestLucene42DocValuesFormat.BaseDocValuesFormatTestCase.TestSortedSetThreeValuesTwoDocs
Lucene.Net.Tests.dll: Lucene.Net.Codecs.Lucene42.TestLucene42DocValuesFormat.BaseDocValuesFormatTestCase.TestSortedSetTwoDocumentsFirstMissing
Lucene.Net.Tests.dll: Lucene.Net.Codecs.Lucene42.TestLucene42DocValuesFormat.BaseDocValuesFormatTestCase.TestSortedSetTwoDocumentsFirstMissingMerge
Lucene.Net.Tests.dll: Lucene.Net.Codecs.Lucene42.TestLucene42DocValuesFormat.BaseDocValuesFormatTestCase.TestSortedSetTwoDocumentsLastMissing
Lucene.Net.Tests.dll: Lucene.Net.Codecs.Lucene42.TestLucene42DocValuesFormat.BaseDocValuesFormatTestCase.TestSortedSetTwoDocumentsLastMissingMerge
Lucene.Net.Tests.dll: Lucene.Net.Codecs.Lucene42.TestLucene42DocValuesFormat.BaseDocValuesFormatTestCase.TestSortedSetTwoDocumentsMerged
Lucene.Net.Tests.dll: Lucene.Net.Codecs.Lucene42.TestLucene42DocValuesFormat.BaseDocValuesFormatTestCase.TestSortedSetTwoFields
Lucene.Net.Tests.dll: Lucene.Net.Codecs.Lucene42.TestLucene42DocValuesFormat.BaseDocValuesFormatTestCase.TestSortedSetTwoValues
Lucene.Net.Tests.dll: Lucene.Net.Codecs.Lucene42.TestLucene42DocValuesFormat.BaseDocValuesFormatTestCase.TestSortedSetTwoValuesUnordered
Lucene.Net.Tests.dll: Lucene.Net.Codecs.Lucene42.TestLucene42DocValuesFormat.BaseDocValuesFormatTestCase.TestSortedSetVariableLengthVsStoredFields
Lucene.Net.Tests.dll: Lucene.Net.Codecs.Lucene42.TestLucene42DocValuesFormat.BaseDocValuesFormatTestCase.TestSortedSetVariableLengthVsUninvertedField
Lucene.Net.Tests.dll: Lucene.Net.Codecs.Lucene42.TestLucene42DocValuesFormat.BaseDocValuesFormatTestCase.TestSortedTermsEnum
Lucene.Net.Tests.dll: Lucene.Net.Codecs.Lucene42.TestLucene42DocValuesFormat.BaseDocValuesFormatTestCase.TestSortedVariableLengthVsFieldCache
Lucene.Net.Tests.dll: Lucene.Net.Codecs.Lucene42.TestLucene42DocValuesFormat.BaseDocValuesFormatTestCase.TestSortedVariableLengthVsStoredFields
Lucene.Net.Tests.dll: Lucene.Net.Codecs.Lucene42.TestLucene42DocValuesFormat.BaseDocValuesFormatTestCase.TestThreads
Lucene.Net.Tests.dll: Lucene.Net.Codecs.Lucene42.TestLucene42DocValuesFormat.BaseDocValuesFormatTestCase.TestThreeFieldsMixed
Lucene.Net.Tests.dll: Lucene.Net.Codecs.Lucene42.TestLucene42DocValuesFormat.BaseDocValuesFormatTestCase.TestThreeFieldsMixed2
Lucene.Net.Tests.dll: Lucene.Net.Codecs.Lucene42.TestLucene42DocValuesFormat.BaseDocValuesFormatTestCase.TestTwoBinaryValues
Lucene.Net.Tests.dll: Lucene.Net.Codecs.Lucene42.TestLucene42DocValuesFormat.BaseDocValuesFormatTestCase.TestTwoNumbers
Lucene.Net.Tests.dll: Lucene.Net.Codecs.Lucene42.TestLucene42DocValuesFormat.BaseDocValuesFormatTestCase.TestVeryLargeButLegalSortedBytes
Lucene.Net.Tests.dll: Lucene.Net.Codecs.Lucene42.TestLucene42DocValuesFormat.BaseIndexFileFormatTestCase.TestMergeStability
Lucene.Net.Tests.dll: Lucene.Net.Codecs.Lucene45.TestLucene45DocValuesFormat.BaseDocValuesFormatTestCase.TestByteMissingVsFieldCache
Lucene.Net.Tests.dll: Lucene.Net.Codecs.Lucene45.TestLucene45DocValuesFormat.BaseDocValuesFormatTestCase.TestSortedMergeAwayAllValues
Lucene.Net.Tests.dll: Lucene.Net.Codecs.Lucene45.TestLucene45DocValuesFormat.BaseDocValuesFormatTestCase.TestSortedSetFixedLengthVsUninvertedField
Lucene.Net.Tests.dll: Lucene.Net.Codecs.Lucene45.TestLucene45DocValuesFormat.BaseDocValuesFormatTestCase.TestSortedSetMergeAwayAllValues
Lucene.Net.Tests.dll: Lucene.Net.Codecs.Lucene45.TestLucene45DocValuesFormat.BaseDocValuesFormatTestCase.TestSortedSetThreeValuesTwoDocs



Newly failed tests details (only first 3 failures shown here)
==================================================================
Lucene.Net.Tests.dll: Lucene.Net.Analysis.TestLookaheadTokenFilter.TestNeverCallingPeek (new)
=================
Test(s) failed. Test exceeded Timeout value of 20000ms

Lucene.Net.Tests.dll: Lucene.Net.Codecs.Lucene42.TestLucene42DocValuesFormat.BaseDocValuesFormatTestCase.TestGCDCompression
(new) =================
Test(s) failed. System.Exception : CheckIndex failed
   at Lucene.Net.Util.TestUtil.CheckIndex(Directory dir, Boolean crossCheckTermVectors) in
z:\Builds\work\bcdbe6b8cc677a49\src\Lucene.Net.TestFramework\Util\TestUtil.cs:line 257
   at Lucene.Net.Store.MockDirectoryWrapper.Dispose() in z:\Builds\work\bcdbe6b8cc677a49\src\Lucene.Net.TestFramework\Store\MockDirectoryWrapper.cs:line
937
   at Lucene.Net.Index.BaseDocValuesFormatTestCase.DoTestNumericsVsStoredFields(LongProducer
longs) in z:\Builds\work\bcdbe6b8cc677a49\src\Lucene.Net.TestFramework\Index\BaseDocValuesFormatTestCase.cs:line
1400
   at Lucene.Net.Index.BaseDocValuesFormatTestCase.TestGCDCompression() in z:\Builds\work\bcdbe6b8cc677a49\src\Lucene.Net.TestFramework\Index\BaseDocValuesFormatTestCase.cs:line
2683
------- Stderr: -------
CheckIndex failed
´╗┐Segments file=segments_1 numSegments=1 version=4.8 format=
  1 of 1: name=_0 docCount=318
    codec=Lucene42
    compound=True
    numFiles=4
    size (MB)=0.00366020202636719
    diagnostics = System.Collections.Generic.Dictionary`2[System.String,System.String]
    has deletions [delGen=1]
    test: open reader.........OK
    test: check integrity.....OK
    test: check live docs.....OK [1 deleted docs]
    test: fields..............OK [3 fields]
    test: field norms.........OK [0 fields]
    test: terms, freq, prox...OK [319 terms; 634 terms/docs pairs; 0 tokens]
    test (ignoring deletes): terms, freq, prox...OK [320 terms; 636 terms/docs pairs; 0 tokens]
    test: stored fields.......OK [317 total field count; avg 1 fields per doc]
    test: term vectors........OK [0 total vector count; avg 0 term/freq vector fields per
doc]
    test: docvalues...........ERROR [id docsWithField does not exist]
   at Lucene.Net.Index.CheckIndex.CheckDocValues(FieldInfo fi, AtomicReader reader, DocValuesStatus
status) in z:\Builds\work\bcdbe6b8cc677a49\src\Lucene.Net.Core\Index\CheckIndex.cs:line 1909
   at Lucene.Net.Index.CheckIndex.TestDocValues(AtomicReader reader, StreamWriter infoStream)
in z:\Builds\work\bcdbe6b8cc677a49\src\Lucene.Net.Core\Index\CheckIndex.cs:line 1706
FAILED
    WARNING: fixIndex() would remove reference to this segment; full exception:
   at Lucene.Net.Index.CheckIndex.DoCheckIndex(IList`1 onlySegments) in z:\Builds\work\bcdbe6b8cc677a49\src\Lucene.Net.Core\Index\CheckIndex.cs:line
828
WARNING: 1 broken segments (containing 317 documents) detected
Lucene.Net.Tests.dll: Lucene.Net.Codecs.Lucene42.TestLucene42DocValuesFormat.BaseDocValuesFormatTestCase.TestSortedSetVariableLengthSingleValuedVsStoredFields
(new) =================
Test(s) failed. System.Exception : CheckIndex failed
   at Lucene.Net.Util.TestUtil.CheckIndex(Directory dir, Boolean crossCheckTermVectors) in
z:\Builds\work\bcdbe6b8cc677a49\src\Lucene.Net.TestFramework\Util\TestUtil.cs:line 257
   at Lucene.Net.Store.MockDirectoryWrapper.Dispose() in z:\Builds\work\bcdbe6b8cc677a49\src\Lucene.Net.TestFramework\Store\MockDirectoryWrapper.cs:line
937
   at Lucene.Net.Index.BaseDocValuesFormatTestCase.DoTestSortedSetVsStoredFields(Int32 minLength,
Int32 maxLength, Int32 maxValuesPerDoc) in z:\Builds\work\bcdbe6b8cc677a49\src\Lucene.Net.TestFramework\Index\BaseDocValuesFormatTestCase.cs:line
2391
   at Lucene.Net.Index.BaseDocValuesFormatTestCase.TestSortedSetVariableLengthSingleValuedVsStoredFields()
in z:\Builds\work\bcdbe6b8cc677a49\src\Lucene.Net.TestFramework\Index\BaseDocValuesFormatTestCase.cs:line
2436
------- Stderr: -------
CheckIndex failed
´╗┐Segments file=segments_2 numSegments=1 version=4.8 format=
  1 of 1: name=_0 docCount=373
    codec=Lucene42
    compound=True
    numFiles=4
    size (MB)=0.00347137451171875
    diagnostics = System.Collections.Generic.Dictionary`2[System.String,System.String]
    has deletions [delGen=1]
    test: open reader.........OK
    test: check integrity.....OK
    test: check live docs.....OK [1 deleted docs]
    test: fields..............OK [1 fields]
    test: field norms.........OK [0 fields]
    test: terms, freq, prox...OK [372 terms; 372 terms/docs pairs; 0 tokens]
    test (ignoring deletes): terms, freq, prox...OK [373 terms; 373 terms/docs pairs; 0 tokens]
    test: stored fields.......OK [0 total field count; avg 0 fields per doc]
    test: term vectors........OK [0 total vector count; avg 0 term/freq vector fields per
doc]
    test: docvalues...........ERROR [id docsWithField does not exist]
   at Lucene.Net.Index.CheckIndex.CheckDocValues(FieldInfo fi, AtomicReader reader, DocValuesStatus
status) in z:\Builds\work\bcdbe6b8cc677a49\src\Lucene.Net.Core\Index\CheckIndex.cs:line 1909
   at Lucene.Net.Index.CheckIndex.TestDocValues(AtomicReader reader, StreamWriter infoStream)
in z:\Builds\work\bcdbe6b8cc677a49\src\Lucene.Net.Core\Index\CheckIndex.cs:line 1706
FAILED
    WARNING: fixIndex() would remove reference to this segment; full exception:
   at Lucene.Net.Index.CheckIndex.DoCheckIndex(IList`1 onlySegments) in z:\Builds\work\bcdbe6b8cc677a49\src\Lucene.Net.Core\Index\CheckIndex.cs:line
828
WARNING: 1 broken segments (containing 372 documents) detected
see all newly failed tests: http://teamcity.codebetter.com/viewLog.html?buildId=177815&buildTypeId=LuceneNet_Core
Changes included (1 change)
====================================================
Change f4ccfb98e3a3515d9901de5488ab8c439b93bded by itamar (1 file):
Some more work on Codecs


see more information about changed files: http://teamcity.codebetter.com/viewLog.html?tab=buildChangesDiv&buildId=177815&buildTypeId=LuceneNet_Core

============================================================================
Configure email notifications: http://teamcity.codebetter.com/profile.html?init=1&tab=userNotifications

Mime
  • Unnamed multipart/alternative (inline, None, 0 bytes)
View raw message