lucenenet-dev mailing list archives

Site index · List index
Message view « Date » · « Thread »
Top « Date » · « Thread »
From t.@codebetter.com
Subject [TeamCity, FAILED] Build Lucene.NET :: Lucene.NET Core #76
Date Tue, 06 Jan 2015 04:15:12 GMT
Build Lucene.NET :: Lucene.NET Core #76 failed (Tests failed: 268 (29 new), passed: 2199, ignored:
113).
Agent: JetBrains-dotnet-agent02
Build results: http://teamcity.codebetter.com/viewLog.html?buildId=177644&buildTypeId=LuceneNet_Core

Failed Tests Summary:
Newly failed tests (29 tests, alphabetically ordered)
==================================================================
Lucene.Net.Tests.dll: Lucene.Net.Codecs.Lucene40.TestLucene40TermVectorsFormat.BaseIndexFileFormatTestCase.TestMergeStability
Lucene.Net.Tests.dll: Lucene.Net.Codecs.Lucene42.TestLucene42DocValuesFormat.BaseDocValuesFormatTestCase.TestBooleanNumericsVsStoredFields
Lucene.Net.Tests.dll: Lucene.Net.Codecs.Lucene42.TestLucene42DocValuesFormat.BaseDocValuesFormatTestCase.TestByteNumericsVsStoredFields
Lucene.Net.Tests.dll: Lucene.Net.Codecs.Lucene42.TestLucene42DocValuesFormat.BaseDocValuesFormatTestCase.TestBytesTwoDocumentsMerged
Lucene.Net.Tests.dll: Lucene.Net.Codecs.Lucene42.TestLucene42DocValuesFormat.BaseDocValuesFormatTestCase.TestTwoDocumentsMerged
Lucene.Net.Tests.dll: Lucene.Net.Codecs.Lucene45.TestLucene45DocValuesFormat.BaseDocValuesFormatTestCase.TestThreads2
Lucene.Net.Tests.dll: Lucene.Net.Codecs.Lucene45.TestLucene45DocValuesFormat.BaseIndexFileFormatTestCase.TestMergeStability
Lucene.Net.Tests.dll: Lucene.Net.Codecs.Perfield.TestPerFieldDocValuesFormat.BaseDocValuesFormatTestCase.TestThreads2
Lucene.Net.Tests.dll: Lucene.Net.Index.TestBagOfPostings.Test
Lucene.Net.Tests.dll: Lucene.Net.Index.TestBinaryDocValuesUpdates.TestUpdateOldSegments
Lucene.Net.Tests.dll: Lucene.Net.Index.TestDeletionPolicy.TestOpenPriorSnapshot
Lucene.Net.Tests.dll: Lucene.Net.Index.TestDirectoryReader.TestGetIndexCommit
Lucene.Net.Tests.dll: Lucene.Net.Index.TestDocValuesFormat.BaseDocValuesFormatTestCase.TestTwoDocumentsMerged
Lucene.Net.Tests.dll: Lucene.Net.Index.TestIndexWriter.TestDeleteUnusedFiles
Lucene.Net.Tests.dll: Lucene.Net.Index.TestIndexWriterConfig.TestLiveChangeToCFS
Lucene.Net.Tests.dll: Lucene.Net.Index.TestIndexWriterOutOfFileDescriptors.Test
Lucene.Net.Tests.dll: Lucene.Net.Index.TestIndexWriterWithThreads.TestIOExceptionDuringWriteSegmentWithThreadsOnlyOnce
Lucene.Net.Tests.dll: Lucene.Net.Index.TestMultiDocValues.TestSortedSet
Lucene.Net.Tests.dll: Lucene.Net.Index.TestOmitNorms.TestNoNrmFile
Lucene.Net.Tests.dll: Lucene.Net.Index.TestOmitTf.TestMixedMerge
Lucene.Net.Tests.dll: Lucene.Net.Search.TestSearchAfter.TestQueries
Lucene.Net.Tests.dll: Lucene.Net.Search.TestShardSearching.TestSimple
Lucene.Net.Tests.dll: Lucene.Net.Search.TestSimilarity.TestSimilarity_Mem
Lucene.Net.Tests.dll: Lucene.Net.Search.TestSimilarityProvider.TestBasics
Lucene.Net.Tests.dll: Lucene.Net.Search.TestSimpleExplanations.TestBQ1
Lucene.Net.Tests.dll: Lucene.Net.Search.TestSubScorerFreqs.TestBooleanQuery
Lucene.Net.Tests.dll: Lucene.Net.Store.TestLockFactory.TestStressLocks
Lucene.Net.Tests.dll: Lucene.Net.Store.TestRAMDirectory.TestIllegalEOF
Lucene.Net.Tests.dll: Lucene.Net.Util.TestPagedBytes.TestDataInputOutput

Other failed tests (239 tests, alphabetically ordered, only first 100 shown)
==================================================================
Lucene.Net.Tests.dll: Lucene.Net.Analysis.TestLookaheadTokenFilter.TestNeverCallingPeek
Lucene.Net.Tests.dll: Lucene.Net.Analysis.TestLookaheadTokenFilter.TestRandomStrings
Lucene.Net.Tests.dll: Lucene.Net.Analysis.TestMockAnalyzer.TestRandomRegexps
Lucene.Net.Tests.dll: Lucene.Net.Codecs.Compressing.TestFastCompressionMode.AbstractTestCompressionMode.TestConstant
Lucene.Net.Tests.dll: Lucene.Net.Codecs.Compressing.TestFastCompressionMode.AbstractTestLZ4CompressionMode.TestLongLiterals
Lucene.Net.Tests.dll: Lucene.Net.Codecs.Compressing.TestFastCompressionMode.AbstractTestLZ4CompressionMode.TestLongMatchs
Lucene.Net.Tests.dll: Lucene.Net.Codecs.Compressing.TestFastDecompressionMode.AbstractTestCompressionMode.TestConstant
Lucene.Net.Tests.dll: Lucene.Net.Codecs.Compressing.TestFastDecompressionMode.AbstractTestLZ4CompressionMode.TestLongLiterals
Lucene.Net.Tests.dll: Lucene.Net.Codecs.Lucene3x.TestLucene3xTermVectorsFormat.BaseIndexFileFormatTestCase.TestMergeStability
Lucene.Net.Tests.dll: Lucene.Net.Codecs.Lucene40.TestLucene40DocValuesFormat.BaseDocValuesFormatTestCase.TestByteNumericsVsStoredFields
Lucene.Net.Tests.dll: Lucene.Net.Codecs.Lucene40.TestLucene40DocValuesFormat.BaseDocValuesFormatTestCase.TestBytesTwoDocumentsMerged
Lucene.Net.Tests.dll: Lucene.Net.Codecs.Lucene40.TestLucene40DocValuesFormat.BaseDocValuesFormatTestCase.TestMissingSortedBytes
Lucene.Net.Tests.dll: Lucene.Net.Codecs.Lucene40.TestLucene40DocValuesFormat.BaseDocValuesFormatTestCase.TestRandomSortedBytes
Lucene.Net.Tests.dll: Lucene.Net.Codecs.Lucene40.TestLucene40DocValuesFormat.BaseDocValuesFormatTestCase.TestSortedMergeAwayAllValues
Lucene.Net.Tests.dll: Lucene.Net.Codecs.Lucene40.TestLucene40DocValuesFormat.BaseDocValuesFormatTestCase.TestTwoDocumentsMerged
Lucene.Net.Tests.dll: Lucene.Net.Codecs.Lucene41.TestBlockPostingsFormat2
Lucene.Net.Tests.dll: Lucene.Net.Codecs.Lucene41.TestBlockPostingsFormat3.Test
Lucene.Net.Tests.dll: Lucene.Net.Codecs.Lucene42.TestLucene42DocValuesFormat.BaseDocValuesFormatTestCase.TestBinaryFixedLengthVsStoredFields
Lucene.Net.Tests.dll: Lucene.Net.Codecs.Lucene42.TestLucene42DocValuesFormat.BaseDocValuesFormatTestCase.TestBinaryVariableLengthVsStoredFields
Lucene.Net.Tests.dll: Lucene.Net.Codecs.Lucene42.TestLucene42DocValuesFormat.BaseDocValuesFormatTestCase.TestBytes
Lucene.Net.Tests.dll: Lucene.Net.Codecs.Lucene42.TestLucene42DocValuesFormat.BaseDocValuesFormatTestCase.TestCodecUsesOwnSortedBytes
Lucene.Net.Tests.dll: Lucene.Net.Codecs.Lucene42.TestLucene42DocValuesFormat.BaseDocValuesFormatTestCase.TestCodecUsesOwnSortedBytesEachTime
Lucene.Net.Tests.dll: Lucene.Net.Codecs.Lucene42.TestLucene42DocValuesFormat.BaseDocValuesFormatTestCase.TestEmptyBinaryValueOnPageSizes
Lucene.Net.Tests.dll: Lucene.Net.Codecs.Lucene42.TestLucene42DocValuesFormat.BaseDocValuesFormatTestCase.TestEmptySortedBytes
Lucene.Net.Tests.dll: Lucene.Net.Codecs.Lucene42.TestLucene42DocValuesFormat.BaseDocValuesFormatTestCase.TestHugeBinaryValueLimit
Lucene.Net.Tests.dll: Lucene.Net.Codecs.Lucene42.TestLucene42DocValuesFormat.BaseDocValuesFormatTestCase.TestMissingSortedBytes
Lucene.Net.Tests.dll: Lucene.Net.Codecs.Lucene42.TestLucene42DocValuesFormat.BaseDocValuesFormatTestCase.TestOneFloat
Lucene.Net.Tests.dll: Lucene.Net.Codecs.Lucene42.TestLucene42DocValuesFormat.BaseDocValuesFormatTestCase.TestOneNumber
Lucene.Net.Tests.dll: Lucene.Net.Codecs.Lucene42.TestLucene42DocValuesFormat.BaseDocValuesFormatTestCase.TestRandomSortedBytes
Lucene.Net.Tests.dll: Lucene.Net.Codecs.Lucene42.TestLucene42DocValuesFormat.BaseDocValuesFormatTestCase.TestSortedBytes
Lucene.Net.Tests.dll: Lucene.Net.Codecs.Lucene42.TestLucene42DocValuesFormat.BaseDocValuesFormatTestCase.TestSortedBytesThreeDocuments
Lucene.Net.Tests.dll: Lucene.Net.Codecs.Lucene42.TestLucene42DocValuesFormat.BaseDocValuesFormatTestCase.TestSortedBytesTwoDocuments
Lucene.Net.Tests.dll: Lucene.Net.Codecs.Lucene42.TestLucene42DocValuesFormat.BaseDocValuesFormatTestCase.TestSortedBytesTwoDocumentsMerged
Lucene.Net.Tests.dll: Lucene.Net.Codecs.Lucene42.TestLucene42DocValuesFormat.BaseDocValuesFormatTestCase.TestSortedFixedLengthVsFieldCache
Lucene.Net.Tests.dll: Lucene.Net.Codecs.Lucene42.TestLucene42DocValuesFormat.BaseDocValuesFormatTestCase.TestSortedFixedLengthVsStoredFields
Lucene.Net.Tests.dll: Lucene.Net.Codecs.Lucene42.TestLucene42DocValuesFormat.BaseDocValuesFormatTestCase.TestSortedMergeAwayAllValues
Lucene.Net.Tests.dll: Lucene.Net.Codecs.Lucene42.TestLucene42DocValuesFormat.BaseDocValuesFormatTestCase.TestSortedSetFixedLengthSingleValuedVsStoredFields
Lucene.Net.Tests.dll: Lucene.Net.Codecs.Lucene42.TestLucene42DocValuesFormat.BaseDocValuesFormatTestCase.TestSortedSetFixedLengthVsStoredFields
Lucene.Net.Tests.dll: Lucene.Net.Codecs.Lucene42.TestLucene42DocValuesFormat.BaseDocValuesFormatTestCase.TestSortedSetFixedLengthVsUninvertedField
Lucene.Net.Tests.dll: Lucene.Net.Codecs.Lucene42.TestLucene42DocValuesFormat.BaseDocValuesFormatTestCase.TestSortedSetMergeAwayAllValues
Lucene.Net.Tests.dll: Lucene.Net.Codecs.Lucene42.TestLucene42DocValuesFormat.BaseDocValuesFormatTestCase.TestSortedSetOneValue
Lucene.Net.Tests.dll: Lucene.Net.Codecs.Lucene42.TestLucene42DocValuesFormat.BaseDocValuesFormatTestCase.TestSortedSetTermsEnum
Lucene.Net.Tests.dll: Lucene.Net.Codecs.Lucene42.TestLucene42DocValuesFormat.BaseDocValuesFormatTestCase.TestSortedSetThreeValuesTwoDocs
Lucene.Net.Tests.dll: Lucene.Net.Codecs.Lucene42.TestLucene42DocValuesFormat.BaseDocValuesFormatTestCase.TestSortedSetTwoDocumentsFirstMissing
Lucene.Net.Tests.dll: Lucene.Net.Codecs.Lucene42.TestLucene42DocValuesFormat.BaseDocValuesFormatTestCase.TestSortedSetTwoDocumentsFirstMissingMerge
Lucene.Net.Tests.dll: Lucene.Net.Codecs.Lucene42.TestLucene42DocValuesFormat.BaseDocValuesFormatTestCase.TestSortedSetTwoDocumentsLastMissing
Lucene.Net.Tests.dll: Lucene.Net.Codecs.Lucene42.TestLucene42DocValuesFormat.BaseDocValuesFormatTestCase.TestSortedSetTwoDocumentsLastMissingMerge
Lucene.Net.Tests.dll: Lucene.Net.Codecs.Lucene42.TestLucene42DocValuesFormat.BaseDocValuesFormatTestCase.TestSortedSetTwoDocumentsMerged
Lucene.Net.Tests.dll: Lucene.Net.Codecs.Lucene42.TestLucene42DocValuesFormat.BaseDocValuesFormatTestCase.TestSortedSetTwoFields
Lucene.Net.Tests.dll: Lucene.Net.Codecs.Lucene42.TestLucene42DocValuesFormat.BaseDocValuesFormatTestCase.TestSortedSetTwoValues
Lucene.Net.Tests.dll: Lucene.Net.Codecs.Lucene42.TestLucene42DocValuesFormat.BaseDocValuesFormatTestCase.TestSortedSetTwoValuesUnordered
Lucene.Net.Tests.dll: Lucene.Net.Codecs.Lucene42.TestLucene42DocValuesFormat.BaseDocValuesFormatTestCase.TestSortedSetVariableLengthSingleValuedVsStoredFields
Lucene.Net.Tests.dll: Lucene.Net.Codecs.Lucene42.TestLucene42DocValuesFormat.BaseDocValuesFormatTestCase.TestSortedSetVariableLengthVsStoredFields
Lucene.Net.Tests.dll: Lucene.Net.Codecs.Lucene42.TestLucene42DocValuesFormat.BaseDocValuesFormatTestCase.TestSortedSetVariableLengthVsUninvertedField
Lucene.Net.Tests.dll: Lucene.Net.Codecs.Lucene42.TestLucene42DocValuesFormat.BaseDocValuesFormatTestCase.TestSortedTermsEnum
Lucene.Net.Tests.dll: Lucene.Net.Codecs.Lucene42.TestLucene42DocValuesFormat.BaseDocValuesFormatTestCase.TestSortedVariableLengthVsFieldCache
Lucene.Net.Tests.dll: Lucene.Net.Codecs.Lucene42.TestLucene42DocValuesFormat.BaseDocValuesFormatTestCase.TestSortedVariableLengthVsStoredFields
Lucene.Net.Tests.dll: Lucene.Net.Codecs.Lucene42.TestLucene42DocValuesFormat.BaseDocValuesFormatTestCase.TestThreads
Lucene.Net.Tests.dll: Lucene.Net.Codecs.Lucene42.TestLucene42DocValuesFormat.BaseDocValuesFormatTestCase.TestThreeFieldsMixed
Lucene.Net.Tests.dll: Lucene.Net.Codecs.Lucene42.TestLucene42DocValuesFormat.BaseDocValuesFormatTestCase.TestThreeFieldsMixed2
Lucene.Net.Tests.dll: Lucene.Net.Codecs.Lucene42.TestLucene42DocValuesFormat.BaseDocValuesFormatTestCase.TestTwoBinaryValues
Lucene.Net.Tests.dll: Lucene.Net.Codecs.Lucene42.TestLucene42DocValuesFormat.BaseDocValuesFormatTestCase.TestTwoFieldsMixed
Lucene.Net.Tests.dll: Lucene.Net.Codecs.Lucene42.TestLucene42DocValuesFormat.BaseDocValuesFormatTestCase.TestTwoNumbers
Lucene.Net.Tests.dll: Lucene.Net.Codecs.Lucene42.TestLucene42DocValuesFormat.BaseDocValuesFormatTestCase.TestVeryLargeButLegalSortedBytes
Lucene.Net.Tests.dll: Lucene.Net.Codecs.Lucene42.TestLucene42DocValuesFormat.BaseIndexFileFormatTestCase.TestMergeStability
Lucene.Net.Tests.dll: Lucene.Net.Codecs.Lucene45.TestLucene45DocValuesFormat.BaseDocValuesFormatTestCase.TestByteMissingVsFieldCache
Lucene.Net.Tests.dll: Lucene.Net.Codecs.Lucene45.TestLucene45DocValuesFormat.BaseDocValuesFormatTestCase.TestIntMissingVsFieldCache
Lucene.Net.Tests.dll: Lucene.Net.Codecs.Lucene45.TestLucene45DocValuesFormat.BaseDocValuesFormatTestCase.TestLongMissingVsFieldCache
Lucene.Net.Tests.dll: Lucene.Net.Codecs.Lucene45.TestLucene45DocValuesFormat.BaseDocValuesFormatTestCase.TestShortMissingVsFieldCache
Lucene.Net.Tests.dll: Lucene.Net.Codecs.Lucene45.TestLucene45DocValuesFormat.BaseDocValuesFormatTestCase.TestSortedMergeAwayAllValues
Lucene.Net.Tests.dll: Lucene.Net.Codecs.Lucene45.TestLucene45DocValuesFormat.BaseDocValuesFormatTestCase.TestSortedSetFixedLengthVsUninvertedField



Newly failed tests details (only first 3 failures shown here)
==================================================================
Lucene.Net.Tests.dll: Lucene.Net.Codecs.Lucene40.TestLucene40TermVectorsFormat.BaseIndexFileFormatTestCase.TestMergeStability
(new) =================
Test(s) failed.   Expected and actual are both <System.Collections.Generic.Dictionary`2[System.String,System.Int64]>
with 14 elements

   at NUnit.Framework.Assert.That(Object actual, IResolveConstraint expression, String message,
Object[] args)
   at NUnit.Framework.Assert.AreEqual(Object expected, Object actual)
   at Lucene.Net.Index.BaseIndexFileFormatTestCase.TestMergeStability() in z:\Builds\work\bcdbe6b8cc677a49\src\Lucene.Net.TestFramework\Index\BaseIndexFileFormatTestCase.cs:line
123
Lucene.Net.Tests.dll: Lucene.Net.Codecs.Lucene42.TestLucene42DocValuesFormat.BaseDocValuesFormatTestCase.TestBooleanNumericsVsStoredFields
(new) =================
Test(s) failed. System.Exception : CheckIndex failed
   at Lucene.Net.Util.TestUtil.CheckIndex(Directory dir, Boolean crossCheckTermVectors) in
z:\Builds\work\bcdbe6b8cc677a49\src\Lucene.Net.TestFramework\Util\TestUtil.cs:line 257
   at Lucene.Net.Store.MockDirectoryWrapper.Dispose() in z:\Builds\work\bcdbe6b8cc677a49\src\Lucene.Net.TestFramework\Store\MockDirectoryWrapper.cs:line
937
   at Lucene.Net.Index.BaseDocValuesFormatTestCase.DoTestNumericsVsStoredFields(LongProducer
longs) in z:\Builds\work\bcdbe6b8cc677a49\src\Lucene.Net.TestFramework\Index\BaseDocValuesFormatTestCase.cs:line
1400
   at Lucene.Net.Index.BaseDocValuesFormatTestCase.TestBooleanNumericsVsStoredFields() in
z:\Builds\work\bcdbe6b8cc677a49\src\Lucene.Net.TestFramework\Index\BaseDocValuesFormatTestCase.cs:line
1497
------- Stderr: -------
CheckIndex failed
´╗┐Segments file=segments_1 numSegments=1 version=4.8 format=
  1 of 1: name=_0 docCount=392
    codec=Lucene42
    compound=True
    numFiles=4
    size (MB)=0.00412178039550781
    diagnostics = System.Collections.Generic.Dictionary`2[System.String,System.String]
    has deletions [delGen=1]
    test: open reader.........OK
    test: check integrity.....OK
    test: check live docs.....OK [1 deleted docs]
    test: fields..............OK [3 fields]
    test: field norms.........OK [0 fields]
    test: terms, freq, prox...OK [392 terms; 782 terms/docs pairs; 0 tokens]
    test (ignoring deletes): terms, freq, prox...OK [393 terms; 784 terms/docs pairs; 0 tokens]
    test: stored fields.......OK [391 total field count; avg 1 fields per doc]
    test: term vectors........OK [0 total vector count; avg 0 term/freq vector fields per
doc]
    test: docvalues...........ERROR [id docsWithField does not exist]
   at Lucene.Net.Index.CheckIndex.CheckDocValues(FieldInfo fi, AtomicReader reader, DocValuesStatus
status) in z:\Builds\work\bcdbe6b8cc677a49\src\Lucene.Net.Core\Index\CheckIndex.cs:line 1909
   at Lucene.Net.Index.CheckIndex.TestDocValues(AtomicReader reader, StreamWriter infoStream)
in z:\Builds\work\bcdbe6b8cc677a49\src\Lucene.Net.Core\Index\CheckIndex.cs:line 1706
FAILED
    WARNING: fixIndex() would remove reference to this segment; full exception:
   at Lucene.Net.Index.CheckIndex.DoCheckIndex(IList`1 onlySegments) in z:\Builds\work\bcdbe6b8cc677a49\src\Lucene.Net.Core\Index\CheckIndex.cs:line
828
WARNING: 1 broken segments (containing 391 documents) detected
Lucene.Net.Tests.dll: Lucene.Net.Codecs.Lucene42.TestLucene42DocValuesFormat.BaseDocValuesFormatTestCase.TestByteNumericsVsStoredFields
(new) =================
Test(s) failed. System.Exception : CheckIndex failed
   at Lucene.Net.Util.TestUtil.CheckIndex(Directory dir, Boolean crossCheckTermVectors) in
z:\Builds\work\bcdbe6b8cc677a49\src\Lucene.Net.TestFramework\Util\TestUtil.cs:line 257
   at Lucene.Net.Store.MockDirectoryWrapper.Dispose() in z:\Builds\work\bcdbe6b8cc677a49\src\Lucene.Net.TestFramework\Store\MockDirectoryWrapper.cs:line
937
   at Lucene.Net.Index.BaseDocValuesFormatTestCase.DoTestNumericsVsStoredFields(LongProducer
longs) in z:\Builds\work\bcdbe6b8cc677a49\src\Lucene.Net.TestFramework\Index\BaseDocValuesFormatTestCase.cs:line
1400
   at Lucene.Net.Index.BaseDocValuesFormatTestCase.TestByteNumericsVsStoredFields() in z:\Builds\work\bcdbe6b8cc677a49\src\Lucene.Net.TestFramework\Index\BaseDocValuesFormatTestCase.cs:line
1507
------- Stderr: -------
CheckIndex failed
´╗┐Segments file=segments_1 numSegments=1 version=4.8 format=
  1 of 1: name=_0 docCount=325
    codec=Lucene42
    compound=True
    numFiles=4
    size (MB)=0.00381565093994141
    diagnostics = System.Collections.Generic.Dictionary`2[System.String,System.String]
    has deletions [delGen=1]
    test: open reader.........OK
    test: check integrity.....OK
    test: check live docs.....OK [1 deleted docs]
    test: fields..............OK [3 fields]
    test: field norms.........OK [0 fields]
    test: terms, freq, prox...OK [326 terms; 648 terms/docs pairs; 0 tokens]
    test (ignoring deletes): terms, freq, prox...OK [327 terms; 650 terms/docs pairs; 0 tokens]
    test: stored fields.......OK [324 total field count; avg 1 fields per doc]
    test: term vectors........OK [0 total vector count; avg 0 term/freq vector fields per
doc]
    test: docvalues...........ERROR [id docsWithField does not exist]
   at Lucene.Net.Index.CheckIndex.CheckDocValues(FieldInfo fi, AtomicReader reader, DocValuesStatus
status) in z:\Builds\work\bcdbe6b8cc677a49\src\Lucene.Net.Core\Index\CheckIndex.cs:line 1909
   at Lucene.Net.Index.CheckIndex.TestDocValues(AtomicReader reader, StreamWriter infoStream)
in z:\Builds\work\bcdbe6b8cc677a49\src\Lucene.Net.Core\Index\CheckIndex.cs:line 1706
FAILED
    WARNING: fixIndex() would remove reference to this segment; full exception:
   at Lucene.Net.Index.CheckIndex.DoCheckIndex(IList`1 onlySegments) in z:\Builds\work\bcdbe6b8cc677a49\src\Lucene.Net.Core\Index\CheckIndex.cs:line
828
WARNING: 1 broken segments (containing 324 documents) detected
see all newly failed tests: http://teamcity.codebetter.com/viewLog.html?buildId=177644&buildTypeId=LuceneNet_Core
Changes included (18 changes)
====================================================
Change f09cd685e2a7caed4c2350408ea43ffd8665076f by itamar (2 files):
TODOs


Change a098c0b5d3f6b896baf1eea7b52af3debf891ae3 by itamar (1 file):
Fixing test


Change 309ebc724b7e5f511ae8b03033651df04db3c3b8 by itamar (4 files):
Lets catch more failing tests


Change 3b37fac9965653f2730a5c457a1580ab414e5fa9 by itamar (4 files):
Cleanup


Change fbabfe9ecedd10837136d0aa37011dbfacebfc67 by itamar (1 file):
NativeFSLocks in Java are de facto singletons

We need to mimick that behavior otherwise IW.IsLocked and IW.Unlock aren't going to work

There may be holes in this current implementation since we may be storing Lock instances of
failed locks, but lets go with this for now


Change b0bbd9e0b85ec9ddb457a82f6d720ffbe1bb91a9 by itamar (5 files):
Fix possible endless recursive call


Change dae38d464346d4935f83acbf1390afd0d88a68fe by itamar (2 files):
Tests


Change d71f71434887749e3dfcde0f53ef3967c230b19d by itamar (2 files):
Better NativeFSLock, phase 2

Now properly dispose of unused FileStreams


Change ca7e09b2e490749a315820e32af10768c0783d40 by itamar (2 files):
Some more work on tests


Change 8a999e1f6629ffa16d51bf7ebef8f303d5c7ca3f by itamar (4 files):
Fix NativeFSLock, round 1

We should be making locks properly based on the characteristics of the CLR and Windows

All relevant unit tests are now green


Change cb2dfdcb6a839019fa34d2e9d8e45c1fe50c2d16 by itamar (1 file):
Clean redundant Dir delete


Change c7473a53dfd83720117abd6f352d5fe881f8232e by itamar (1 file):
Nicer failures


Change 36582a3b80cf9392162df4bc9265d71777b99d68 by itamar (1 file):
Remove debugging code


Change 4b6eafe3dc63378a9d584a753f2e9785288fa6e2 by itamar (6 files):
Fix more sbyte -> byte conversion remnants, making more tests green


Change 45600538e109ee8b136ce50843b2c87ef7c5def1 by itamar (1 file):
Strengthening tests and adding TODO


Change 26de7b85a6c45b13cb425174144ba3cafb96299c by itamar (3 files):
Cleanup temporary files after test run

And a few other minor cleanups


Change 7a5aa5cc2cfb67377668de649e85590bde99eae1 by itamar (11 files):
Minor cleanups


Change 6b0841c45bd2d9c3afee42789337f3ec0882482a by itamar (1 file):
We can use the CLR's Delete recursive


see more information about changed files: http://teamcity.codebetter.com/viewLog.html?tab=buildChangesDiv&buildId=177644&buildTypeId=LuceneNet_Core

============================================================================
Configure email notifications: http://teamcity.codebetter.com/profile.html?init=1&tab=userNotifications

Mime
  • Unnamed multipart/alternative (inline, None, 0 bytes)
View raw message