lucenenet-dev mailing list archives

Site index · List index
Message view « Date » · « Thread »
Top « Date » · « Thread »
From Wyatt Barnett <wyatt.barn...@gmail.com>
Subject RE: [TeamCity, FAILED] Build Lucene.NET :: Lucene.NET Core #52
Date Sun, 28 Dec 2014 21:00:33 GMT
Which test runner?
On Dec 28, 2014 10:59 AM, "Prescott Nasser" <geobmx540@hotmail.com> wrote:

> I run the tests locally and I'm getting like 2000 failures - any thoughts
> on what I'm probably doing wrong?
> > Date: Sat, 27 Dec 2014 13:24:25 -0600
> > From: tc@codebetter.com
> > To: dev@lucenenet.apache.org
> > Subject: [TeamCity, FAILED] Build Lucene.NET :: Lucene.NET Core #52
> >
> > Build Lucene.NET :: Lucene.NET Core #52 failed (Tests failed: 488 (50
> new), passed: 2204, ignored: 77).
> > Agent: JetBrains-dotnet-agent02
> > Build results:
> http://teamcity.codebetter.com/viewLog.html?buildId=176859&buildTypeId=LuceneNet_Core
> >
> > Failed Tests Summary:
> > Newly failed tests (50 tests, alphabetically ordered)
> > ==================================================================
> > Lucene.Net.Tests.dll:
> Lucene.Net.Codecs.Compressing.TestCompressingStoredFieldsFormat.BaseStoredFieldsFormatTestCase.TestReadSkip
> > Lucene.Net.Tests.dll:
> Lucene.Net.Codecs.Compressing.TestCompressingTermVectorsFormat.BaseIndexFileFormatTestCase.TestMergeStability
> > Lucene.Net.Tests.dll:
> Lucene.Net.Codecs.Lucene3x.TestLucene3xTermVectorsFormat.BaseTermVectorsFormatTestCase.TestRandom
> > Lucene.Net.Tests.dll:
> Lucene.Net.Codecs.Lucene40.TestLucene40PostingsFormat.BasePostingsFormatTestCase.TestDocsAndFreqs
> > Lucene.Net.Tests.dll:
> Lucene.Net.Codecs.Lucene40.TestLucene40PostingsFormat.BasePostingsFormatTestCase.TestDocsOnly
> > Lucene.Net.Tests.dll:
> Lucene.Net.Codecs.Lucene40.TestLucene40TermVectorsFormat.BaseTermVectorsFormatTestCase.TestMerge
> > Lucene.Net.Tests.dll:
> Lucene.Net.Codecs.Lucene40.TestLucene40TermVectorsFormat.BaseTermVectorsFormatTestCase.TestRandom
> > Lucene.Net.Tests.dll:
> Lucene.Net.Codecs.Lucene41.TestBlockPostingsFormat.BasePostingsFormatTestCase.TestDocsAndFreqsAndPositionsAndOffsets
> > Lucene.Net.Tests.dll:
> Lucene.Net.Codecs.Lucene41.TestBlockPostingsFormat2.TestDFBlockSize
> > Lucene.Net.Tests.dll:
> Lucene.Net.Codecs.Lucene42.TestLucene42DocValuesFormat.BaseDocValuesFormatTestCase.TestByteNumericsVsStoredFields
> > Lucene.Net.Tests.dll:
> Lucene.Net.Codecs.Lucene42.TestLucene42DocValuesFormat.BaseDocValuesFormatTestCase.TestGCDCompression
> > Lucene.Net.Tests.dll:
> Lucene.Net.Codecs.Lucene42.TestLucene42DocValuesFormat.BaseDocValuesFormatTestCase.TestIntNumericsVsStoredFields
> > Lucene.Net.Tests.dll:
> Lucene.Net.Codecs.Lucene42.TestLucene42DocValuesFormat.BaseDocValuesFormatTestCase.TestShortNumericsVsStoredFields
> > Lucene.Net.Tests.dll:
> Lucene.Net.Codecs.Perfield.TestPerFieldDocValuesFormat.BaseIndexFileFormatTestCase.TestMergeStability
> > Lucene.Net.Tests.dll:
> Lucene.Net.Codecs.Perfield.TestPerFieldPostingsFormat.BasePostingsFormatTestCase.TestDocsAndFreqsAndPositionsAndOffsetsAndPayloads
> > Lucene.Net.Tests.dll:
> Lucene.Net.Index.TestAddIndexes.TestAddIndexesWithRollback
> > Lucene.Net.Tests.dll: Lucene.Net.Index.TestBagOfPostings.Test
> > Lucene.Net.Tests.dll:
> Lucene.Net.Index.TestBinaryDocValuesUpdates.TestUpdateFewSegments
> > Lucene.Net.Tests.dll: Lucene.Net.Index.TestCompoundFile.TestManySubFiles
> > Lucene.Net.Tests.dll:
> Lucene.Net.Index.TestDeletionPolicy.TestKeepAllDeletionPolicy
> > Lucene.Net.Tests.dll:
> Lucene.Net.Index.TestDirectoryReaderReopen.TestCommitReopen
> > Lucene.Net.Tests.dll:
> Lucene.Net.Index.TestDirectoryReaderReopen.TestOpenIfChangedNRTToCommit
> > Lucene.Net.Tests.dll:
> Lucene.Net.Index.TestDirectoryReaderReopen.TestReopen_Mem
> > Lucene.Net.Tests.dll:
> Lucene.Net.Index.TestDocValuesFormat.BaseDocValuesFormatTestCase.TestHugeBinaryValueLimit
> > Lucene.Net.Tests.dll:
> Lucene.Net.Index.TestDocValuesFormat.BaseDocValuesFormatTestCase.TestSortedSetVariableLengthVsStoredFields
> > Lucene.Net.Tests.dll:
> Lucene.Net.Index.TestDocValuesFormat.BaseDocValuesFormatTestCase.TestTwoDocumentsMerged
> > Lucene.Net.Tests.dll: Lucene.Net.Index.TestDocValuesWithThreads.Test2
> > Lucene.Net.Tests.dll:
> Lucene.Net.Index.TestIndexWriterNRTIsCurrent.TestIsCurrentWithThreads
> > Lucene.Net.Tests.dll:
> Lucene.Net.Index.TestIndexWriterReader.TestMergeWarmer
> > Lucene.Net.Tests.dll:
> Lucene.Net.Index.TestIndexWriterWithThreads.TestOpenTwoIndexWritersOnDifferentThreads
> > Lucene.Net.Tests.dll:
> Lucene.Net.Index.TestNumericDocValuesUpdates.TestSegmentMerges
> > Lucene.Net.Tests.dll: Lucene.Net.Index.TestOmitNorms.TestMixedMerge
> > Lucene.Net.Tests.dll: Lucene.Net.Index.TestOmitTf.TestBasic
> > Lucene.Net.Tests.dll: Lucene.Net.Index.TestOmitTf.TestMixedRAM
> > Lucene.Net.Tests.dll: Lucene.Net.Index.TestOmitTf.TestNoPrxFile
> > Lucene.Net.Tests.dll:
> Lucene.Net.Index.TestParallelReaderEmptyIndex.TestEmptyIndexWithVectors
> > Lucene.Net.Tests.dll: Lucene.Net.Search.TestLiveFieldValues.Test
> > Lucene.Net.Tests.dll:
> Lucene.Net.Search.TestMinShouldMatch2.TestAdvanceAllTerms
> > Lucene.Net.Tests.dll:
> Lucene.Net.Search.TestMinShouldMatch2.TestAdvanceVaryingNumberOfTerms
> > Lucene.Net.Tests.dll:
> Lucene.Net.Search.TestMinShouldMatch2.TestNextAllTerms
> > Lucene.Net.Tests.dll:
> Lucene.Net.Search.TestMinShouldMatch2.TestNextVaryingNumberOfTerms
> > Lucene.Net.Tests.dll:
> Lucene.Net.Search.TestSimpleSearchEquivalence.TestExactPhraseVersusBooleanAndWithHoles
> > Lucene.Net.Tests.dll:
> Lucene.Net.Search.TestSimpleSearchEquivalence.TestExactPhraseVersusMultiPhrase
> > Lucene.Net.Tests.dll:
> Lucene.Net.Search.TestSimpleSearchEquivalence.TestPhraseVersusSloppyPhrase
> > Lucene.Net.Tests.dll:
> Lucene.Net.Search.TestSimpleSearchEquivalence.TestPhraseVersusSloppyPhraseWithHoles
> > Lucene.Net.Tests.dll:
> Lucene.Net.Search.TestSloppyPhraseQuery2.TestIncreasingSloppiness
> > Lucene.Net.Tests.dll:
> Lucene.Net.Search.TestSloppyPhraseQuery2.TestIncreasingSloppinessWithHoles
> > Lucene.Net.Tests.dll: Lucene.Net.Store.TestRAMDirectory.TestIllegalEOF
> > Lucene.Net.Tests.dll:
> Lucene.Net.Util.Automaton.TestUTF32ToUTF8.TestRandomRegexes
> > Lucene.Net.Tests.dll:
> Lucene.Net.Util.TestOpenBitSet.BaseDocIdSetTestCase`1.TestAgainstBitSet
> >
> > Other failed tests (438 tests, alphabetically ordered, only first 100
> shown)
> > ==================================================================
> > Lucene.Net.Tests.dll:
> Lucene.Net.Analysis.TestGraphTokenizers.TestDoubleMockGraphTokenFilterRandom
> > Lucene.Net.Tests.dll:
> Lucene.Net.Analysis.TestGraphTokenizers.TestMockGraphTokenFilterAfterHolesRandom
> > Lucene.Net.Tests.dll:
> Lucene.Net.Analysis.TestGraphTokenizers.TestMockGraphTokenFilterBeforeHolesRandom
> > Lucene.Net.Tests.dll:
> Lucene.Net.Analysis.TestGraphTokenizers.TestMockGraphTokenFilterRandom
> > Lucene.Net.Tests.dll:
> Lucene.Net.Analysis.TestLookaheadTokenFilter.TestNeverCallingPeek
> > Lucene.Net.Tests.dll:
> Lucene.Net.Analysis.TestLookaheadTokenFilter.TestRandomStrings
> > Lucene.Net.Tests.dll:
> Lucene.Net.Analysis.TestMockAnalyzer.TestRandomRegexps
> > Lucene.Net.Tests.dll:
> Lucene.Net.Analysis.TestMockAnalyzer.TestRandomStrings
> > Lucene.Net.Tests.dll: Lucene.Net.Analysis.TestMockAnalyzer.TestSingleChar
> > Lucene.Net.Tests.dll: Lucene.Net.Analysis.TestMockAnalyzer.TestThreeChars
> > Lucene.Net.Tests.dll: Lucene.Net.Analysis.TestMockAnalyzer.TestTwoChars
> > Lucene.Net.Tests.dll: Lucene.Net.Analysis.TestMockAnalyzer.TestUppercase
> > Lucene.Net.Tests.dll:
> Lucene.Net.Codecs.Compressing.TestCompressingStoredFieldsFormat.BaseStoredFieldsFormatTestCase.TestBigDocuments
> > Lucene.Net.Tests.dll:
> Lucene.Net.Codecs.Compressing.TestCompressingTermVectorsFormat.BaseTermVectorsFormatTestCase.TestClone
> > Lucene.Net.Tests.dll:
> Lucene.Net.Codecs.Compressing.TestCompressingTermVectorsFormat.BaseTermVectorsFormatTestCase.TestHighFreqs
> > Lucene.Net.Tests.dll:
> Lucene.Net.Codecs.Compressing.TestCompressingTermVectorsFormat.BaseTermVectorsFormatTestCase.TestLotsOfFields
> > Lucene.Net.Tests.dll:
> Lucene.Net.Codecs.Compressing.TestCompressingTermVectorsFormat.BaseTermVectorsFormatTestCase.TestMerge
> > Lucene.Net.Tests.dll:
> Lucene.Net.Codecs.Compressing.TestCompressingTermVectorsFormat.BaseTermVectorsFormatTestCase.TestMixedOptions
> > Lucene.Net.Tests.dll:
> Lucene.Net.Codecs.Compressing.TestCompressingTermVectorsFormat.BaseTermVectorsFormatTestCase.TestRandom
> > Lucene.Net.Tests.dll:
> Lucene.Net.Codecs.Compressing.TestCompressingTermVectorsFormat.BaseTermVectorsFormatTestCase.TestRareVectors
> > Lucene.Net.Tests.dll:
> Lucene.Net.Codecs.Compressing.TestFastCompressionMode.AbstractTestCompressionMode.TestConstant
> > Lucene.Net.Tests.dll:
> Lucene.Net.Codecs.Compressing.TestFastCompressionMode.AbstractTestLZ4CompressionMode.TestLongLiterals
> > Lucene.Net.Tests.dll:
> Lucene.Net.Codecs.Compressing.TestFastDecompressionMode.AbstractTestCompressionMode.TestConstant
> > Lucene.Net.Tests.dll:
> Lucene.Net.Codecs.Compressing.TestFastDecompressionMode.AbstractTestLZ4CompressionMode.TestLongLiterals
> > Lucene.Net.Tests.dll:
> Lucene.Net.Codecs.Compressing.TestFastDecompressionMode.AbstractTestLZ4CompressionMode.TestLongMatchs
> > Lucene.Net.Tests.dll:
> Lucene.Net.Codecs.Compressing.TestHighCompressionMode.AbstractTestCompressionMode.TestDecompress
> > Lucene.Net.Tests.dll:
> Lucene.Net.Codecs.Compressing.TestHighCompressionMode.AbstractTestCompressionMode.TestLUCENE5201
> > Lucene.Net.Tests.dll:
> Lucene.Net.Codecs.Compressing.TestHighCompressionMode.AbstractTestCompressionMode.TestPartialDecompress
> > Lucene.Net.Tests.dll:
> Lucene.Net.Codecs.Lucene3x.TestLucene3xPostingsFormat.BasePostingsFormatTestCase.TestDocsOnly
> > Lucene.Net.Tests.dll:
> Lucene.Net.Codecs.Lucene3x.TestLucene3xPostingsFormat.BasePostingsFormatTestCase.TestRandom
> > Lucene.Net.Tests.dll:
> Lucene.Net.Codecs.Lucene3x.TestLucene3xStoredFieldsFormat.BaseStoredFieldsFormatTestCase.TestBigDocuments
> > Lucene.Net.Tests.dll:
> Lucene.Net.Codecs.Lucene3x.TestLucene3xTermVectorsFormat.BaseTermVectorsFormatTestCase.TestClone
> > Lucene.Net.Tests.dll:
> Lucene.Net.Codecs.Lucene3x.TestLucene3xTermVectorsFormat.BaseTermVectorsFormatTestCase.TestLotsOfFields
> > Lucene.Net.Tests.dll:
> Lucene.Net.Codecs.Lucene3x.TestLucene3xTermVectorsFormat.BaseTermVectorsFormatTestCase.TestMixedOptions
> > Lucene.Net.Tests.dll:
> Lucene.Net.Codecs.Lucene3x.TestLucene3xTermVectorsFormat.BaseTermVectorsFormatTestCase.TestRareVectors
> > Lucene.Net.Tests.dll:
> Lucene.Net.Codecs.Lucene3x.TestTermInfosReaderIndex.TestSeekEnum
> > Lucene.Net.Tests.dll:
> Lucene.Net.Codecs.Lucene40.TestLucene40DocValuesFormat.BaseDocValuesFormatTestCase.TestByteMissingVsFieldCache
> > Lucene.Net.Tests.dll:
> Lucene.Net.Codecs.Lucene40.TestLucene40DocValuesFormat.BaseDocValuesFormatTestCase.TestIntMissingVsFieldCache
> > Lucene.Net.Tests.dll:
> Lucene.Net.Codecs.Lucene40.TestLucene40DocValuesFormat.BaseDocValuesFormatTestCase.TestLongMissingVsFieldCache
> > Lucene.Net.Tests.dll:
> Lucene.Net.Codecs.Lucene40.TestLucene40DocValuesFormat.BaseDocValuesFormatTestCase.TestMissingSortedBytes
> > Lucene.Net.Tests.dll:
> Lucene.Net.Codecs.Lucene40.TestLucene40DocValuesFormat.BaseDocValuesFormatTestCase.TestRandomSortedBytes
> > Lucene.Net.Tests.dll:
> Lucene.Net.Codecs.Lucene40.TestLucene40DocValuesFormat.BaseDocValuesFormatTestCase.TestShortMissingVsFieldCache
> > Lucene.Net.Tests.dll:
> Lucene.Net.Codecs.Lucene40.TestLucene40DocValuesFormat.BaseDocValuesFormatTestCase.TestSortedMergeAwayAllValues
> > Lucene.Net.Tests.dll:
> Lucene.Net.Codecs.Lucene40.TestLucene40DocValuesFormat.BaseDocValuesFormatTestCase.TestSortedSetFixedLengthSingleValuedVsStoredFields
> > Lucene.Net.Tests.dll:
> Lucene.Net.Codecs.Lucene40.TestLucene40DocValuesFormat.BaseDocValuesFormatTestCase.TestSortedSetFixedLengthVsStoredFields
> > Lucene.Net.Tests.dll:
> Lucene.Net.Codecs.Lucene40.TestLucene40DocValuesFormat.BaseDocValuesFormatTestCase.TestSortedSetFixedLengthVsUninvertedField
> > Lucene.Net.Tests.dll:
> Lucene.Net.Codecs.Lucene40.TestLucene40DocValuesFormat.BaseDocValuesFormatTestCase.TestSortedSetMergeAwayAllValues
> > Lucene.Net.Tests.dll:
> Lucene.Net.Codecs.Lucene40.TestLucene40DocValuesFormat.BaseDocValuesFormatTestCase.TestSortedSetOneValue
> > Lucene.Net.Tests.dll:
> Lucene.Net.Codecs.Lucene40.TestLucene40DocValuesFormat.BaseDocValuesFormatTestCase.TestSortedSetTermsEnum
> > Lucene.Net.Tests.dll:
> Lucene.Net.Codecs.Lucene40.TestLucene40DocValuesFormat.BaseDocValuesFormatTestCase.TestSortedSetThreeValuesTwoDocs
> >
> >
> >
> > Newly failed tests details (only first 3 failures shown here)
> > ==================================================================
> > Lucene.Net.Tests.dll:
> Lucene.Net.Codecs.Compressing.TestCompressingStoredFieldsFormat.BaseStoredFieldsFormatTestCase.TestReadSkip
> (new) =================
> > Test(s) failed.   Expected: <[63 63 66 78 6c 73 78 78 68 71 62 75 70]>
> >   But was:  null
> >
> >    at NUnit.Framework.Assert.That(Object actual, IResolveConstraint
> expression, String message, Object[] args)
> >    at NUnit.Framework.Assert.AreEqual(Object expected, Object actual)
> >    at Lucene.Net.Index.BaseStoredFieldsFormatTestCase.TestReadSkip() in
> z:\Builds\work\bcdbe6b8cc677a49\src\Lucene.Net.TestFramework\Index\BaseStoredFieldsFormatTestCase.cs:line
> 405
> > Lucene.Net.Tests.dll:
> Lucene.Net.Codecs.Compressing.TestCompressingTermVectorsFormat.BaseIndexFileFormatTestCase.TestMergeStability
> (new) =================
> > Test(s) failed. System.Exception : CheckIndex failed
> >    at Lucene.Net.Util.TestUtil.CheckIndex(Directory dir, Boolean
> crossCheckTermVectors) in
> z:\Builds\work\bcdbe6b8cc677a49\src\Lucene.Net.TestFramework\Util\TestUtil.cs:line
> 257
> >    at Lucene.Net.Store.MockDirectoryWrapper.Dispose() in
> z:\Builds\work\bcdbe6b8cc677a49\src\Lucene.Net.TestFramework\Store\MockDirectoryWrapper.cs:line
> 935
> >    at Lucene.Net.Index.BaseIndexFileFormatTestCase.TestMergeStability()
> in
> z:\Builds\work\bcdbe6b8cc677a49\src\Lucene.Net.TestFramework\Index\BaseIndexFileFormatTestCase.cs:line
> 126
> > ------- Stderr: -------
> > CheckIndex failed
> > Segments file=segments_1 numSegments=1 version=4.8 format=
> >   1 of 1: name=_0 docCount=504
> >
>  codec=HighCompressionCompressingStoredFields(storedFieldsFormat=CompressingStoredFieldsFormat(compressionMode=HIGH_COMPRESSION,
> chunkSize=16384),
> termVectorsFormat=CompressingTermVectorsFormat(compressionMode=HIGH_COMPRESSION,
> chunkSize=16384))
> >     compound=False
> >     numFiles=12
> >     size (MB)=0.0136289596557617
> >     diagnostics =
> System.Collections.Generic.Dictionary`2[System.String,System.String]
> >     no deletions
> >     test: open reader.........OK
> >     test: check integrity.....OK
> >     test: check live docs.....OK
> >     test: fields..............OK [6 fields]
> >     test: field norms.........OK [6 fields]
> >     test: terms, freq, prox...OK [24 terms; 868 terms/docs pairs; 2047
> tokens]
> >     test: stored fields.......OK [0 total field count; avg 0 fields per
> doc]
> >     test: term vectors........ERROR [vector term=[0] field=f_OFFSETS
> does not exist in postings; doc=37]
> >    at Lucene.Net.Index.CheckIndex.TestTermVectors(AtomicReader reader,
> StreamWriter infoStream, Boolean verbose, Boolean crossCheckTermVectors) in
> z:\Builds\work\bcdbe6b8cc677a49\src\Lucene.Net.Core\Index\CheckIndex.cs:line
> 2106
> >     test: docvalues...........OK [0 docvalues fields; 0 BINARY; 0
> NUMERIC; 0 SORTED; 0 SORTED_SET]
> > FAILED
> >     WARNING: fixIndex() would remove reference to this segment; full
> exception:
> >    at Lucene.Net.Index.CheckIndex.DoCheckIndex(IList`1 onlySegments) in
> z:\Builds\work\bcdbe6b8cc677a49\src\Lucene.Net.Core\Index\CheckIndex.cs:line
> 824
> > WARNING: 1 broken segments (containing 504 documents) detected
> > Lucene.Net.Tests.dll:
> Lucene.Net.Codecs.Lucene3x.TestLucene3xTermVectorsFormat.BaseTermVectorsFormatTestCase.TestRandom
> (new) =================
> > Test(s) failed.   Expected and actual are both
> <System.Collections.Generic.HashSet`1[System.String]>
> >   Values differ at index [0]
> >   String lengths are both 10. Strings differ at index 0.
> >   Expected: "qntgaclitr"
> >   But was:  "djymvmjquu"
> >   -----------^
> >
> >    at NUnit.Framework.Assert.That(Object actual, IResolveConstraint
> expression, String message, Object[] args)
> >    at NUnit.Framework.Assert.AreEqual(Object expected, Object actual)
> >    at
> Lucene.Net.Index.BaseTermVectorsFormatTestCase.AssertEquals(RandomDocument
> doc, Fields fields) in
> z:\Builds\work\bcdbe6b8cc677a49\src\Lucene.Net.TestFramework\Index\BaseTermVectorsFormatTestCase.cs:line
> 493
> >    at Lucene.Net.Index.BaseTermVectorsFormatTestCase.TestRandom() in
> z:\Builds\work\bcdbe6b8cc677a49\src\Lucene.Net.TestFramework\Index\BaseTermVectorsFormatTestCase.cs:line
> 807
> > see all newly failed tests:
> http://teamcity.codebetter.com/viewLog.html?buildId=176859&buildTypeId=LuceneNet_Core
> > Changes included (2 changes)
> > ====================================================
> > Change 11917175dc905213a642c906d36399a2a99e8bcc by itamar (0 file):
> > Merge remote-tracking branch 'laimis/MockTokenizer_fixes'
> >
> >
> > Change ff4ef2840d4d5f0cfa7d27db2973d84e64bd666a by laimis (1 file):
> > return -1 if reader returns 0 or less
> >
> >
> > see more information about changed files:
> http://teamcity.codebetter.com/viewLog.html?tab=buildChangesDiv&buildId=176859&buildTypeId=LuceneNet_Core
> >
> >
> ============================================================================
> > Configure email notifications:
> http://teamcity.codebetter.com/profile.html?init=1&tab=userNotifications
>

Mime
  • Unnamed multipart/alternative (inline, None, 0 bytes)
View raw message