lucenenet-dev mailing list archives

Site index · List index
Message view « Date » · « Thread »
Top « Date » · « Thread »
From t.@codebetter.com
Subject [TeamCity, FAILED] Build Lucene.NET :: Lucene.NET Core #56
Date Tue, 30 Dec 2014 23:10:20 GMT
Build Lucene.NET :: Lucene.NET Core #56 failed (Tests failed: 451 (38 new), passed: 2241, ignored:
77).
Agent: JetBrains-dotnet-agent02
Build results: http://teamcity.codebetter.com/viewLog.html?buildId=177015&buildTypeId=LuceneNet_Core

Failed Tests Summary:
Newly failed tests (38 tests, alphabetically ordered)
==================================================================
Lucene.Net.Tests.dll: Lucene.Net.Codecs.Lucene3x.TestLucene3xPostingsFormat.BasePostingsFormatTestCase.TestDocsAndFreqs
Lucene.Net.Tests.dll: Lucene.Net.Codecs.Lucene3x.TestLucene3xPostingsFormat.BasePostingsFormatTestCase.TestDocsOnly
Lucene.Net.Tests.dll: Lucene.Net.Codecs.Lucene3x.TestLucene3xPostingsFormat.BasePostingsFormatTestCase.TestRandom
Lucene.Net.Tests.dll: Lucene.Net.Codecs.Lucene3x.TestLucene3xTermVectorsFormat.BaseTermVectorsFormatTestCase.TestHighFreqs
Lucene.Net.Tests.dll: Lucene.Net.Codecs.Lucene40.TestLucene40PostingsFormat.BasePostingsFormatTestCase.TestDocsOnly
Lucene.Net.Tests.dll: Lucene.Net.Codecs.Lucene40.TestLucene40TermVectorsFormat.BaseTermVectorsFormatTestCase.TestHighFreqs
Lucene.Net.Tests.dll: Lucene.Net.Codecs.Lucene41.TestBlockPostingsFormat.BasePostingsFormatTestCase.TestDocsAndFreqs
Lucene.Net.Tests.dll: Lucene.Net.Codecs.Lucene41.TestBlockPostingsFormat.BasePostingsFormatTestCase.TestDocsAndFreqsAndPositions
Lucene.Net.Tests.dll: Lucene.Net.Codecs.Lucene41.TestBlockPostingsFormat.BasePostingsFormatTestCase.TestDocsAndFreqsAndPositionsAndOffsetsAndPayloads
Lucene.Net.Tests.dll: Lucene.Net.Codecs.Lucene41.TestBlockPostingsFormat.BasePostingsFormatTestCase.TestDocsAndFreqsAndPositionsAndPayloads
Lucene.Net.Tests.dll: Lucene.Net.Codecs.Lucene41.TestBlockPostingsFormat2.TestDFBlockSize
Lucene.Net.Tests.dll: Lucene.Net.Codecs.Lucene42.TestLucene42DocValuesFormat.BaseDocValuesFormatTestCase.TestGCDCompression
Lucene.Net.Tests.dll: Lucene.Net.Codecs.Lucene42.TestLucene42DocValuesFormat.BaseDocValuesFormatTestCase.TestTwoDocumentsMerged
Lucene.Net.Tests.dll: Lucene.Net.Codecs.Lucene45.TestLucene45DocValuesFormat.BaseDocValuesFormatTestCase.TestHugeBinaryValueLimit
Lucene.Net.Tests.dll: Lucene.Net.Codecs.Lucene45.TestLucene45DocValuesFormat.BaseDocValuesFormatTestCase.TestSortedSetTwoDocumentsLastMissingMerge
Lucene.Net.Tests.dll: Lucene.Net.Codecs.Perfield.TestPerFieldDocValuesFormat.BaseDocValuesFormatTestCase.TestBytesTwoDocumentsMerged
Lucene.Net.Tests.dll: Lucene.Net.Codecs.Perfield.TestPerFieldDocValuesFormat.BaseDocValuesFormatTestCase.TestSortedSetTwoDocumentsFirstMissingMerge
Lucene.Net.Tests.dll: Lucene.Net.Codecs.Perfield.TestPerFieldDocValuesFormat.BaseDocValuesFormatTestCase.TestSortedSetTwoDocumentsLastMissingMerge
Lucene.Net.Tests.dll: Lucene.Net.Codecs.Perfield.TestPerFieldPostingsFormat.BasePostingsFormatTestCase.TestRandom
Lucene.Net.Tests.dll: Lucene.Net.Index.TestIndexWriter.TestEmptyFSDirWithNoLock
Lucene.Net.Tests.dll: Lucene.Net.Index.TestIndexWriterExceptions.TestDocumentsWriterExceptions
Lucene.Net.Tests.dll: Lucene.Net.Index.TestIndexWriterExceptions.TestNoLostDeletesOrUpdates
Lucene.Net.Tests.dll: Lucene.Net.Index.TestIndexWriterReader.TestDuringAddDelete
Lucene.Net.Tests.dll: Lucene.Net.Index.TestIndexWriterReader.TestDuringAddIndexes
Lucene.Net.Tests.dll: Lucene.Net.Index.TestLongPostings.TestLongPostings_Mem
Lucene.Net.Tests.dll: Lucene.Net.Index.TestMultiDocValues.TestSortedSet
Lucene.Net.Tests.dll: Lucene.Net.Index.TestOmitNorms.TestMixedMerge
Lucene.Net.Tests.dll: Lucene.Net.Index.TestOmitNorms.TestMixedRAM
Lucene.Net.Tests.dll: Lucene.Net.Index.TestOmitTf.TestBasic
Lucene.Net.Tests.dll: Lucene.Net.Index.TestPostingsFormat.BasePostingsFormatTestCase.TestDocsAndFreqsAndPositionsAndOffsets
Lucene.Net.Tests.dll: Lucene.Net.Index.TestPostingsFormat.BasePostingsFormatTestCase.TestDocsAndFreqsAndPositionsAndPayloads
Lucene.Net.Tests.dll: Lucene.Net.Index.TestStressAdvance.TestStressAdvance_Mem
Lucene.Net.Tests.dll: Lucene.Net.Index.TestTransactions.TestTransactions_Mem
Lucene.Net.Tests.dll: Lucene.Net.Search.Similarities.TestSimilarityBase.TestHeartRanking
Lucene.Net.Tests.dll: Lucene.Net.Search.TestLiveFieldValues.Test
Lucene.Net.Tests.dll: Lucene.Net.Search.TestSimpleSearchEquivalence.TestExactPhraseVersusMultiPhraseWithHoles
Lucene.Net.Tests.dll: Lucene.Net.Search.TestSloppyPhraseQuery2.TestRepetitiveIncreasingSloppiness
Lucene.Net.Tests.dll: Lucene.Net.Util.TestPagedBytes.TestDataInputOutput2

Other failed tests (413 tests, alphabetically ordered, only first 100 shown)
==================================================================
Lucene.Net.Tests.dll: Lucene.Net.Analysis.TestLookaheadTokenFilter.TestRandomStrings
Lucene.Net.Tests.dll: Lucene.Net.Analysis.TestMockAnalyzer.TestRandomRegexps
Lucene.Net.Tests.dll: Lucene.Net.Codecs.Compressing.TestCompressingStoredFieldsFormat.BaseStoredFieldsFormatTestCase.TestBigDocuments
Lucene.Net.Tests.dll: Lucene.Net.Codecs.Compressing.TestCompressingTermVectorsFormat.BaseIndexFileFormatTestCase.TestMergeStability
Lucene.Net.Tests.dll: Lucene.Net.Codecs.Compressing.TestCompressingTermVectorsFormat.BaseTermVectorsFormatTestCase.TestClone
Lucene.Net.Tests.dll: Lucene.Net.Codecs.Compressing.TestCompressingTermVectorsFormat.BaseTermVectorsFormatTestCase.TestHighFreqs
Lucene.Net.Tests.dll: Lucene.Net.Codecs.Compressing.TestCompressingTermVectorsFormat.BaseTermVectorsFormatTestCase.TestLotsOfFields
Lucene.Net.Tests.dll: Lucene.Net.Codecs.Compressing.TestCompressingTermVectorsFormat.BaseTermVectorsFormatTestCase.TestMerge
Lucene.Net.Tests.dll: Lucene.Net.Codecs.Compressing.TestCompressingTermVectorsFormat.BaseTermVectorsFormatTestCase.TestMixedOptions
Lucene.Net.Tests.dll: Lucene.Net.Codecs.Compressing.TestCompressingTermVectorsFormat.BaseTermVectorsFormatTestCase.TestRandom
Lucene.Net.Tests.dll: Lucene.Net.Codecs.Compressing.TestCompressingTermVectorsFormat.BaseTermVectorsFormatTestCase.TestRareVectors
Lucene.Net.Tests.dll: Lucene.Net.Codecs.Compressing.TestFastCompressionMode.AbstractTestCompressionMode.TestConstant
Lucene.Net.Tests.dll: Lucene.Net.Codecs.Compressing.TestFastCompressionMode.AbstractTestLZ4CompressionMode.TestLongLiterals
Lucene.Net.Tests.dll: Lucene.Net.Codecs.Compressing.TestFastCompressionMode.AbstractTestLZ4CompressionMode.TestLongMatchs
Lucene.Net.Tests.dll: Lucene.Net.Codecs.Compressing.TestFastDecompressionMode.AbstractTestCompressionMode.TestConstant
Lucene.Net.Tests.dll: Lucene.Net.Codecs.Compressing.TestFastDecompressionMode.AbstractTestLZ4CompressionMode.TestLongLiterals
Lucene.Net.Tests.dll: Lucene.Net.Codecs.Compressing.TestHighCompressionMode.AbstractTestCompressionMode.TestDecompress
Lucene.Net.Tests.dll: Lucene.Net.Codecs.Compressing.TestHighCompressionMode.AbstractTestCompressionMode.TestLUCENE5201
Lucene.Net.Tests.dll: Lucene.Net.Codecs.Compressing.TestHighCompressionMode.AbstractTestCompressionMode.TestPartialDecompress
Lucene.Net.Tests.dll: Lucene.Net.Codecs.Lucene3x.TestLucene3xPostingsFormat.BasePostingsFormatTestCase.TestDocsAndFreqsAndPositionsAndOffsets
Lucene.Net.Tests.dll: Lucene.Net.Codecs.Lucene3x.TestLucene3xStoredFieldsFormat.BaseStoredFieldsFormatTestCase.TestBigDocuments
Lucene.Net.Tests.dll: Lucene.Net.Codecs.Lucene3x.TestLucene3xTermVectorsFormat.BaseTermVectorsFormatTestCase.TestClone
Lucene.Net.Tests.dll: Lucene.Net.Codecs.Lucene3x.TestLucene3xTermVectorsFormat.BaseTermVectorsFormatTestCase.TestLotsOfFields
Lucene.Net.Tests.dll: Lucene.Net.Codecs.Lucene3x.TestLucene3xTermVectorsFormat.BaseTermVectorsFormatTestCase.TestMerge
Lucene.Net.Tests.dll: Lucene.Net.Codecs.Lucene3x.TestLucene3xTermVectorsFormat.BaseTermVectorsFormatTestCase.TestMixedOptions
Lucene.Net.Tests.dll: Lucene.Net.Codecs.Lucene3x.TestLucene3xTermVectorsFormat.BaseTermVectorsFormatTestCase.TestRareVectors
Lucene.Net.Tests.dll: Lucene.Net.Codecs.Lucene3x.TestTermInfosReaderIndex.TestSeekEnum
Lucene.Net.Tests.dll: Lucene.Net.Codecs.Lucene40.TestLucene40DocValuesFormat.BaseDocValuesFormatTestCase.TestByteMissingVsFieldCache
Lucene.Net.Tests.dll: Lucene.Net.Codecs.Lucene40.TestLucene40DocValuesFormat.BaseDocValuesFormatTestCase.TestIntMissingVsFieldCache
Lucene.Net.Tests.dll: Lucene.Net.Codecs.Lucene40.TestLucene40DocValuesFormat.BaseDocValuesFormatTestCase.TestLongMissingVsFieldCache
Lucene.Net.Tests.dll: Lucene.Net.Codecs.Lucene40.TestLucene40DocValuesFormat.BaseDocValuesFormatTestCase.TestMissingSortedBytes
Lucene.Net.Tests.dll: Lucene.Net.Codecs.Lucene40.TestLucene40DocValuesFormat.BaseDocValuesFormatTestCase.TestRandomSortedBytes
Lucene.Net.Tests.dll: Lucene.Net.Codecs.Lucene40.TestLucene40DocValuesFormat.BaseDocValuesFormatTestCase.TestShortMissingVsFieldCache
Lucene.Net.Tests.dll: Lucene.Net.Codecs.Lucene40.TestLucene40DocValuesFormat.BaseDocValuesFormatTestCase.TestSortedMergeAwayAllValues
Lucene.Net.Tests.dll: Lucene.Net.Codecs.Lucene40.TestLucene40DocValuesFormat.BaseDocValuesFormatTestCase.TestSortedSetFixedLengthSingleValuedVsStoredFields
Lucene.Net.Tests.dll: Lucene.Net.Codecs.Lucene40.TestLucene40DocValuesFormat.BaseDocValuesFormatTestCase.TestSortedSetFixedLengthVsStoredFields
Lucene.Net.Tests.dll: Lucene.Net.Codecs.Lucene40.TestLucene40DocValuesFormat.BaseDocValuesFormatTestCase.TestSortedSetFixedLengthVsUninvertedField
Lucene.Net.Tests.dll: Lucene.Net.Codecs.Lucene40.TestLucene40DocValuesFormat.BaseDocValuesFormatTestCase.TestSortedSetMergeAwayAllValues
Lucene.Net.Tests.dll: Lucene.Net.Codecs.Lucene40.TestLucene40DocValuesFormat.BaseDocValuesFormatTestCase.TestSortedSetOneValue
Lucene.Net.Tests.dll: Lucene.Net.Codecs.Lucene40.TestLucene40DocValuesFormat.BaseDocValuesFormatTestCase.TestSortedSetTermsEnum
Lucene.Net.Tests.dll: Lucene.Net.Codecs.Lucene40.TestLucene40DocValuesFormat.BaseDocValuesFormatTestCase.TestSortedSetThreeValuesTwoDocs
Lucene.Net.Tests.dll: Lucene.Net.Codecs.Lucene40.TestLucene40DocValuesFormat.BaseDocValuesFormatTestCase.TestSortedSetTwoDocumentsFirstMissing
Lucene.Net.Tests.dll: Lucene.Net.Codecs.Lucene40.TestLucene40DocValuesFormat.BaseDocValuesFormatTestCase.TestSortedSetTwoDocumentsFirstMissingMerge
Lucene.Net.Tests.dll: Lucene.Net.Codecs.Lucene40.TestLucene40DocValuesFormat.BaseDocValuesFormatTestCase.TestSortedSetTwoDocumentsLastMissing
Lucene.Net.Tests.dll: Lucene.Net.Codecs.Lucene40.TestLucene40DocValuesFormat.BaseDocValuesFormatTestCase.TestSortedSetTwoDocumentsLastMissingMerge
Lucene.Net.Tests.dll: Lucene.Net.Codecs.Lucene40.TestLucene40DocValuesFormat.BaseDocValuesFormatTestCase.TestSortedSetTwoDocumentsMerged
Lucene.Net.Tests.dll: Lucene.Net.Codecs.Lucene40.TestLucene40DocValuesFormat.BaseDocValuesFormatTestCase.TestSortedSetTwoFields
Lucene.Net.Tests.dll: Lucene.Net.Codecs.Lucene40.TestLucene40DocValuesFormat.BaseDocValuesFormatTestCase.TestSortedSetTwoValues
Lucene.Net.Tests.dll: Lucene.Net.Codecs.Lucene40.TestLucene40DocValuesFormat.BaseDocValuesFormatTestCase.TestSortedSetTwoValuesUnordered
Lucene.Net.Tests.dll: Lucene.Net.Codecs.Lucene40.TestLucene40DocValuesFormat.BaseDocValuesFormatTestCase.TestSortedSetVariableLengthVsStoredFields
Lucene.Net.Tests.dll: Lucene.Net.Codecs.Lucene40.TestLucene40DocValuesFormat.BaseDocValuesFormatTestCase.TestSortedSetVariableLengthVsUninvertedField
Lucene.Net.Tests.dll: Lucene.Net.Codecs.Lucene40.TestLucene40DocValuesFormat.BaseDocValuesFormatTestCase.TestThreads2
Lucene.Net.Tests.dll: Lucene.Net.Codecs.Lucene40.TestLucene40DocValuesFormat.BaseDocValuesFormatTestCase.TestThreeBytesOneMissingWithMerging
Lucene.Net.Tests.dll: Lucene.Net.Codecs.Lucene40.TestLucene40DocValuesFormat.BaseDocValuesFormatTestCase.TestThreeNumbersOneMissingWithMerging
Lucene.Net.Tests.dll: Lucene.Net.Codecs.Lucene40.TestLucene40DocValuesFormat.BaseDocValuesFormatTestCase.TestTwoBytesOneMissing
Lucene.Net.Tests.dll: Lucene.Net.Codecs.Lucene40.TestLucene40DocValuesFormat.BaseDocValuesFormatTestCase.TestTwoBytesOneMissingWithMerging
Lucene.Net.Tests.dll: Lucene.Net.Codecs.Lucene40.TestLucene40DocValuesFormat.BaseDocValuesFormatTestCase.TestTwoDocumentsMerged
Lucene.Net.Tests.dll: Lucene.Net.Codecs.Lucene40.TestLucene40DocValuesFormat.BaseDocValuesFormatTestCase.TestTwoNumbersOneMissing
Lucene.Net.Tests.dll: Lucene.Net.Codecs.Lucene40.TestLucene40DocValuesFormat.BaseDocValuesFormatTestCase.TestTwoNumbersOneMissingWithMerging
Lucene.Net.Tests.dll: Lucene.Net.Codecs.Lucene40.TestLucene40PostingsFormat.BasePostingsFormatTestCase.TestRandom
Lucene.Net.Tests.dll: Lucene.Net.Codecs.Lucene40.TestLucene40StoredFieldsFormat.BaseStoredFieldsFormatTestCase.TestBigDocuments
Lucene.Net.Tests.dll: Lucene.Net.Codecs.Lucene40.TestLucene40TermVectorsFormat.BaseTermVectorsFormatTestCase.TestClone



Newly failed tests details (only first 3 failures shown here)
==================================================================
Lucene.Net.Tests.dll: Lucene.Net.Codecs.Lucene3x.TestLucene3xPostingsFormat.BasePostingsFormatTestCase.TestDocsAndFreqs
(new) =================
Test(s) failed. System.UnauthorizedAccessException : Access to the path is denied.
   at System.IO.__Error.WinIOError(Int32 errorCode, String maybeFullPath)
   at System.IO.MemoryMappedFiles.MemoryMappedFile.CreateCore(SafeFileHandle fileHandle, String
mapName, HandleInheritability inheritability, MemoryMappedFileSecurity memoryMappedFileSecurity,
MemoryMappedFileAccess access, MemoryMappedFileOptions options, Int64 capacity)
   at System.IO.MemoryMappedFiles.MemoryMappedFile.CreateFromFile(FileStream fileStream, String
mapName, Int64 capacity, MemoryMappedFileAccess access, MemoryMappedFileSecurity memoryMappedFileSecurity,
HandleInheritability inheritability, Boolean leaveOpen)
   at Lucene.Net.Store.MMapDirectory.Map(MMapIndexInput input, FileStream fc, Int64 offset,
Int64 length) in z:\Builds\work\bcdbe6b8cc677a49\src\Lucene.Net.Core\Store\MMapDirectory.cs:line
355
   at Lucene.Net.Store.MMapDirectory.MMapIndexInput..ctor(MMapDirectory outerInstance, String
resourceDescription, FileStream fc) in z:\Builds\work\bcdbe6b8cc677a49\src\Lucene.Net.Core\Store\MMapDirectory.cs:line
263
   at Lucene.Net.Store.MMapDirectory.OpenInput(String name, IOContext context) in z:\Builds\work\bcdbe6b8cc677a49\src\Lucene.Net.Core\Store\MMapDirectory.cs:line
205
   at Lucene.Net.Store.MockDirectoryWrapper.OpenInput(String name, IOContext context) in z:\Builds\work\bcdbe6b8cc677a49\src\Lucene.Net.TestFramework\Store\MockDirectoryWrapper.cs:line
781
   at Lucene.Net.Codecs.Lucene3x.TermInfosReader..ctor(Directory dir, String seg, FieldInfos
fis, IOContext context, Int32 indexDivisor) in z:\Builds\work\bcdbe6b8cc677a49\src\Lucene.Net.Core\Codecs\Lucene3x\TermInfosReader.cs:line
123
   at Lucene.Net.Codecs.Lucene3x.Lucene3xFields..ctor(Directory dir, FieldInfos fieldInfos,
SegmentInfo info, IOContext context, Int32 indexDivisor) in z:\Builds\work\bcdbe6b8cc677a49\src\Lucene.Net.Core\Codecs\Lucene3x\Lucene3xFields.cs:line
80
   at Lucene.Net.Codecs.Lucene3x.PreFlexRWPostingsFormat.FieldsProducer(SegmentReadState state)
in z:\Builds\work\bcdbe6b8cc677a49\src\Lucene.Net.TestFramework\Codecs\lucene3x\PreFlexRWPostingsFormat.cs:line
52
   at Lucene.Net.Index.BasePostingsFormatTestCase.BuildIndex(Directory dir, IndexOptions maxAllowed,
Boolean allowPayloads, Boolean alwaysTestMax) in z:\Builds\work\bcdbe6b8cc677a49\src\Lucene.Net.TestFramework\Index\BasePostingsFormatTestCase.cs:line
653
   at Lucene.Net.Index.BasePostingsFormatTestCase.TestFull(IndexOptions options, Boolean withPayloads)
in z:\Builds\work\bcdbe6b8cc677a49\src\Lucene.Net.TestFramework\Index\BasePostingsFormatTestCase.cs:line
1223
   at Lucene.Net.Index.BasePostingsFormatTestCase.TestDocsAndFreqs() in z:\Builds\work\bcdbe6b8cc677a49\src\Lucene.Net.TestFramework\Index\BasePostingsFormatTestCase.cs:line
1257
Lucene.Net.Tests.dll: Lucene.Net.Codecs.Lucene3x.TestLucene3xPostingsFormat.BasePostingsFormatTestCase.TestDocsOnly
(new) =================
Test(s) failed. System.UnauthorizedAccessException : Access to the path is denied.
   at System.IO.__Error.WinIOError(Int32 errorCode, String maybeFullPath)
   at System.IO.MemoryMappedFiles.MemoryMappedFile.CreateCore(SafeFileHandle fileHandle, String
mapName, HandleInheritability inheritability, MemoryMappedFileSecurity memoryMappedFileSecurity,
MemoryMappedFileAccess access, MemoryMappedFileOptions options, Int64 capacity)
   at System.IO.MemoryMappedFiles.MemoryMappedFile.CreateFromFile(FileStream fileStream, String
mapName, Int64 capacity, MemoryMappedFileAccess access, MemoryMappedFileSecurity memoryMappedFileSecurity,
HandleInheritability inheritability, Boolean leaveOpen)
   at Lucene.Net.Store.MMapDirectory.Map(MMapIndexInput input, FileStream fc, Int64 offset,
Int64 length) in z:\Builds\work\bcdbe6b8cc677a49\src\Lucene.Net.Core\Store\MMapDirectory.cs:line
355
   at Lucene.Net.Store.MMapDirectory.MMapIndexInput..ctor(MMapDirectory outerInstance, String
resourceDescription, FileStream fc) in z:\Builds\work\bcdbe6b8cc677a49\src\Lucene.Net.Core\Store\MMapDirectory.cs:line
263
   at Lucene.Net.Store.MMapDirectory.OpenInput(String name, IOContext context) in z:\Builds\work\bcdbe6b8cc677a49\src\Lucene.Net.Core\Store\MMapDirectory.cs:line
205
   at Lucene.Net.Store.MockDirectoryWrapper.OpenInput(String name, IOContext context) in z:\Builds\work\bcdbe6b8cc677a49\src\Lucene.Net.TestFramework\Store\MockDirectoryWrapper.cs:line
781
   at Lucene.Net.Codecs.Lucene3x.TermInfosReader..ctor(Directory dir, String seg, FieldInfos
fis, IOContext context, Int32 indexDivisor) in z:\Builds\work\bcdbe6b8cc677a49\src\Lucene.Net.Core\Codecs\Lucene3x\TermInfosReader.cs:line
123
   at Lucene.Net.Codecs.Lucene3x.Lucene3xFields..ctor(Directory dir, FieldInfos fieldInfos,
SegmentInfo info, IOContext context, Int32 indexDivisor) in z:\Builds\work\bcdbe6b8cc677a49\src\Lucene.Net.Core\Codecs\Lucene3x\Lucene3xFields.cs:line
80
   at Lucene.Net.Codecs.Lucene3x.PreFlexRWPostingsFormat.FieldsProducer(SegmentReadState state)
in z:\Builds\work\bcdbe6b8cc677a49\src\Lucene.Net.TestFramework\Codecs\lucene3x\PreFlexRWPostingsFormat.cs:line
52
   at Lucene.Net.Index.BasePostingsFormatTestCase.BuildIndex(Directory dir, IndexOptions maxAllowed,
Boolean allowPayloads, Boolean alwaysTestMax) in z:\Builds\work\bcdbe6b8cc677a49\src\Lucene.Net.TestFramework\Index\BasePostingsFormatTestCase.cs:line
653
   at Lucene.Net.Index.BasePostingsFormatTestCase.TestFull(IndexOptions options, Boolean withPayloads)
in z:\Builds\work\bcdbe6b8cc677a49\src\Lucene.Net.TestFramework\Index\BasePostingsFormatTestCase.cs:line
1223
   at Lucene.Net.Index.BasePostingsFormatTestCase.TestDocsOnly() in z:\Builds\work\bcdbe6b8cc677a49\src\Lucene.Net.TestFramework\Index\BasePostingsFormatTestCase.cs:line
1251
Lucene.Net.Tests.dll: Lucene.Net.Codecs.Lucene3x.TestLucene3xPostingsFormat.BasePostingsFormatTestCase.TestRandom
(new) =================
Test(s) failed. System.UnauthorizedAccessException : Access to the path is denied.
   at System.IO.__Error.WinIOError(Int32 errorCode, String maybeFullPath)
   at System.IO.MemoryMappedFiles.MemoryMappedFile.CreateCore(SafeFileHandle fileHandle, String
mapName, HandleInheritability inheritability, MemoryMappedFileSecurity memoryMappedFileSecurity,
MemoryMappedFileAccess access, MemoryMappedFileOptions options, Int64 capacity)
   at System.IO.MemoryMappedFiles.MemoryMappedFile.CreateFromFile(FileStream fileStream, String
mapName, Int64 capacity, MemoryMappedFileAccess access, MemoryMappedFileSecurity memoryMappedFileSecurity,
HandleInheritability inheritability, Boolean leaveOpen)
   at Lucene.Net.Store.MMapDirectory.Map(MMapIndexInput input, FileStream fc, Int64 offset,
Int64 length) in z:\Builds\work\bcdbe6b8cc677a49\src\Lucene.Net.Core\Store\MMapDirectory.cs:line
355
   at Lucene.Net.Store.MMapDirectory.MMapIndexInput..ctor(MMapDirectory outerInstance, String
resourceDescription, FileStream fc) in z:\Builds\work\bcdbe6b8cc677a49\src\Lucene.Net.Core\Store\MMapDirectory.cs:line
263
   at Lucene.Net.Store.MMapDirectory.OpenInput(String name, IOContext context) in z:\Builds\work\bcdbe6b8cc677a49\src\Lucene.Net.Core\Store\MMapDirectory.cs:line
205
   at Lucene.Net.Store.FilterDirectory.OpenInput(String name, IOContext context) in z:\Builds\work\bcdbe6b8cc677a49\src\Lucene.Net.Core\Store\FilterDirectory.cs:line
86
   at Lucene.Net.Store.MockDirectoryWrapper.OpenInput(String name, IOContext context) in z:\Builds\work\bcdbe6b8cc677a49\src\Lucene.Net.TestFramework\Store\MockDirectoryWrapper.cs:line
781
   at Lucene.Net.Codecs.Lucene3x.TermInfosReader..ctor(Directory dir, String seg, FieldInfos
fis, IOContext context, Int32 indexDivisor) in z:\Builds\work\bcdbe6b8cc677a49\src\Lucene.Net.Core\Codecs\Lucene3x\TermInfosReader.cs:line
123
   at Lucene.Net.Codecs.Lucene3x.Lucene3xFields..ctor(Directory dir, FieldInfos fieldInfos,
SegmentInfo info, IOContext context, Int32 indexDivisor) in z:\Builds\work\bcdbe6b8cc677a49\src\Lucene.Net.Core\Codecs\Lucene3x\Lucene3xFields.cs:line
80
   at Lucene.Net.Codecs.Lucene3x.PreFlexRWPostingsFormat.FieldsProducer(SegmentReadState state)
in z:\Builds\work\bcdbe6b8cc677a49\src\Lucene.Net.TestFramework\Codecs\lucene3x\PreFlexRWPostingsFormat.cs:line
52
   at Lucene.Net.Index.BasePostingsFormatTestCase.BuildIndex(Directory dir, IndexOptions maxAllowed,
Boolean allowPayloads, Boolean alwaysTestMax) in z:\Builds\work\bcdbe6b8cc677a49\src\Lucene.Net.TestFramework\Index\BasePostingsFormatTestCase.cs:line
653
   at Lucene.Net.Index.BasePostingsFormatTestCase.TestRandom() in z:\Builds\work\bcdbe6b8cc677a49\src\Lucene.Net.TestFramework\Index\BasePostingsFormatTestCase.cs:line
1296
------- Stderr: -------
Unhandled exception in remote appdomain: System.Exception:   docID is wrong
  Expected: 139135
  But was:  139149
 ---> NUnit.Framework.AssertionException:   docID is wrong
  Expected: 139135
  But was:  139149

   at NUnit.Framework.Assert.That(Object actual, IResolveConstraint expression, String message,
Object[] args)
   at NUnit.Framework.Assert.AreEqual(Int32 expected, Int32 actual, String message)
   at Lucene.Net.Index.BasePostingsFormatTestCase.VerifyEnum(ThreadState threadState, String
field, BytesRef term, TermsEnum termsEnum, IndexOptions maxTestOptions, IndexOptions maxIndexOptions,
ISet`1 options, Boolean alwaysTestMax) in z:\Builds\work\bcdbe6b8cc677a49\src\Lucene.Net.TestFramework\Index\BasePostingsFormatTestCase.cs:line
929
   at Lucene.Net.Index.BasePostingsFormatTestCase.TestTermsOneThread(Fields fieldsSource,
ISet`1 options, IndexOptions maxTestOptions, IndexOptions maxIndexOptions, Boolean alwaysTestMax)
in z:\Builds\work\bcdbe6b8cc677a49\src\Lucene.Net.TestFramework\Index\BasePostingsFormatTestCase.cs:line
1195
   at Lucene.Net.Index.BasePostingsFormatTestCase.TestThread.Run() in z:\Builds\work\bcdbe6b8cc677a49\src\Lucene.Net.TestFramework\Index\BasePostingsFormatTestCase.cs:line
1075
   --- End of inner exception stack trace ---
   at Lucene.Net.Index.BasePostingsFormatTestCase.TestThread.Run() in z:\Builds\work\bcdbe6b8cc677a49\src\Lucene.Net.TestFramework\Index\BasePostingsFormatTestCase.cs:line
1079
   at System.Threading.ThreadHelper.ThreadStart_Context(Object state)
   at System.Threading.ExecutionContext.RunInternal(ExecutionContext executionContext, ContextCallback
callback, Object state, Boolean preserveSyncCtx)
   at System.Threading.ExecutionContext.Run(ExecutionContext executionContext, ContextCallback
callback, Object state, Boolean preserveSyncCtx)
   at System.Threading.ExecutionContext.Run(ExecutionContext executionContext, ContextCallback
callback, Object state)
   at System.Threading.ThreadHelper.ThreadStart()
Unhandled exception in remote appdomain: System.Exception: read past EOF: NIOFSIndexInput(path="Z:\Builds\temp\buildTmp\LuceneTemp\testPostingsFormat-1\_0.frq")
off: 0 len: 1507 pos: 11004 chunkLen: 1507 end: 12511 ---> System.Exception: read past
EOF: NIOFSIndexInput(path="Z:\Builds\temp\buildTmp\LuceneTemp\testPostingsFormat-1\_0.frq")
off: 0 len: 1507 pos: 11004 chunkLen: 1507 end: 12511
   at Lucene.Net.Store.NIOFSDirectory.NIOFSIndexInput.ReadInternal(Byte[] b, Int32 offset,
Int32 len) in z:\Builds\work\bcdbe6b8cc677a49\src\Lucene.Net.Core\Store\NIOFSDirectory.cs:line
255
   at Lucene.Net.Store.BufferedIndexInput.Refill() in z:\Builds\work\bcdbe6b8cc677a49\src\Lucene.Net.Core\Store\BufferedIndexInput.cs:line
368
   at Lucene.Net.Store.BufferedIndexInput.ReadByte() in z:\Builds\work\bcdbe6b8cc677a49\src\Lucene.Net.Core\Store\BufferedIndexInput.cs:line
55
   at Lucene.Net.Store.DataInput.ReadVLong() in z:\Builds\work\bcdbe6b8cc677a49\src\Lucene.Net.Core\Store\DataInput.cs:line
218
   at Lucene.Net.Store.BufferedIndexInput.ReadVLong() in z:\Builds\work\bcdbe6b8cc677a49\src\Lucene.Net.Core\Store\BufferedIndexInput.cs:line
345
   at Lucene.Net.Store.MockIndexInputWrapper.ReadVLong() in z:\Builds\work\bcdbe6b8cc677a49\src\Lucene.Net.TestFramework\Store\MockIndexInputWrapper.cs:line
182
   at Lucene.Net.Codecs.MultiLevelSkipListReader.LoadSkipLevels() in z:\Builds\work\bcdbe6b8cc677a49\src\Lucene.Net.Core\Codecs\MultiLevelSkipListReader.cs:line
282
   at Lucene.Net.Codecs.MultiLevelSkipListReader.SkipTo(Int32 target) in z:\Builds\work\bcdbe6b8cc677a49\src\Lucene.Net.Core\Codecs\MultiLevelSkipListReader.cs:line
149
   at Lucene.Net.Codecs.Lucene3x.SegmentTermDocs.SkipTo(Int32 target) in z:\Builds\work\bcdbe6b8cc677a49\src\Lucene.Net.Core\Codecs\Lucene3x\SegmentTermDocs.cs:line
269
   at Lucene.Net.Codecs.Lucene3x.Lucene3xFields.PreDocsEnum.Advance(Int32 target) in z:\Builds\work\bcdbe6b8cc677a49\src\Lucene.Net.Core\Codecs\Lucene3x\Lucene3xFields.cs:line
1159
   at Lucene.Net.Index.BasePostingsFormatTestCase.VerifyEnum(ThreadState threadState, String
field, BytesRef term, TermsEnum termsEnum, IndexOptions maxTestOptions, IndexOptions maxIndexOptions,
ISet`1 options, Boolean alwaysTestMax) in z:\Builds\work\bcdbe6b8cc677a49\src\Lucene.Net.TestFramework\Index\BasePostingsFormatTestCase.cs:line
928
   at Lucene.Net.Index.BasePostingsFormatTestCase.TestTermsOneThread(Fields fieldsSource,
ISet`1 options, IndexOptions maxTestOptions, IndexOptions maxIndexOptions, Boolean alwaysTestMax)
in z:\Builds\work\bcdbe6b8cc677a49\src\Lucene.Net.TestFramework\Index\BasePostingsFormatTestCase.cs:line
1174
   at Lucene.Net.Index.BasePostingsFormatTestCase.TestThread.Run() in z:\Builds\work\bcdbe6b8cc677a49\src\Lucene.Net.TestFramework\Index\BasePostingsFormatTestCase.cs:line
1075
   --- End of inner exception stack trace ---
   at Lucene.Net.Index.BasePostingsFormatTestCase.TestThread.Run() in z:\Builds\work\bcdbe6b8cc677a49\src\Lucene.Net.TestFramework\Index\BasePostingsFormatTestCase.cs:line
1079
   at System.Threading.ThreadHelper.ThreadStart_Context(Object state)
   at System.Threading.ExecutionContext.RunInternal(ExecutionContext executionContext, ContextCallback
callback, Object state, Boolean preserveSyncCtx)
   at System.Threading.ExecutionContext.Run(ExecutionContext executionContext, ContextCallback
callback, Object state, Boolean preserveSyncCtx)
   at System.Threading.ExecutionContext.Run(ExecutionContext executionContext, ContextCallback
callback, Object state)
   at System.Threading.ThreadHelper.ThreadStart()
Unhandled exception in remote appdomain: System.Exception:   docID is wrong
  Expected: 21117
  But was:  111152
 ---> NUnit.Framework.AssertionException:   docID is wrong
  Expected: 21117
  But was:  111152

   at NUnit.Framework.Assert.That(Object actual, IResolveConstraint expression, String message,
Object[] args)
   at NUnit.Framework.Assert.AreEqual(Int32 expected, Int32 actual, String message)
   at Lucene.Net.Index.BasePostingsFormatTestCase.VerifyEnum(ThreadState threadState, String
field, BytesRef term, TermsEnum termsEnum, IndexOptions maxTestOptions, IndexOptions maxIndexOptions,
ISet`1 options, Boolean alwaysTestMax) in z:\Builds\work\bcdbe6b8cc677a49\src\Lucene.Net.TestFramework\Index\BasePostingsFormatTestCase.cs:line
929
   at Lucene.Net.Index.BasePostingsFormatTestCase.TestTermsOneThread(Fields fieldsSource,
ISet`1 options, IndexOptions maxTestOptions, IndexOptions maxIndexOptions, Boolean alwaysTestMax)
in z:\Builds\work\bcdbe6b8cc677a49\src\Lucene.Net.TestFramework\Index\BasePostingsFormatTestCase.cs:line
1174
   at Lucene.Net.Index.BasePostingsFormatTestCase.TestThread.Run() in z:\Builds\work\bcdbe6b8cc677a49\src\Lucene.Net.TestFramework\Index\BasePostingsFormatTestCase.cs:line
1075
   --- End of inner exception stack trace ---
   at Lucene.Net.Index.BasePostingsFormatTestCase.TestThread.Run() in z:\Builds\work\bcdbe6b8cc677a49\src\Lucene.Net.TestFramework\Index\BasePostingsFormatTestCase.cs:line
1079
   at System.Threading.ThreadHelper.ThreadStart_Context(Object state)
   at System.Threading.ExecutionContext.RunInternal(ExecutionContext executionContext, ContextCallback
callback, Object state, Boolean preserveSyncCtx)
   at System.Threading.ExecutionContext.Run(ExecutionContext executionContext, ContextCallback
callback, Object state, Boolean preserveSyncCtx)
   at System.Threading.ExecutionContext.Run(ExecutionContext executionContext, ContextCallback
callback, Object state)
   at System.Threading.ThreadHelper.ThreadStart()
see all newly failed tests: http://teamcity.codebetter.com/viewLog.html?buildId=177015&buildTypeId=LuceneNet_Core
Changes included (1 change)
====================================================
Change aa1f8b4f0e14949cb27556a4617329a5d32dbdcd by laimis (1 file):
fix path lookup


see more information about changed files: http://teamcity.codebetter.com/viewLog.html?tab=buildChangesDiv&buildId=177015&buildTypeId=LuceneNet_Core

============================================================================
Configure email notifications: http://teamcity.codebetter.com/profile.html?init=1&tab=userNotifications

Mime
  • Unnamed multipart/alternative (inline, None, 0 bytes)
View raw message