logging-log4cxx-user mailing list archives

Site index · List index
Message view « Date » · « Thread »
Top « Date » · « Thread »
From Lars Schouw <schou...@yahoo.com>
Subject Re: build on Cygwin
Date Mon, 13 Jul 2009 06:46:42 GMT

Once more with verbose turned on.
Apache Ant version 1.7.1 compiled on June 27 2008
Buildfile: build.xml
Detected Java version: 1.6 in: c:\java\jdk1.6.0_14\jre
Detected OS: Windows XP
parsing buildfile C:\cygwin\src\log4cxx\apache-log4cxx-0.10.0\build.xml with URI = file:/C:/cygwin/src/log4cxx/apache-log4cxx-0.10.0/build.xml
Project base dir set to: C:\cygwin\src\log4cxx\apache-log4cxx-0.10.0
resolving systemId: file:/C:/cygwin/src/log4cxx/apache-log4cxx-0.10.0/src/ant/common.xml
resolving systemId: file:/C:/cygwin/src/log4cxx/apache-log4cxx-0.10.0/src/ant/find-apr.xml
resolving systemId: file:/C:/cygwin/src/log4cxx/apache-log4cxx-0.10.0/src/ant/find-apr-util.xml
resolving systemId: file:/C:/cygwin/src/log4cxx/apache-log4cxx-0.10.0/src/ant/find-libesmtp.xml
[antlib:org.apache.tools.ant] Could not load definitions from resource org/apache/tools/ant/antlib.xml.
It could not be found.
 [property] Loading C:\cygwin\src\log4cxx\apache-log4cxx-0.10.0\build.properties
 [property] Unable to find property file: C:\cygwin\src\log4cxx\apache-log4cxx-0.10.0\build.properties
[available] Unable to find C:\usr\share\java\log4j-1.2.jar to set property log4j.jar
Override ignored for property "enable-wchar_t"
Build sequence for target(s) `check' is [os-detect, win-init, mac-init, unix-init, common-init,
init, find-apr-src, find-apr-lib, find-apr, build-apr, find-apr-util-src, find-apr-util-lib,
find-apr-util, build-apr-util, find-esmtp-src, find-esmtp-lib, find-esmtp, build-libesmtp,
unix-configure, win-configure, configure, build-lib, build, build-unittest, run-defaultinit-unittest,
clean-output, run-unittest, build-delayedloop, build-trivial, build-stream, build-console,
build-examples, check]
Complete build sequence is [os-detect, win-init, mac-init, unix-init, common-init, init, find-apr-src,
find-apr-lib, find-apr, build-apr, find-apr-util-src, find-apr-util-lib, find-apr-util, build-apr-util,
find-esmtp-src, find-esmtp-lib, find-esmtp, build-libesmtp, unix-configure, win-configure,
configure, build-lib, build, build-unittest, run-defaultinit-unittest, clean-output, run-unittest,
build-delayedloop, build-trivial, build-stream, build-console, build-examples, check, build-standalone-unittest,
run-standalone-unittest, build-projects-xcode, apidocs, site, build-example, mime=css, copy-if-changed-compare,
copy-if-changed, usage, run-socketserver, checkout-site, update-site, post-site, build-projects-vc9,
build-projects-vc8, run-defaultinit-log4X, build-projects-vc7, autogen, build-projects-vc6,
site-deploy, build-all, build-projects, make-header-check, run-example, test-compile, fixcrlf,
clean, header-check, prepare-changes, mime=html, gump, ]
os-detect:
Override ignored for property "os.family"
Override ignored for property "os.family"
win-init:
Skipped because property 'is-windows' not set.
mac-init:
Skipped because property 'is-mac' not set.
unix-init:
common-init:
    [mkdir] Skipping C:\cygwin\src\log4cxx\apache-log4cxx-0.10.0\target because it already
exists.
    [mkdir] Skipping C:\cygwin\src\log4cxx\apache-log4cxx-0.10.0\target because it already
exists.
Property "use-pic" has not been set
Override ignored for property "debug.release"
Override ignored for property "D.debug"
Override ignored for property "D.R"
init:
    [mkdir] Skipping C:\cygwin\src\log4cxx\apache-log4cxx-0.10.0\target\debug\shared because
it already exists.
Property "find" has not been set
Property "force-ant" has not been set
     [echo] force-ant: ${force-ant}
find-apr-src:
[available] Found: C:\cygwin\lib
[available] Unable to find C:\cygwin\lib\file_io\unix\dir.c
[available] Unable to find C:\cygwin\src\log4cxx\apr\file_io\unix\dir.c
find-apr-lib:
[available] Found: C:\cygwin\lib\libapr-1.la
[available] Unable to find C:\cygwin\lib\libapr-1.dylib
[available] Unable to find C:\cygwin\lib\libapr-1.so
[available] Found: C:\cygwin\lib\libapr-1.a
Override ignored for property "apr.lib.file"
[available] Unable to find C:\cygwin\lib\apr-1.lib
[available] Unable to find C:\cygwin\lib\.libs\libapr-1.la
[available] Unable to find C:\cygwin\lib\.libs\libapr-1.dylib
[available] Unable to find C:\cygwin\lib\.libs\libapr-1.so
[available] Unable to find C:\cygwin\lib\.libs\libapr-1.a
[available] Unable to find C:\cygwin\lib\.libs\apr-1.lib
Override ignored for property "apr.lib.file.dir"
[available] Unable to find C:\usr\lib\libapr-1.la
[available] Unable to find C:\usr\lib\libapr-1.dylib
[available] Unable to find C:\usr\lib\libapr-1.so
[available] Unable to find C:\usr\lib\libapr-1.a
Override ignored for property "apr.dir"
Override ignored for property "apr.lib.file.dir"
[available] Unable to find C:\usr\local\lib\libapr-1.la
[available] Unable to find C:\usr\local\lib\libapr-1.dylib
[available] Unable to find C:\usr\local\lib\libapr-1.so
[available] Unable to find C:\usr\local\lib\libapr-1.a
Override ignored for property "apr.dir"
Override ignored for property "apr.lib.file.dir"
[available] Unable to find C:\cygwin\src\log4cxx\apr
[available] Found: C:\cygwin\lib\libapr-1.la
Override ignored for property "apr.lib.file"
[available] Unable to find C:\cygwin\lib\libapr-1.dylib
[available] Unable to find C:\cygwin\lib\libapr-1.so
[available] Found: C:\cygwin\lib\libapr-1.a
Override ignored for property "apr.lib.file"
[available] Unable to find C:\cygwin\lib\apr-1.lib
Override ignored for property "apr.lib.file.dir"
[available] Unable to find C:\cygwin\lib\.libs\libapr-1.la
[available] Unable to find C:\cygwin\lib\.libs\libapr-1.dylib
[available] Unable to find C:\cygwin\lib\.libs\libapr-1.so
[available] Unable to find C:\cygwin\lib\.libs\libapr-1.a
Override ignored for property "apr.lib.file.dir"
[available] Unable to find C:\cygwin\lib\LibD\apr-1.lib
Override ignored for property "apr.lib.file.dir"
[available] Unable to find C:\cygwin\lib\Debug\libapr-1.lib
Override ignored for property "apr.lib.file.dir"
[available] Unable to find C:\cygwin\lib\LibR\apr-1.lib
Override ignored for property "apr.lib.file.dir"
[available] Unable to find C:\cygwin\lib\Release\libapr-1.lib
Override ignored for property "apr.lib.file.dir"
Override ignored for property "apr.lib.type"
find-apr:
[available] Unable to find C:\cygwin\lib\include\apr-1.0\apr_pools.h
[available] Unable to find C:\cygwin\lib\include\apr-1\apr_pools.h
[available] Unable to find C:\cygwin\lib\include\apr_pools.h
[available] Found: C:\cygwin\usr\include\apr-1\apr_pools.h
Property "apr.src.dir" has not been set
Property "apr.src.dir" has not been set
[available] Unable to find ${apr.src.dir}\include\apr_pools.h
Property "apr.src.dir" has not been set
Property "apr.src.dir" has not been set
     [echo] apr-find:
     [echo] apr.dir=/cygwin/lib
     [echo] apr.include.dir=/cygwin/lib/../usr/include/apr-1
     [echo] apr.src.dir=${apr.src.dir}
     [echo] apr.lib.file=/cygwin/lib/libapr-1.la
     [echo] apr.lib.file.dir=/cygwin/lib
     [echo] apr.lib.dir=/cygwin/lib
     [echo] apr.lib.prefix=
     [echo] apr.lib.suffix=
     [echo] apr.lib.type=shared
build-apr:
Skipped because property 'apr.lib.file' set.
find-apr-util-src:
[available] Found: C:\cygwin\lib
[available] Unable to find C:\cygwin\lib\xml\apr_xml.c
[available] Unable to find C:\cygwin\src\log4cxx\apr-util\xml\apr_xml.c
find-apr-util-lib:
[available] Found: C:\cygwin\lib\libaprutil-1.la
[available] Unable to find C:\cygwin\lib\libaprutil-1.dylib
[available] Unable to find C:\cygwin\lib\libaprutil-1.so
[available] Found: C:\cygwin\lib\libaprutil-1.a
Override ignored for property "apr-util.lib.file"
[available] Unable to find C:\cygwin\lib\aprutil-1.lib
[available] Unable to find C:\cygwin\lib\.libs\libaprutil-1.la
[available] Unable to find C:\cygwin\lib\.libs\libaprutil-1.dylib
[available] Unable to find C:\cygwin\lib\.libs\libaprutil-1.so
[available] Unable to find C:\cygwin\lib\.libs\libaprutil-1.a
[available] Unable to find C:\cygwin\lib\.libs\aprutil-1.lib
Override ignored for property "apr-util.lib.file.dir"
[available] Unable to find C:\usr\lib\libaprutil-1.la
[available] Unable to find C:\usr\lib\libaprutil-1.dylib
[available] Unable to find C:\usr\lib\libaprutil-1.so
[available] Unable to find C:\usr\lib\libaprutil-1.a
Override ignored for property "apr-util.dir"
Override ignored for property "apr-util.lib.file.dir"
[available] Unable to find C:\usr\local\lib\libaprutil-1.la
[available] Unable to find C:\usr\local\lib\libaprutil-1.dylib
[available] Unable to find C:\usr\local\lib\libaprutil-1.so
[available] Unable to find C:\usr\local\lib\libaprutil-1.a
Override ignored for property "apr-util.dir"
Override ignored for property "apr-util.lib.file.dir"
[available] Unable to find C:\cygwin\src\log4cxx\apr-util
[available] Found: C:\cygwin\lib\libaprutil-1.la
Override ignored for property "apr-util.lib.file"
[available] Unable to find C:\cygwin\lib\libaprutil-1.dylib
[available] Unable to find C:\cygwin\lib\libaprutil-1.so
[available] Found: C:\cygwin\lib\libaprutil-1.a
Override ignored for property "apr-util.lib.file"
[available] Unable to find C:\cygwin\lib\aprutil-1.lib
Override ignored for property "apr-util.lib.file.dir"
[available] Unable to find C:\cygwin\lib\.libs\libaprutil-1.la
[available] Unable to find C:\cygwin\lib\.libs\libaprutil-1.dylib
[available] Unable to find C:\cygwin\lib\.libs\libaprutil-1.so
[available] Unable to find C:\cygwin\lib\.libs\libaprutil-1.a
Override ignored for property "apr-util.lib.file.dir"
[available] Unable to find C:\cygwin\lib\LibD\aprutil-1.lib
Override ignored for property "apr-util.lib.file.dir"
[available] Unable to find C:\cygwin\lib\Debug\libaprutil-1.lib
Override ignored for property "apr-util.lib.file.dir"
[available] Unable to find C:\cygwin\lib\LibR\aprutil-1.lib
Override ignored for property "apr-util.lib.file.dir"
[available] Unable to find C:\cygwin\lib\Release\libaprutil-1.lib
Override ignored for property "apr-util.lib.file.dir"
Override ignored for property "apr-util.lib.type"
find-apr-util:
[available] Unable to find C:\cygwin\lib\include\apr-1.0\apr_xml.h
[available] Unable to find C:\cygwin\lib\include\apr-1\apr_xml.h
[available] Unable to find C:\cygwin\lib\include\apr_xml.h
[available] Found: C:\cygwin\usr\include\apr-1\apr_xml.h
Property "apr-util.src.dir" has not been set
Property "apr-util.src.dir" has not been set
[available] Unable to find ${apr-util.src.dir}\include\apr_xml.h
Property "apr-util.src.dir" has not been set
Property "apr-util.src.dir" has not been set
     [echo] apr-util-find:
     [echo] apr-util.dir=/cygwin/lib
     [echo] apr-util.include.dir=/cygwin/lib/../usr/include/apr-1
     [echo] apr-util.src.dir=${apr-util.src.dir}
     [echo] apr-util.lib.file=/cygwin/lib/libaprutil-1.la
     [echo] apr-util.lib.file.dir=/cygwin/lib
     [echo] apr-util.lib.dir=/cygwin/lib
     [echo] apr-util.lib.prefix=
     [echo] apr-util.lib.suffix=
     [echo] apr-util.lib.type=shared
build-apr-util:
Skipped because property 'apr-util.lib.file' set.
find-esmtp-src:
Property "with-libesmtp" has not been set
Property "with-libesmtp" has not been set
[available] Unable to find ${with-libesmtp}
Property "esmtp.dir" has not been set
Property "esmtp.dir" has not been set
[available] Unable to find ${esmtp.dir}\smtp-api.c
[available] Unable to find C:\cygwin\src\log4cxx\libesmtp\smtp-api.c
find-esmtp-lib:
Skipped because property 'has-libesmtp' not set.
find-esmtp:
Property "esmtp.dir" has not been set
Property "esmtp.dir" has not been set
[available] Unable to find ${esmtp.dir}\include\libesmtp.h
Property "esmtp.dir" has not been set
Property "esmtp.dir" has not been set
[available] Unable to find ${esmtp.dir}\libesmtp.h
Property "esmtp.dir" has not been set
Property "esmtp.dir" has not been set
[available] Unable to find usr\include\libesmtp.h
Property "esmtp.src.dir" has not been set
Property "esmtp.src.dir" has not been set
[available] Unable to find ${esmtp.src.dir}\include\libesmtp.h
Property "esmtp.src.dir" has not been set
Property "esmtp.src.dir" has not been set
[available] Unable to find ${esmtp.src.dir}\include\libesmtp.h
Property "esmtp.src.dir" has not been set
Property "esmtp.dir" has not been set
Property "esmtp.include.dir" has not been set
Property "esmtp.src.dir" has not been set
Property "esmtp.lib.file" has not been set
Property "esmtp.lib.file.dir" has not been set
Property "esmtp.lib.dir" has not been set
Property "esmtp.lib.prefix" has not been set
Property "esmtp.lib.suffix" has not been set
Property "esmtp.lib.type" has not been set
     [echo] esmtp-find:
     [echo] esmtp.dir=${esmtp.dir}
     [echo] esmtp.include.dir=${esmtp.include.dir}
     [echo] esmtp.src.dir=${esmtp.src.dir}
     [echo] esmtp.lib.file=${esmtp.lib.file}
     [echo] esmtp.lib.file.dir=${esmtp.lib.file.dir}
     [echo] esmtp.lib.dir=${esmtp.lib.dir}
     [echo] esmtp.lib.prefix=${esmtp.lib.prefix}
     [echo] esmtp.lib.suffix=${esmtp.lib.suffix}
     [echo] esmtp.lib.type=${esmtp.lib.type}
build-libesmtp:
Skipped because property 'has-libesmtp' not set.
unix-configure:
     [copy] Copying 1 file to C:\cygwin\src\log4cxx\apache-log4cxx-0.10.0\src\main\include\log4cxx
     [copy] Copying C:\cygwin\src\log4cxx\apache-log4cxx-0.10.0\src\main\include\log4cxx\log4cxx.h.in
to C:\cygwin\src\log4cxx\apache-log4cxx-0.10.0\src\main\include\log4cxx\log4cxx.tmp
     [copy] Copying 1 file to C:\cygwin\src\log4cxx\apache-log4cxx-0.10.0\src\main\include\log4cxx\private
     [copy] Copying C:\cygwin\src\log4cxx\apache-log4cxx-0.10.0\src\main\include\log4cxx\private\log4cxx_private.h.in
to C:\cygwin\src\log4cxx\apache-log4cxx-0.10.0\src\main\include\log4cxx\private\log4cxx_private.tmp
win-configure:
Skipped because property 'is-windows' not set.
configure:
     [echo] Configuring with-logchar=utf-8
     [echo] Configuring with-charset=auto
     [echo] Configuring with-SMTP=no
     [echo] Configuring with-ODBC=no
     [echo] Configuring enable-char=1
     [echo] Configuring enable-wchar_t=0
     [echo] Configuring enable-unichar=0
     [echo] Configuring enable-cfstring=0
Override ignored for property "logchar_is_utf8"
[replaceregexp] Replacing pattern '@LOGCHAR_IS_UNICHAR@' with '0' in 'C:\cygwin\src\log4cxx\apache-log4cxx-0.10.0\src\main\include\log4cxx\log4cxx.tmp'.
[replaceregexp] File has changed; saving the updated file
[replaceregexp] Replacing pattern '@LOGCHAR_IS_UTF8@' with '1' in 'C:\cygwin\src\log4cxx\apache-log4cxx-0.10.0\src\main\include\log4cxx\log4cxx.tmp'.
[replaceregexp] File has changed; saving the updated file
[replaceregexp] Replacing pattern '@LOGCHAR_IS_WCHAR@' with '0' in 'C:\cygwin\src\log4cxx\apache-log4cxx-0.10.0\src\main\include\log4cxx\log4cxx.tmp'.
[replaceregexp] File has changed; saving the updated file
[replaceregexp] Replacing pattern '@CHARSET_UTF8@' with '0' in 'C:\cygwin\src\log4cxx\apache-log4cxx-0.10.0\src\main\include\log4cxx\private\log4cxx_private.tmp'.
[replaceregexp] File has changed; saving the updated file
[replaceregexp] Replacing pattern '@CHARSET_ISO88591@' with '0' in 'C:\cygwin\src\log4cxx\apache-log4cxx-0.10.0\src\main\include\log4cxx\private\log4cxx_private.tmp'.
[replaceregexp] File has changed; saving the updated file
[replaceregexp] Replacing pattern '@CHARSET_USASCII@' with '0' in 'C:\cygwin\src\log4cxx\apache-log4cxx-0.10.0\src\main\include\log4cxx\private\log4cxx_private.tmp'.
[replaceregexp] File has changed; saving the updated file
[replaceregexp] Replacing pattern '@CHARSET_EBCDIC@' with '0' in 'C:\cygwin\src\log4cxx\apache-log4cxx-0.10.0\src\main\include\log4cxx\private\log4cxx_private.tmp'.
[replaceregexp] File has changed; saving the updated file
[replaceregexp] Replacing pattern '@CHAR_API@' with '1' in 'C:\cygwin\src\log4cxx\apache-log4cxx-0.10.0\src\main\include\log4cxx\log4cxx.tmp'.
[replaceregexp] File has changed; saving the updated file
[replaceregexp] Replacing pattern '@WCHAR_T_API@' with '0' in 'C:\cygwin\src\log4cxx\apache-log4cxx-0.10.0\src\main\include\log4cxx\log4cxx.tmp'.
[replaceregexp] File has changed; saving the updated file
[replaceregexp] Replacing pattern '@UNICHAR_API@' with '0' in 'C:\cygwin\src\log4cxx\apache-log4cxx-0.10.0\src\main\include\log4cxx\log4cxx.tmp'.
[replaceregexp] File has changed; saving the updated file
[replaceregexp] Replacing pattern '@CFSTRING_API@' with '0' in 'C:\cygwin\src\log4cxx\apache-log4cxx-0.10.0\src\main\include\log4cxx\log4cxx.tmp'.
[replaceregexp] File has changed; saving the updated file
[replaceregexp] Replacing pattern '@HAS_SYSLOG@' with '1' in 'C:\cygwin\src\log4cxx\apache-log4cxx-0.10.0\src\main\include\log4cxx\private\log4cxx_private.tmp'.
[replaceregexp] File has changed; saving the updated file
[replaceregexp] Replacing pattern '@HAS_STD_LOCALE@' with '1' in 'C:\cygwin\src\log4cxx\apache-log4cxx-0.10.0\src\main\include\log4cxx\private\log4cxx_private.tmp'.
[replaceregexp] File has changed; saving the updated file
[replaceregexp] Replacing pattern '@HAS_MBSRTOWCS@' with '1' in 'C:\cygwin\src\log4cxx\apache-log4cxx-0.10.0\src\main\include\log4cxx\private\log4cxx_private.tmp'.
[replaceregexp] File has changed; saving the updated file
[replaceregexp] Replacing pattern '@HAS_WCSTOMBS@' with '1' in 'C:\cygwin\src\log4cxx\apache-log4cxx-0.10.0\src\main\include\log4cxx\private\log4cxx_private.tmp'.
[replaceregexp] File has changed; saving the updated file
Override ignored for property "has-fwide"
[replaceregexp] Replacing pattern '@HAS_FWIDE@' with '0' in 'C:\cygwin\src\log4cxx\apache-log4cxx-0.10.0\src\main\include\log4cxx\private\log4cxx_private.tmp'.
[replaceregexp] File has changed; saving the updated file
[replaceregexp] Replacing pattern 'LOG4CXX_HAVE_LIBESMTP 0' with 'LOG4CXX_HAVE_LIBESMTP 0'
in 'C:\cygwin\src\log4cxx\apache-log4cxx-0.10.0\src\main\include\log4cxx\private\log4cxx_private.tmp'.
[replaceregexp] Replacing pattern '@HAS_LIBESMTP@' with '0' in 'C:\cygwin\src\log4cxx\apache-log4cxx-0.10.0\src\main\include\log4cxx\private\log4cxx_private.tmp'.
[replaceregexp] File has changed; saving the updated file
[replaceregexp] Replacing pattern '@HAS_ODBC@' with '0' in 'C:\cygwin\src\log4cxx\apache-log4cxx-0.10.0\src\main\include\log4cxx\private\log4cxx_private.tmp'.
[replaceregexp] File has changed; saving the updated file
Project base dir set to: C:\cygwin\src\log4cxx\apache-log4cxx-0.10.0
  [antcall] calling target(s) [copy-if-changed] in build file C:\cygwin\src\log4cxx\apache-log4cxx-0.10.0\build.xml
parsing buildfile C:\cygwin\src\log4cxx\apache-log4cxx-0.10.0\build.xml with URI = file:/C:/cygwin/src/log4cxx/apache-log4cxx-0.10.0/build.xml
Project base dir set to: C:\cygwin\src\log4cxx\apache-log4cxx-0.10.0
resolving systemId: file:/C:/cygwin/src/log4cxx/apache-log4cxx-0.10.0/src/ant/common.xml
resolving systemId: file:/C:/cygwin/src/log4cxx/apache-log4cxx-0.10.0/src/ant/find-apr.xml
resolving systemId: file:/C:/cygwin/src/log4cxx/apache-log4cxx-0.10.0/src/ant/find-apr-util.xml
resolving systemId: file:/C:/cygwin/src/log4cxx/apache-log4cxx-0.10.0/src/ant/find-libesmtp.xml
 [property] Loading C:\cygwin\src\log4cxx\apache-log4cxx-0.10.0\build.properties
 [property] Unable to find property file: C:\cygwin\src\log4cxx\apache-log4cxx-0.10.0\build.properties
Override ignored for property "debug"
Override ignored for property "rtti"
Override ignored for property "optimize"
Override ignored for property "lib.type"
Override ignored for property "runtime"
Override ignored for property "base.dir"
Override ignored for property "src.dir"
Override ignored for property "resources.dir"
Override ignored for property "include.dir"
Override ignored for property "target.dir"
Override ignored for property "lib.dir"
Override ignored for property "examples.dir"
Override ignored for property "tests.dir"
Override ignored for property "tests.cpp.dir"
Override ignored for property "tests.resources.dir"
Override ignored for property "tests.output.dir"
Override ignored for property "m2_repo"
Override ignored for property "log4j.version"
[available] Unable to find C:\usr\share\java\log4j-1.2.jar to set property log4j.jar
Override ignored for property "log4j.jar"
Override ignored for property "doxygen.exe"
Override ignored for property "lib.name"
Override ignored for property "lib.prefix"
Override ignored for property "version"
Override ignored for property "enable-char"
Override ignored for property "enable-wchar_t"
Override ignored for property "enable-unichar"
Override ignored for property "enable-cfstring"
Override ignored for property "with-charset"
Override ignored for property "with-SMTP"
Override ignored for property "with-ODBC"
Override ignored for property "svnsite.url"
Build sequence for target(s) `copy-if-changed' is [copy-if-changed-compare, copy-if-changed]
Complete build sequence is [copy-if-changed-compare, copy-if-changed, os-detect, win-init,
mac-init, unix-init, common-init, init, find-apr-src, find-apr-lib, find-apr, build-apr, find-apr-util-src,
find-apr-util-lib, find-apr-util, build-apr-util, find-esmtp-src, find-esmtp-lib, find-esmtp,
build-libesmtp, unix-configure, win-configure, configure, build-standalone-unittest, clean-output,
run-standalone-unittest, build-lib, build, build-trivial, build-projects-xcode, apidocs, site,
build-unittest, build-example, mime=css, usage, run-socketserver, checkout-site, update-site,
post-site, build-projects-vc9, build-projects-vc8, run-defaultinit-log4X, build-projects-vc7,
autogen, build-projects-vc6, site-deploy, build-delayedloop, build-stream, build-console,
build-examples, build-all, build-projects, run-defaultinit-unittest, run-unittest, check,
make-header-check, run-example, test-compile, fixcrlf, clean, header-check, prepare-changes,
mime=html, gump, ]
  [antcall] Entering C:\cygwin\src\log4cxx\apache-log4cxx-0.10.0\build.xml...
Build sequence for target(s) `copy-if-changed' is [copy-if-changed-compare, copy-if-changed]
Complete build sequence is [copy-if-changed-compare, copy-if-changed, os-detect, win-init,
mac-init, unix-init, common-init, init, find-apr-src, find-apr-lib, find-apr, build-apr, find-apr-util-src,
find-apr-util-lib, find-apr-util, build-apr-util, find-esmtp-src, find-esmtp-lib, find-esmtp,
build-libesmtp, unix-configure, win-configure, configure, build-standalone-unittest, clean-output,
run-standalone-unittest, build-lib, build, build-trivial, build-projects-xcode, apidocs, site,
build-unittest, build-example, mime=css, usage, run-socketserver, checkout-site, update-site,
post-site, build-projects-vc9, build-projects-vc8, run-defaultinit-log4X, build-projects-vc7,
autogen, build-projects-vc6, site-deploy, build-delayedloop, build-stream, build-console,
build-examples, build-all, build-projects, run-defaultinit-unittest, run-unittest, check,
make-header-check, run-example, test-compile, fixcrlf, clean, header-check, prepare-changes,
mime=html, gump, ]
copy-if-changed-compare:
copy-if-changed:
Skipped because property 'force-copy' not set.
  [antcall] Exiting C:\cygwin\src\log4cxx\apache-log4cxx-0.10.0\build.xml.
   [delete] Deleting: C:\cygwin\src\log4cxx\apache-log4cxx-0.10.0\src\main\include\log4cxx\log4cxx.tmp
Project base dir set to: C:\cygwin\src\log4cxx\apache-log4cxx-0.10.0
  [antcall] calling target(s) [copy-if-changed] in build file C:\cygwin\src\log4cxx\apache-log4cxx-0.10.0\build.xml
parsing buildfile C:\cygwin\src\log4cxx\apache-log4cxx-0.10.0\build.xml with URI = file:/C:/cygwin/src/log4cxx/apache-log4cxx-0.10.0/build.xml
Project base dir set to: C:\cygwin\src\log4cxx\apache-log4cxx-0.10.0
resolving systemId: file:/C:/cygwin/src/log4cxx/apache-log4cxx-0.10.0/src/ant/common.xml
resolving systemId: file:/C:/cygwin/src/log4cxx/apache-log4cxx-0.10.0/src/ant/find-apr.xml
resolving systemId: file:/C:/cygwin/src/log4cxx/apache-log4cxx-0.10.0/src/ant/find-apr-util.xml
resolving systemId: file:/C:/cygwin/src/log4cxx/apache-log4cxx-0.10.0/src/ant/find-libesmtp.xml
 [property] Loading C:\cygwin\src\log4cxx\apache-log4cxx-0.10.0\build.properties
 [property] Unable to find property file: C:\cygwin\src\log4cxx\apache-log4cxx-0.10.0\build.properties
Override ignored for property "debug"
Override ignored for property "rtti"
Override ignored for property "optimize"
Override ignored for property "lib.type"
Override ignored for property "runtime"
Override ignored for property "base.dir"
Override ignored for property "src.dir"
Override ignored for property "resources.dir"
Override ignored for property "include.dir"
Override ignored for property "target.dir"
Override ignored for property "lib.dir"
Override ignored for property "examples.dir"
Override ignored for property "tests.dir"
Override ignored for property "tests.cpp.dir"
Override ignored for property "tests.resources.dir"
Override ignored for property "tests.output.dir"
Override ignored for property "m2_repo"
Override ignored for property "log4j.version"
[available] Unable to find C:\usr\share\java\log4j-1.2.jar to set property log4j.jar
Override ignored for property "log4j.jar"
Override ignored for property "doxygen.exe"
Override ignored for property "lib.name"
Override ignored for property "lib.prefix"
Override ignored for property "version"
Override ignored for property "enable-char"
Override ignored for property "enable-wchar_t"
Override ignored for property "enable-unichar"
Override ignored for property "enable-cfstring"
Override ignored for property "with-charset"
Override ignored for property "with-SMTP"
Override ignored for property "with-ODBC"
Override ignored for property "svnsite.url"
Build sequence for target(s) `copy-if-changed' is [copy-if-changed-compare, copy-if-changed]
Complete build sequence is [copy-if-changed-compare, copy-if-changed, os-detect, win-init,
mac-init, unix-init, common-init, init, find-apr-src, find-apr-lib, find-apr, build-apr, find-apr-util-src,
find-apr-util-lib, find-apr-util, build-apr-util, find-esmtp-src, find-esmtp-lib, find-esmtp,
build-libesmtp, unix-configure, win-configure, configure, build-standalone-unittest, clean-output,
run-standalone-unittest, build-lib, build, build-trivial, build-projects-xcode, apidocs, site,
build-unittest, build-example, mime=css, usage, run-socketserver, checkout-site, update-site,
post-site, build-projects-vc9, build-projects-vc8, run-defaultinit-log4X, build-projects-vc7,
autogen, build-projects-vc6, site-deploy, build-delayedloop, build-stream, build-console,
build-examples, build-all, build-projects, run-defaultinit-unittest, run-unittest, check,
make-header-check, run-example, test-compile, fixcrlf, clean, header-check, prepare-changes,
mime=html, gump, ]
  [antcall] Entering C:\cygwin\src\log4cxx\apache-log4cxx-0.10.0\build.xml...
Build sequence for target(s) `copy-if-changed' is [copy-if-changed-compare, copy-if-changed]
Complete build sequence is [copy-if-changed-compare, copy-if-changed, os-detect, win-init,
mac-init, unix-init, common-init, init, find-apr-src, find-apr-lib, find-apr, build-apr, find-apr-util-src,
find-apr-util-lib, find-apr-util, build-apr-util, find-esmtp-src, find-esmtp-lib, find-esmtp,
build-libesmtp, unix-configure, win-configure, configure, build-standalone-unittest, clean-output,
run-standalone-unittest, build-lib, build, build-trivial, build-projects-xcode, apidocs, site,
build-unittest, build-example, mime=css, usage, run-socketserver, checkout-site, update-site,
post-site, build-projects-vc9, build-projects-vc8, run-defaultinit-log4X, build-projects-vc7,
autogen, build-projects-vc6, site-deploy, build-delayedloop, build-stream, build-console,
build-examples, build-all, build-projects, run-defaultinit-unittest, run-unittest, check,
make-header-check, run-example, test-compile, fixcrlf, clean, header-check, prepare-changes,
mime=html, gump, ]
copy-if-changed-compare:
copy-if-changed:
Skipped because property 'force-copy' not set.
  [antcall] Exiting C:\cygwin\src\log4cxx\apache-log4cxx-0.10.0\build.xml.
   [delete] Deleting: C:\cygwin\src\log4cxx\apache-log4cxx-0.10.0\src\main\include\log4cxx\private\log4cxx_private.tmp
build-lib:
    [mkdir] Skipping C:\cygwin\src\log4cxx\apache-log4cxx-0.10.0\target\debug\shared\log4cxx_obj
because it already exists.
Override ignored for property "lib.name"
Override ignored for property "lib.prefix"
Override ignored for property "resource.compiler"
Property "esmtp.include.dir" has not been set
Property "pic-option" has not been set
Property "esmtp.lib.dir" has not been set
Property "odbc.lib" has not been set
Property "apr-util.dependencies" has not been set
       [cc] 148 total files to be compiled.
       [cc] gcc -c -g -DLOG4CXX -IC:\cygwin\src\log4cxx\apache-log4cxx-0.10.0\src\main\include
-IC:\cygwin\usr\include\apr-1 -IC:\cygwin\usr\include\apr-1 C:\cygwin\src\log4cxx\apache-log4cxx-0.10.0\src\main\cpp\socket.cpp
C:\cygwin\src\log4cxx\apache-log4cxx-0.10.0\src\main\cpp\transcoder.cpp C:\cygwin\src\log4cxx\apache-log4cxx-0.10.0\src\main\cpp\patternconverter.cpp
C:\cygwin\src\log4cxx\apache-log4cxx-0.10.0\src\main\cpp\optionconverter.cpp C:\cygwin\src\log4cxx\apache-log4cxx-0.10.0\src\main\cpp\objectptr.cpp
C:\cygwin\src\log4cxx\apache-log4cxx-0.10.0\src\main\cpp\basicconfigurator.cpp C:\cygwin\src\log4cxx\apache-log4cxx-0.10.0\src\main\cpp\defaultrepositoryselector.cpp
C:\cygwin\src\log4cxx\apache-log4cxx-0.10.0\src\main\cpp\integerpatternconverter.cpp C:\cygwin\src\log4cxx\apache-log4cxx-0.10.0\src\main\cpp\loggingeventpatternconverter.cpp
C:\cygwin\src\log4cxx\apache-log4cxx-0.10.0\src\main\cpp\filelocationpatternconverter.cpp
 C:\cygwin\src\log4cxx\apache-log4cxx-0.10.0\src\main\cpp\fileinputstream.cpp C:\cygwin\src\log4cxx\apache-log4cxx-0.10.0\src\main\cpp\configurator.cpp
C:\cygwin\src\log4cxx\apache-log4cxx-0.10.0\src\main\cpp\sockethubappender.cpp C:\cygwin\src\log4cxx\apache-log4cxx-0.10.0\src\main\cpp\bytebuffer.cpp
C:\cygwin\src\log4cxx\apache-log4cxx-0.10.0\src\main\cpp\cyclicbuffer.cpp C:\cygwin\src\log4cxx\apache-log4cxx-0.10.0\src\main\cpp\triggeringpolicy.cpp
C:\cygwin\src\log4cxx\apache-log4cxx-0.10.0\src\main\cpp\fulllocationpatternconverter.cpp
C:\cygwin\src\log4cxx\apache-log4cxx-0.10.0\src\main\cpp\gzcompressaction.cpp C:\cygwin\src\log4cxx\apache-log4cxx-0.10.0\src\main\cpp\datelayout.cpp
C:\cygwin\src\log4cxx\apache-log4cxx-0.10.0\src\main\cpp\formattinginfo.cpp C:\cygwin\src\log4cxx\apache-log4cxx-0.10.0\src\main\cpp\nameabbreviator.cpp
C:\cygwin\src\log4cxx\apache-log4cxx-0.10.0\src\main\cpp\bytearrayoutputstream.cpp
 C:\cygwin\src\log4cxx\apache-log4cxx-0.10.0\src\main\cpp\logmanager.cpp C:\cygwin\src\log4cxx\apache-log4cxx-0.10.0\src\main\cpp\datepatternconverter.cpp
C:\cygwin\src\log4cxx\apache-log4cxx-0.10.0\src\main\cpp\ttcclayout.cpp C:\cygwin\src\log4cxx\apache-log4cxx-0.10.0\src\main\cpp\writer.cpp
C:\cygwin\src\log4cxx\apache-log4cxx-0.10.0\src\main\cpp\propertyconfigurator.cpp C:\cygwin\src\log4cxx\apache-log4cxx-0.10.0\src\main\cpp\charsetdecoder.cpp
C:\cygwin\src\log4cxx\apache-log4cxx-0.10.0\src\main\cpp\htmllayout.cpp C:\cygwin\src\log4cxx\apache-log4cxx-0.10.0\src\main\cpp\dateformat.cpp
C:\cygwin\src\log4cxx\apache-log4cxx-0.10.0\src\main\cpp\loggingevent.cpp C:\cygwin\src\log4cxx\apache-log4cxx-0.10.0\src\main\cpp\datagramsocket.cpp
C:\cygwin\src\log4cxx\apache-log4cxx-0.10.0\src\main\cpp\fileappender.cpp C:\cygwin\src\log4cxx\apache-log4cxx-0.10.0\src\main\cpp\transform.cpp
C:\cygwin\src\log4cxx\apache-log4cxx-0.10.0\src\main\cpp\action.cpp
 C:\cygwin\src\log4cxx\apache-log4cxx-0.10.0\src\main\cpp\xmlsocketappender.cpp C:\cygwin\src\log4cxx\apache-log4cxx-0.10.0\src\main\cpp\cacheddateformat.cpp
C:\cygwin\src\log4cxx\apache-log4cxx-0.10.0\src\main\cpp\socketoutputstream.cpp C:\cygwin\src\log4cxx\apache-log4cxx-0.10.0\src\main\cpp\strftimedateformat.cpp
C:\cygwin\src\log4cxx\apache-log4cxx-0.10.0\src\main\cpp\integer.cpp C:\cygwin\src\log4cxx\apache-log4cxx-0.10.0\src\main\cpp\odbcappender.cpp
C:\cygwin\src\log4cxx\apache-log4cxx-0.10.0\src\main\cpp\rollingpolicy.cpp C:\cygwin\src\log4cxx\apache-log4cxx-0.10.0\src\main\cpp\simplelayout.cpp
C:\cygwin\src\log4cxx\apache-log4cxx-0.10.0\src\main\cpp\namepatternconverter.cpp C:\cygwin\src\log4cxx\apache-log4cxx-0.10.0\src\main\cpp\rolloverdescription.cpp
C:\cygwin\src\log4cxx\apache-log4cxx-0.10.0\src\main\cpp\level.cpp C:\cygwin\src\log4cxx\apache-log4cxx-0.10.0\src\main\cpp\systemoutwriter.cpp
 C:\cygwin\src\log4cxx\apache-log4cxx-0.10.0\src\main\cpp\objectoutputstream.cpp C:\cygwin\src\log4cxx\apache-log4cxx-0.10.0\src\main\cpp\writerappender.cpp
C:\cygwin\src\log4cxx\apache-log4cxx-0.10.0\src\main\cpp\loader.cpp C:\cygwin\src\log4cxx\apache-log4cxx-0.10.0\src\main\cpp\filerenameaction.cpp
C:\cygwin\src\log4cxx\apache-log4cxx-0.10.0\src\main\cpp\simpledateformat.cpp C:\cygwin\src\log4cxx\apache-log4cxx-0.10.0\src\main\cpp\throwableinformationpatternconverter.cpp
C:\cygwin\src\log4cxx\apache-log4cxx-0.10.0\src\main\cpp\condition.cpp C:\cygwin\src\log4cxx\apache-log4cxx-0.10.0\src\main\cpp\loggerpatternconverter.cpp
C:\cygwin\src\log4cxx\apache-log4cxx-0.10.0\src\main\cpp\objectimpl.cpp C:\cygwin\src\log4cxx\apache-log4cxx-0.10.0\src\main\cpp\telnetappender.cpp
C:\cygwin\src\log4cxx\apache-log4cxx-0.10.0\src\main\cpp\filewatchdog.cpp C:\cygwin\src\log4cxx\apache-log4cxx-0.10.0\src\main\cpp\propertyresourcebundle.cpp
 C:\cygwin\src\log4cxx\apache-log4cxx-0.10.0\src\main\cpp\linelocationpatternconverter.cpp
C:\cygwin\src\log4cxx\apache-log4cxx-0.10.0\src\main\cpp\system.cpp C:\cygwin\src\log4cxx\apache-log4cxx-0.10.0\src\main\cpp\systemerrwriter.cpp
C:\cygwin\src\log4cxx\apache-log4cxx-0.10.0\src\main\cpp\inetaddress.cpp C:\cygwin\src\log4cxx\apache-log4cxx-0.10.0\src\main\cpp\locationinfo.cpp
C:\cygwin\src\log4cxx\apache-log4cxx-0.10.0\src\main\cpp\zipcompressaction.cpp C:\cygwin\src\log4cxx\apache-log4cxx-0.10.0\src\main\cpp\onlyonceerrorhandler.cpp
C:\cygwin\src\log4cxx\apache-log4cxx-0.10.0\src\main\cpp\stringmatchfilter.cpp C:\cygwin\src\log4cxx\apache-log4cxx-0.10.0\src\main\cpp\propertysetter.cpp
C:\cygwin\src\log4cxx\apache-log4cxx-0.10.0\src\main\cpp\mdc.cpp C:\cygwin\src\log4cxx\apache-log4cxx-0.10.0\src\main\cpp\rootlogger.cpp
C:\cygwin\src\log4cxx\apache-log4cxx-0.10.0\src\main\cpp\filedatepatternconverter.cpp
 C:\cygwin\src\log4cxx\apache-log4cxx-0.10.0\src\main\cpp\nteventlogappender.cpp C:\cygwin\src\log4cxx\apache-log4cxx-0.10.0\src\main\cpp\stringhelper.cpp
C:\cygwin\src\log4cxx\apache-log4cxx-0.10.0\src\main\cpp\dailyrollingfileappender.cpp C:\cygwin\src\log4cxx\apache-log4cxx-0.10.0\src\main\cpp\bytearrayinputstream.cpp
C:\cygwin\src\log4cxx\apache-log4cxx-0.10.0\src\main\cpp\obsoleterollingfileappender.cpp C:\cygwin\src\log4cxx\apache-log4cxx-0.10.0\src\main\cpp\patternlayout.cpp
C:\cygwin\src\log4cxx\apache-log4cxx-0.10.0\src\main\cpp\file.cpp C:\cygwin\src\log4cxx\apache-log4cxx-0.10.0\src\main\cpp\timebasedrollingpolicy.cpp
C:\cygwin\src\log4cxx\apache-log4cxx-0.10.0\src\main\cpp\charsetencoder.cpp C:\cygwin\src\log4cxx\apache-log4cxx-0.10.0\src\main\cpp\levelpatternconverter.cpp
C:\cygwin\src\log4cxx\apache-log4cxx-0.10.0\src\main\cpp\serversocket.cpp C:\cygwin\src\log4cxx\apache-log4cxx-0.10.0\src\main\cpp\locale.cpp
 C:\cygwin\src\log4cxx\apache-log4cxx-0.10.0\src\main\cpp\rollingpolicybase.cpp C:\cygwin\src\log4cxx\apache-log4cxx-0.10.0\src\main\cpp\lineseparatorpatternconverter.cpp
C:\cygwin\src\log4cxx\apache-log4cxx-0.10.0\src\main\cpp\datagrampacket.cpp C:\cygwin\src\log4cxx\apache-log4cxx-0.10.0\src\main\cpp\fileoutputstream.cpp
C:\cygwin\src\log4cxx\apache-log4cxx-0.10.0\src\main\cpp\propertiespatternconverter.cpp C:\cygwin\src\log4cxx\apache-log4cxx-0.10.0\src\main\cpp\exception.cpp
C:\cygwin\src\log4cxx\apache-log4cxx-0.10.0\src\main\cpp\xmllayout.cpp C:\cygwin\src\log4cxx\apache-log4cxx-0.10.0\src\main\cpp\syslogwriter.cpp
C:\cygwin\src\log4cxx\apache-log4cxx-0.10.0\src\main\cpp\relativetimedateformat.cpp C:\cygwin\src\log4cxx\apache-log4cxx-0.10.0\src\main\cpp\threadspecificdata.cpp
C:\cygwin\src\log4cxx\apache-log4cxx-0.10.0\src\main\cpp\levelmatchfilter.cpp C:\cygwin\src\log4cxx\apache-log4cxx-0.10.0\src\main\cpp\date.cpp
 C:\cygwin\src\log4cxx\apache-log4cxx-0.10.0\src\main\cpp\patternparser.cpp C:\cygwin\src\log4cxx\apache-log4cxx-0.10.0\src\main\cpp\consoleappender.cpp
C:\cygwin\src\log4cxx\apache-log4cxx-0.10.0\src\main\cpp\socketappenderskeleton.cpp C:\cygwin\src\log4cxx\apache-log4cxx-0.10.0\src\main\cpp\messagebuffer.cpp
C:\cygwin\src\log4cxx\apache-log4cxx-0.10.0\src\main\cpp\aprinitializer.cpp C:\cygwin\src\log4cxx\apache-log4cxx-0.10.0\src\main\cpp\layout.cpp
C:\cygwin\src\log4cxx\apache-log4cxx-0.10.0\src\main\cpp\levelrangefilter.cpp C:\cygwin\src\log4cxx\apache-log4cxx-0.10.0\src\main\cpp\messagepatternconverter.cpp
C:\cygwin\src\log4cxx\apache-log4cxx-0.10.0\src\main\cpp\fallbackerrorhandler.cpp C:\cygwin\src\log4cxx\apache-log4cxx-0.10.0\src\main\cpp\domconfigurator.cpp
C:\cygwin\src\log4cxx\apache-log4cxx-0.10.0\src\main\cpp\threadlocal.cpp C:\cygwin\src\log4cxx\apache-log4cxx-0.10.0\src\main\cpp\mutex.cpp
 C:\cygwin\src\log4cxx\apache-log4cxx-0.10.0\src\main\cpp\syslogappender.cpp C:\cygwin\src\log4cxx\apache-log4cxx-0.10.0\src\main\cpp\classnamepatternconverter.cpp
C:\cygwin\src\log4cxx\apache-log4cxx-0.10.0\src\main\cpp\rollingfileappender.cpp C:\cygwin\src\log4cxx\apache-log4cxx-0.10.0\src\main\cpp\resourcebundle.cpp
C:\cygwin\src\log4cxx\apache-log4cxx-0.10.0\src\main\cpp\defaultloggerfactory.cpp C:\cygwin\src\log4cxx\apache-log4cxx-0.10.0\src\main\cpp\threadcxx.cpp
C:\cygwin\src\log4cxx\apache-log4cxx-0.10.0\src\main\cpp\synchronized.cpp C:\cygwin\src\log4cxx\apache-log4cxx-0.10.0\src\main\cpp\timezone.cpp
C:\cygwin\src\log4cxx\apache-log4cxx-0.10.0\src\main\cpp\pool.cpp C:\cygwin\src\log4cxx\apache-log4cxx-0.10.0\src\main\cpp\reader.cpp
C:\cygwin\src\log4cxx\apache-log4cxx-0.10.0\src\main\cpp\smtpappender.cpp C:\cygwin\src\log4cxx\apache-log4cxx-0.10.0\src\main\cpp\filterbasedtriggeringpolicy.cpp
 C:\cygwin\src\log4cxx\apache-log4cxx-0.10.0\src\main\cpp\fixedwindowrollingpolicy.cpp C:\cygwin\src\log4cxx\apache-log4cxx-0.10.0\src\main\cpp\literalpatternconverter.cpp
C:\cygwin\src\log4cxx\apache-log4cxx-0.10.0\src\main\cpp\appenderskeleton.cpp C:\cygwin\src\log4cxx\apache-log4cxx-0.10.0\src\main\cpp\relativetimepatternconverter.cpp
C:\cygwin\src\log4cxx\apache-log4cxx-0.10.0\src\main\cpp\inputstreamreader.cpp C:\cygwin\src\log4cxx\apache-log4cxx-0.10.0\src\main\cpp\stringtokenizer.cpp
C:\cygwin\src\log4cxx\apache-log4cxx-0.10.0\src\main\cpp\threadpatternconverter.cpp C:\cygwin\src\log4cxx\apache-log4cxx-0.10.0\src\main\cpp\properties.cpp
C:\cygwin\src\log4cxx\apache-log4cxx-0.10.0\src\main\cpp\sizebasedtriggeringpolicy.cpp C:\cygwin\src\log4cxx\apache-log4cxx-0.10.0\src\main\cpp\ndcpatternconverter.cpp
C:\cygwin\src\log4cxx\apache-log4cxx-0.10.0\src\main\cpp\inputstream.cpp C:\cygwin\src\log4cxx\apache-log4cxx-0.10.0\src\main\cpp\outputstream.cpp
 C:\cygwin\src\log4cxx\apache-log4cxx-0.10.0\src\main\cpp\logger.cpp C:\cygwin\src\log4cxx\apache-log4cxx-0.10.0\src\main\cpp\filter.cpp
C:\cygwin\src\log4cxx\apache-log4cxx-0.10.0\src\main\cpp\hierarchy.cpp C:\cygwin\src\log4cxx\apache-log4cxx-0.10.0\src\main\cpp\ndc.cpp
C:\cygwin\src\log4cxx\apache-log4cxx-0.10.0\src\main\cpp\classregistration.cpp C:\cygwin\src\log4cxx\apache-log4cxx-0.10.0\src\main\cpp\loglog.cpp
C:\cygwin\src\log4cxx\apache-log4cxx-0.10.0\src\main\cpp\class.cpp C:\cygwin\src\log4cxx\apache-log4cxx-0.10.0\src\main\cpp\asyncappender.cpp
C:\cygwin\src\log4cxx\apache-log4cxx-0.10.0\src\main\cpp\methodlocationpatternconverter.cpp
C:\cygwin\src\log4cxx\apache-log4cxx-0.10.0\src\main\cpp\socketappender.cpp C:\cygwin\src\log4cxx\apache-log4cxx-0.10.0\src\main\cpp\outputdebugstringappender.cpp
C:\cygwin\src\log4cxx\apache-log4cxx-0.10.0\src\main\cpp\appenderattachableimpl.cpp
 C:\cygwin\src\log4cxx\apache-log4cxx-0.10.0\src\main\cpp\manualtriggeringpolicy.cpp C:\cygwin\src\log4cxx\apache-log4cxx-0.10.0\src\main\cpp\bufferedwriter.cpp
C:\cygwin\src\log4cxx\apache-log4cxx-0.10.0\src\main\cpp\outputstreamwriter.cpp C:\cygwin\src\log4cxx\apache-log4cxx-0.10.0\src\main\cpp\logstream.cpp
C:\cygwin\src\log4cxx\apache-log4cxx-0.10.0\src\main\cpp\defaultconfigurator.cpp
BUILD FAILED
C:\cygwin\src\log4cxx\apache-log4cxx-0.10.0\build.xml:548: Could not launch gcc: java.io.IOException:
Cannot run program "gcc" (in directory "C:\cygwin\src\log4cxx\apache-log4cxx-0.10.0\target\debug\shared\log4cxx_obj"):
CreateProcess error=2, The system cannot find the file specified
 at net.sf.antcontrib.cpptasks.CUtil.runCommand(CUtil.java:365)
 at net.sf.antcontrib.cpptasks.compiler.CommandLineCompiler.runCommand(CommandLineCompiler.java:432)
 at net.sf.antcontrib.cpptasks.compiler.CommandLineCompiler.compile(CommandLineCompiler.java:199)
 at net.sf.antcontrib.cpptasks.compiler.CommandLineCompilerConfiguration.compile(CommandLineCompilerConfiguration.java:133)
 at net.sf.antcontrib.cpptasks.CCTask.execute(CCTask.java:732)
 at org.apache.tools.ant.UnknownElement.execute(UnknownElement.java:288)
 at sun.reflect.GeneratedMethodAccessor1.invoke(Unknown Source)
 at sun.reflect.DelegatingMethodAccessorImpl.invoke(DelegatingMethodAccessorImpl.java:25)
 at java.lang.reflect.Method.invoke(Method.java:597)
 at org.apache.tools.ant.dispatch.DispatchUtils.execute(DispatchUtils.java:106)
 at org.apache.tools.ant.Task.perform(Task.java:348)
 at org.apache.tools.ant.Target.execute(Target.java:357)
 at org.apache.tools.ant.Target.performTasks(Target.java:385)
 at org.apache.tools.ant.Project.executeSortedTargets(Project.java:1337)
 at org.apache.tools.ant.Project.executeTarget(Project.java:1306)
 at org.apache.tools.ant.helper.DefaultExecutor.executeTargets(DefaultExecutor.java:41)
 at org.apache.tools.ant.Project.executeTargets(Project.java:1189)
 at org.apache.tools.ant.Main.runBuild(Main.java:758)
 at org.apache.tools.ant.Main.startAnt(Main.java:217)
 at org.apache.tools.ant.launch.Launcher.run(Launcher.java:257)
 at org.apache.tools.ant.launch.Launcher.main(Launcher.java:104)
Total time: 1 second




----- Original Message ----
From: Lars Schouw <schouwla@yahoo.com>
To: log4cxx-user@logging.apache.org
Sent: Monday, July 13, 2009 3:09:50 PM
Subject: build on Cygwin


I am trying to build log4cxx under Cygwin but it fails with an error that ant can't find gcc.
Could not launch gcc: java.io.IOException: Cannot run program "gcc"

$ cd /src/log4cxx/apache-log4cxx-0.10.0

$ ant -Dos.family=cygwin    -Dwith-apr=/cygwin/lib    -Dwith-apr-util=/cygwin/lib   
-Denable-wchar_t=0

$ which gcc
/usr/bin/gcc

Output from ant run:

Buildfile: build.xml
os-detect:
win-init:
mac-init:
unix-init:
common-init:
init:
     [echo] force-ant: ${force-ant}
find-apr-src:
find-apr-lib:
find-apr:
     [echo] apr-find:
     [echo] apr.dir=/cygwin/lib
     [echo] apr.include.dir=/cygwin/lib/../usr/include/apr-1
     [echo] apr.src.dir=${apr.src.dir}
     [echo] apr.lib.file=/cygwin/lib/libapr-1.la
     [echo] apr.lib.file.dir=/cygwin/lib
     [echo] apr.lib.dir=/cygwin/lib
     [echo] apr.lib.prefix=
     [echo] apr.lib.suffix=
     [echo] apr.lib.type=shared
build-apr:
find-apr-util-src:
find-apr-util-lib:
find-apr-util:
     [echo] apr-util-find:
     [echo] apr-util.dir=/cygwin/lib
     [echo] apr-util.include.dir=/cygwin/lib/../usr/include/apr-1
     [echo] apr-util.src.dir=${apr-util.src.dir}
     [echo] apr-util.lib.file=/cygwin/lib/libaprutil-1.la
     [echo] apr-util.lib.file.dir=/cygwin/lib
     [echo] apr-util.lib.dir=/cygwin/lib
     [echo] apr-util.lib.prefix=
     [echo] apr-util.lib.suffix=
     [echo] apr-util.lib.type=shared
build-apr-util:
find-esmtp-src:
find-esmtp-lib:
find-esmtp:
     [echo] esmtp-find:
     [echo] esmtp.dir=${esmtp.dir}
     [echo] esmtp.include.dir=${esmtp.include.dir}
     [echo] esmtp.src.dir=${esmtp.src.dir}
     [echo] esmtp.lib.file=${esmtp.lib.file}
     [echo] esmtp.lib.file.dir=${esmtp.lib.file.dir}
     [echo] esmtp.lib.dir=${esmtp.lib.dir}
     [echo] esmtp.lib.prefix=${esmtp.lib.prefix}
     [echo] esmtp.lib.suffix=${esmtp.lib.suffix}
     [echo] esmtp.lib.type=${esmtp.lib.type}
build-libesmtp:
unix-configure:
     [copy] Copying 1 file to C:\cygwin\src\log4cxx\apache-log4cxx-0.10.0\src\main\include\log4cxx
     [copy] Copying 1 file to C:\cygwin\src\log4cxx\apache-log4cxx-0.10.0\src\main\include\log4cxx\private
win-configure:
configure:
     [echo] Configuring with-logchar=utf-8
     [echo] Configuring with-charset=auto
     [echo] Configuring with-SMTP=no
     [echo] Configuring with-ODBC=no
     [echo] Configuring enable-char=1
     [echo] Configuring enable-wchar_t=0
     [echo] Configuring enable-unichar=0
     [echo] Configuring enable-cfstring=0
copy-if-changed-compare:
copy-if-changed:
   [delete] Deleting: C:\cygwin\src\log4cxx\apache-log4cxx-0.10.0\src\main\include\log4cxx\log4cxx.tmp
copy-if-changed-compare:
copy-if-changed:
   [delete] Deleting: C:\cygwin\src\log4cxx\apache-log4cxx-0.10.0\src\main\include\log4cxx\private\log4cxx_private.tmp
build-lib:
       [cc] 148 total files to be compiled.
BUILD FAILED
C:\cygwin\src\log4cxx\apache-log4cxx-0.10.0\build.xml:548: Could not launch gcc: java.io.IOException:
Cannot run program "gcc" (in directory "C:\cygwin\src\log4cxx\apache-log4cxx-0.10.0\target\debug\shared\log4cxx_obj"):
CreateProcess error=2, The system cannot find the file specified
Total time: 1 second


My host OS is Windows XP SP3.

Lars


      

Mime
View raw message