kafka-commits mailing list archives

Site index · List index
Message view « Date » · « Thread »
Top « Date » · « Thread »
From Apache Jenkins Server <jenk...@builds.apache.org>
Subject Build failed in Jenkins: Kafka-0.8 #74
Date Thu, 11 Oct 2012 17:04:53 GMT
See <https://builds.apache.org/job/Kafka-0.8/74/changes>

Changes:

[jkreps] KAFKA-506 Misc. follow-up cleanups from Neha's review.

------------------------------------------
[...truncated 1762 lines...]
[info] == core-kafka / kafka.producer.ProducerTest ==
[info] 
[info] == core-kafka / kafka.server.SimpleFetchTest ==
[info] Test Starting: testNonReplicaSeesHwWhenFetching(kafka.server.SimpleFetchTest)
[info] Test Passed: testNonReplicaSeesHwWhenFetching(kafka.server.SimpleFetchTest)
[info] Test Starting: testReplicaSeesLeoWhenFetching(kafka.server.SimpleFetchTest)
[info] Test Passed: testReplicaSeesLeoWhenFetching(kafka.server.SimpleFetchTest)
[info] == core-kafka / kafka.server.SimpleFetchTest ==
[info] 
[info] == core-kafka / kafka.log.LogOffsetTest ==
[info] Test Starting: testGetOffsetsForUnknownTopic(kafka.log.LogOffsetTest)
[info] Test Passed: testGetOffsetsForUnknownTopic(kafka.log.LogOffsetTest)
[info] Test Starting: testGetOffsetsBeforeLatestTime(kafka.log.LogOffsetTest)
[info] Test Passed: testGetOffsetsBeforeLatestTime(kafka.log.LogOffsetTest)
[info] Test Starting: testEmptyLogsGetOffsets(kafka.log.LogOffsetTest)
[info] Test Passed: testEmptyLogsGetOffsets(kafka.log.LogOffsetTest)
[info] Test Starting: testGetOffsetsBeforeNow(kafka.log.LogOffsetTest)
[info] Test Passed: testGetOffsetsBeforeNow(kafka.log.LogOffsetTest)
[info] Test Starting: testGetOffsetsBeforeEarliestTime(kafka.log.LogOffsetTest)
[info] Test Passed: testGetOffsetsBeforeEarliestTime(kafka.log.LogOffsetTest)
[info] == core-kafka / kafka.log.LogOffsetTest ==
[info] 
[info] == core-kafka / kafka.producer.SyncProducerTest ==
[info] Test Starting: testReachableServer(kafka.producer.SyncProducerTest)
[info] Test Passed: testReachableServer(kafka.producer.SyncProducerTest)
[info] Test Starting: testEmptyProduceRequest(kafka.producer.SyncProducerTest)
[info] Test Passed: testEmptyProduceRequest(kafka.producer.SyncProducerTest)
[info] Test Starting: testMessageSizeTooLarge(kafka.producer.SyncProducerTest)
[info] Test Passed: testMessageSizeTooLarge(kafka.producer.SyncProducerTest)
[info] Test Starting: testProduceCorrectlyReceivesResponse(kafka.producer.SyncProducerTest)
[info] Test Passed: testProduceCorrectlyReceivesResponse(kafka.producer.SyncProducerTest)
[info] Test Starting: testProducerCanTimeout(kafka.producer.SyncProducerTest)
[info] Test Passed: testProducerCanTimeout(kafka.producer.SyncProducerTest)
[info] == core-kafka / kafka.producer.SyncProducerTest ==
[info] 
[info] == core-kafka / kafka.log.LogSegmentTest ==
[info] Test Starting: testReadOnEmptySegment(kafka.log.LogSegmentTest)
[info] Test Passed: testReadOnEmptySegment(kafka.log.LogSegmentTest)
[info] Test Starting: testReadBeforeFirstOffset(kafka.log.LogSegmentTest)
[info] Test Passed: testReadBeforeFirstOffset(kafka.log.LogSegmentTest)
[info] Test Starting: testReadSingleMessage(kafka.log.LogSegmentTest)
[info] Test Passed: testReadSingleMessage(kafka.log.LogSegmentTest)
[info] Test Starting: testReadAfterLast(kafka.log.LogSegmentTest)
[info] Test Passed: testReadAfterLast(kafka.log.LogSegmentTest)
[info] Test Starting: testReadFromGap(kafka.log.LogSegmentTest)
[info] Test Passed: testReadFromGap(kafka.log.LogSegmentTest)
[info] Test Starting: testTruncate(kafka.log.LogSegmentTest)
[info] Test Passed: testTruncate(kafka.log.LogSegmentTest)
[info] Test Starting: testNextOffsetCalculation(kafka.log.LogSegmentTest)
[info] Test Passed: testNextOffsetCalculation(kafka.log.LogSegmentTest)
[info] == core-kafka / kafka.log.LogSegmentTest ==
[info] 
[info] == core-kafka / kafka.utils.UtilsTest ==
[info] Test Starting: testSwallow
[info] Test Passed: testSwallow
[info] Test Starting: testCircularIterator
[info] Test Passed: testCircularIterator
[info] == core-kafka / kafka.utils.UtilsTest ==
[info] 
[info] == core-kafka / kafka.log.LogManagerTest ==
[info] Test Starting: testCreateLog(kafka.log.LogManagerTest)
[info] Test Passed: testCreateLog(kafka.log.LogManagerTest)
[info] Test Starting: testGetLog(kafka.log.LogManagerTest)
[info] Test Passed: testGetLog(kafka.log.LogManagerTest)
[info] Test Starting: testCleanupExpiredSegments(kafka.log.LogManagerTest)
[info] Test Passed: testCleanupExpiredSegments(kafka.log.LogManagerTest)
[info] Test Starting: testCleanupSegmentsToMaintainSize(kafka.log.LogManagerTest)
[info] Test Passed: testCleanupSegmentsToMaintainSize(kafka.log.LogManagerTest)
[info] Test Starting: testTimeBasedFlush(kafka.log.LogManagerTest)
now = 1349975054424 last flush = 1349975054415
[info] Test Passed: testTimeBasedFlush(kafka.log.LogManagerTest)
[info] == core-kafka / kafka.log.LogManagerTest ==
[info] 
[info] == core-kafka / kafka.admin.AdminTest ==
[info] Test Starting: testReplicaAssignment(kafka.admin.AdminTest)
[info] Test Passed: testReplicaAssignment(kafka.admin.AdminTest)
[info] Test Starting: testManualReplicaAssignment(kafka.admin.AdminTest)
[info] Test Passed: testManualReplicaAssignment(kafka.admin.AdminTest)
[info] Test Starting: testTopicCreationInZK(kafka.admin.AdminTest)
[info] Test Passed: testTopicCreationInZK(kafka.admin.AdminTest)
[info] Test Starting: testGetTopicMetadata(kafka.admin.AdminTest)
[info] Test Passed: testGetTopicMetadata(kafka.admin.AdminTest)
[info] Test Starting: testPartitionReassignmentWithLeaderInNewReplicas(kafka.admin.AdminTest)
[info] Test Passed: testPartitionReassignmentWithLeaderInNewReplicas(kafka.admin.AdminTest)
[info] Test Starting: testPartitionReassignmentWithLeaderNotInNewReplicas(kafka.admin.AdminTest)
[info] Test Passed: testPartitionReassignmentWithLeaderNotInNewReplicas(kafka.admin.AdminTest)
[info] Test Starting: testPartitionReassignmentNonOverlappingReplicas(kafka.admin.AdminTest)
[info] Test Passed: testPartitionReassignmentNonOverlappingReplicas(kafka.admin.AdminTest)
[info] Test Starting: testReassigningNonExistingPartition(kafka.admin.AdminTest)
[info] Test Passed: testReassigningNonExistingPartition(kafka.admin.AdminTest)
[info] Test Starting: testResumePartitionReassignmentThatWasCompleted(kafka.admin.AdminTest)
[info] Test Passed: testResumePartitionReassignmentThatWasCompleted(kafka.admin.AdminTest)
[info] Test Starting: testResumePartitionReassignmentAfterLeaderWasMoved(kafka.admin.AdminTest)
[error] Test Failed: testResumePartitionReassignmentAfterLeaderWasMoved(kafka.admin.AdminTest)
junit.framework.AssertionFailedError: Partition should have been reassigned to 2, 3 expected:<List(2,
3)> but was:<List(0, 1)>
	at junit.framework.Assert.fail(Assert.java:47)
	at junit.framework.Assert.failNotEquals(Assert.java:277)
	at junit.framework.Assert.assertEquals(Assert.java:64)
	at kafka.admin.AdminTest.testResumePartitionReassignmentAfterLeaderWasMoved(AdminTest.scala:359)
	at sun.reflect.NativeMethodAccessorImpl.invoke0(Native Method)
	at sun.reflect.NativeMethodAccessorImpl.invoke(NativeMethodAccessorImpl.java:39)
	at sun.reflect.DelegatingMethodAccessorImpl.invoke(DelegatingMethodAccessorImpl.java:25)
	at java.lang.reflect.Method.invoke(Method.java:597)
	at junit.framework.TestCase.runTest(TestCase.java:164)
	at junit.framework.TestCase.runBare(TestCase.java:130)
	at junit.framework.TestResult$1.protect(TestResult.java:110)
	at junit.framework.TestResult.runProtected(TestResult.java:128)
	at junit.framework.TestResult.run(TestResult.java:113)
	at junit.framework.TestCase.run(TestCase.java:120)
	at junit.framework.TestSuite.runTest(TestSuite.java:228)
	at junit.framework.TestSuite.run(TestSuite.java:223)
	at junit.framework.TestSuite.runTest(TestSuite.java:228)
	at junit.framework.TestSuite.run(TestSuite.java:223)
	at org.scalatest.junit.JUnit3Suite.run(JUnit3Suite.scala:309)
	at org.scalatest.tools.ScalaTestFramework$ScalaTestRunner.run(ScalaTestFramework.scala:40)
	at sbt.TestRunner.run(TestFramework.scala:53)
	at sbt.TestRunner.runTest$1(TestFramework.scala:67)
	at sbt.TestRunner.run(TestFramework.scala:76)
	at sbt.TestFramework$$anonfun$10$$anonfun$apply$11.runTest$2(TestFramework.scala:194)
	at sbt.TestFramework$$anonfun$10$$anonfun$apply$11$$anonfun$apply$12.apply(TestFramework.scala:205)
	at sbt.TestFramework$$anonfun$10$$anonfun$apply$11$$anonfun$apply$12.apply(TestFramework.scala:205)
	at sbt.NamedTestTask.run(TestFramework.scala:92)
	at sbt.ScalaProject$$anonfun$sbt$ScalaProject$$toTask$1.apply(ScalaProject.scala:193)
	at sbt.ScalaProject$$anonfun$sbt$ScalaProject$$toTask$1.apply(ScalaProject.scala:193)
	at sbt.TaskManager$Task.invoke(TaskManager.scala:62)
	at sbt.impl.RunTask.doRun$1(RunTask.scala:77)
	at sbt.impl.RunTask.runTask(RunTask.scala:85)
	at sbt.impl.RunTask.sbt$impl$RunTask$$runIfNotRoot(RunTask.scala:60)
	at sbt.impl.RunTask$$anonfun$runTasksExceptRoot$2.apply(RunTask.scala:48)
	at sbt.impl.RunTask$$anonfun$runTasksExceptRoot$2.apply(RunTask.scala:48)
	at sbt.Distributor$Run$Worker$$anonfun$2.apply(ParallelRunner.scala:131)
	at sbt.Distributor$Run$Worker$$anonfun$2.apply(ParallelRunner.scala:131)
	at sbt.Control$.trapUnit(Control.scala:19)
	at sbt.Distributor$Run$Worker.run(ParallelRunner.scala:131)
[info] == core-kafka / kafka.admin.AdminTest ==
[info] 
[info] == core-kafka / kafka.message.MessageTest ==
[info] Test Starting: testFieldValues
[info] Test Passed: testFieldValues
[info] Test Starting: testChecksum
[info] Test Passed: testChecksum
[info] Test Starting: testEquality
[info] Test Passed: testEquality
[info] Test Starting: testIsHashable
[info] Test Passed: testIsHashable
[info] == core-kafka / kafka.message.MessageTest ==
[info] 
[info] == core-kafka / kafka.consumer.ZookeeperConsumerConnectorTest ==
[info] Test Starting: testBasic(kafka.consumer.ZookeeperConsumerConnectorTest)
[info] Test Passed: testBasic(kafka.consumer.ZookeeperConsumerConnectorTest)
[info] Test Starting: testCompression(kafka.consumer.ZookeeperConsumerConnectorTest)
[info] Test Passed: testCompression(kafka.consumer.ZookeeperConsumerConnectorTest)
[info] Test Starting: testCompressionSetConsumption(kafka.consumer.ZookeeperConsumerConnectorTest)
[info] Test Passed: testCompressionSetConsumption(kafka.consumer.ZookeeperConsumerConnectorTest)
[info] Test Starting: testConsumerDecoder(kafka.consumer.ZookeeperConsumerConnectorTest)
[info] Test Passed: testConsumerDecoder(kafka.consumer.ZookeeperConsumerConnectorTest)
[info] Test Starting: testLeaderSelectionForPartition(kafka.consumer.ZookeeperConsumerConnectorTest)
[info] Test Passed: testLeaderSelectionForPartition(kafka.consumer.ZookeeperConsumerConnectorTest)
[info] == core-kafka / kafka.consumer.ZookeeperConsumerConnectorTest ==
[info] 
[info] == core-kafka / kafka.zk.ZKEphemeralTest ==
[info] Test Starting: testEphemeralNodeCleanup(kafka.zk.ZKEphemeralTest)
[info] Test Passed: testEphemeralNodeCleanup(kafka.zk.ZKEphemeralTest)
[info] == core-kafka / kafka.zk.ZKEphemeralTest ==
[info] 
[info] == core-kafka / kafka.log.OffsetIndexTest ==
[info] Test Starting: truncate
[info] Test Passed: truncate
[info] Test Starting: randomLookupTest
[info] Test Passed: randomLookupTest
[info] Test Starting: lookupExtremeCases
[info] Test Passed: lookupExtremeCases
[info] Test Starting: appendTooMany
[info] Test Passed: appendTooMany
[info] Test Starting: appendOutOfOrder
[info] Test Passed: appendOutOfOrder
[info] Test Starting: testReopen
[info] Test Passed: testReopen
[info] == core-kafka / kafka.log.OffsetIndexTest ==
[info] 
[info] == core-kafka / test-finish ==
[error] Failed: : Total 157, Failed 3, Errors 0, Passed 154, Skipped 0
[info] == core-kafka / test-finish ==
[info] 
[info] == core-kafka / Test cleanup 1 ==
[info] Deleting directory /tmp/sbt_ae88567c
[info] == core-kafka / Test cleanup 1 ==
[info] 
[info] == core-kafka / test-cleanup ==
[info] == core-kafka / test-cleanup ==
[info] 
[info] == hadoop producer / copy-resources ==
[info] == hadoop producer / copy-resources ==
[info] 
[info] == hadoop consumer / test-compile ==
[info]   Source analysis: 0 new/modified, 0 indirectly invalidated, 0 removed.
[info] Compiling test sources...
[info] Nothing to compile.
[info]   Post-analysis: 0 classes.
[info] == hadoop consumer / test-compile ==
[info] 
[info] == java-examples / copy-resources ==
[info] == java-examples / copy-resources ==
[info] 
[info] == perf / copy-test-resources ==
[info] == perf / copy-test-resources ==
[info] 
[info] == java-examples / copy-test-resources ==
[info] == java-examples / copy-test-resources ==
[info] 
[info] == java-examples / test-compile ==
[info]   Source analysis: 0 new/modified, 0 indirectly invalidated, 0 removed.
[info] Compiling test sources...
[info] Nothing to compile.
[info]   Post-analysis: 0 classes.
[info] == java-examples / test-compile ==
[info] 
[info] == hadoop consumer / copy-resources ==
[info] == hadoop consumer / copy-resources ==
[info] 
[info] == perf / copy-resources ==
[info] == perf / copy-resources ==
[info] 
[info] == perf / test-compile ==
[info]   Source analysis: 0 new/modified, 0 indirectly invalidated, 0 removed.
[info] Compiling test sources...
[info] Nothing to compile.
[info]   Post-analysis: 0 classes.
[info] == perf / test-compile ==
[info] 
[info] == hadoop consumer / copy-test-resources ==
[info] == hadoop consumer / copy-test-resources ==
[info] 
[info] == hadoop producer / test-compile ==
[info]   Source analysis: 0 new/modified, 0 indirectly invalidated, 0 removed.
[info] Compiling test sources...
[info] Nothing to compile.
[info]   Post-analysis: 0 classes.
[info] == hadoop producer / test-compile ==
[error] Error running kafka.integration.FetcherTest: Test FAILED
[error] Error running kafka.server.LogRecoveryTest: Test FAILED
[error] Error running kafka.admin.AdminTest: Test FAILED
[error] Error running test: One or more subtasks failed
[info] 
[info] Total time: 210 s, completed Oct 11, 2012 5:04:53 PM
[info] 
[info] Total session time: 211 s, completed Oct 11, 2012 5:04:53 PM
[error] Error during build.
Build step 'Execute shell' marked build as failure

Mime
View raw message