kafka-commits mailing list archives

Site index · List index
Message view « Date » · « Thread »
Top « Date » · « Thread »
From Apache Jenkins Server <jenk...@builds.apache.org>
Subject Build failed in Jenkins: Kafka-0.8 #73
Date Wed, 10 Oct 2012 22:33:40 GMT
See <https://builds.apache.org/job/Kafka-0.8/73/changes>

Changes:

[nehanarkhede] KAFKA-42 part 2: new files

[nehanarkhede] KAFKA-42 Cluster expansion feature; patched by Neha; reviewed by Jun

------------------------------------------
[...truncated 4686 lines...]
[2012-10-10 22:33:11,869] WARN Session 0x13a4ccf44e40002 for server null, unexpected error,
closing socket connection and attempting reconnect (org.apache.zookeeper.ClientCnxn:1188)
java.net.ConnectException: Connection refused
	at sun.nio.ch.SocketChannelImpl.checkConnect(Native Method)
	at sun.nio.ch.SocketChannelImpl.finishConnect(SocketChannelImpl.java:567)
	at org.apache.zookeeper.ClientCnxn$SendThread.run(ClientCnxn.java:1146)
[2012-10-10 22:33:12,252] WARN Session 0x13a4ccefc670007 for server null, unexpected error,
closing socket connection and attempting reconnect (org.apache.zookeeper.ClientCnxn:1188)
java.net.ConnectException: Connection refused
	at sun.nio.ch.SocketChannelImpl.checkConnect(Native Method)
	at sun.nio.ch.SocketChannelImpl.finishConnect(SocketChannelImpl.java:567)
	at org.apache.zookeeper.ClientCnxn$SendThread.run(ClientCnxn.java:1146)
[2012-10-10 22:33:13,424] WARN Session 0x13a4ccf44e40002 for server null, unexpected error,
closing socket connection and attempting reconnect (org.apache.zookeeper.ClientCnxn:1188)
java.net.ConnectException: Connection refused
	at sun.nio.ch.SocketChannelImpl.checkConnect(Native Method)
	at sun.nio.ch.SocketChannelImpl.finishConnect(SocketChannelImpl.java:567)
	at org.apache.zookeeper.ClientCnxn$SendThread.run(ClientCnxn.java:1146)
[info] Test Passed: testCleanupSegmentsToMaintainSize(kafka.log.LogManagerTest)
[info] Test Starting: testTimeBasedFlush(kafka.log.LogManagerTest)
now = 1349908393464 last flush = 1349908393454
[info] Test Passed: testTimeBasedFlush(kafka.log.LogManagerTest)
[info] == core-kafka / kafka.log.LogManagerTest ==
[info] 
[info] == core-kafka / kafka.log.OffsetIndexTest ==
[2012-10-10 22:33:13,506] WARN Session 0x13a4ccefc670007 for server null, unexpected error,
closing socket connection and attempting reconnect (org.apache.zookeeper.ClientCnxn:1188)
java.net.ConnectException: Connection refused
	at sun.nio.ch.SocketChannelImpl.checkConnect(Native Method)
	at sun.nio.ch.SocketChannelImpl.finishConnect(SocketChannelImpl.java:567)
	at org.apache.zookeeper.ClientCnxn$SendThread.run(ClientCnxn.java:1146)
[info] Test Starting: truncate
[info] Test Passed: truncate
[info] Test Starting: randomLookupTest
[info] Test Passed: randomLookupTest
[info] Test Starting: lookupExtremeCases
[info] Test Passed: lookupExtremeCases
[info] Test Starting: appendTooMany
[info] Test Passed: appendTooMany
[info] Test Starting: appendOutOfOrder
[info] Test Passed: appendOutOfOrder
[info] Test Starting: testReopen
[info] Test Passed: testReopen
[info] == core-kafka / kafka.log.OffsetIndexTest ==
[info] 
[info] == core-kafka / kafka.log.FileMessageSetTest ==
[info] Test Starting: testWrittenEqualsRead
[info] Test Passed: testWrittenEqualsRead
[info] Test Starting: testIteratorIsConsistent
[info] Test Passed: testIteratorIsConsistent
[info] Test Starting: testSizeInBytes
[info] Test Passed: testSizeInBytes
[info] Test Starting: testWriteTo
[info] Test Passed: testWriteTo
[info] Test Starting: testFileSize
[info] Test Passed: testFileSize
[info] Test Starting: testIterationOverPartialAndTruncation
[info] Test Passed: testIterationOverPartialAndTruncation
[info] Test Starting: testIterationDoesntChangePosition
[info] Test Passed: testIterationDoesntChangePosition
[info] Test Starting: testRead
[info] Test Passed: testRead
[info] Test Starting: testSearch
[info] Test Passed: testSearch
[info] == core-kafka / kafka.log.FileMessageSetTest ==
[info] 
[info] == core-kafka / kafka.message.MessageCompressionTest ==
[info] Test Starting: testSimpleCompressDecompress
[info] Test Passed: testSimpleCompressDecompress
[info] Test Starting: testComplexCompressDecompress
[info] Test Passed: testComplexCompressDecompress
[info] == core-kafka / kafka.message.MessageCompressionTest ==
[info] 
[info] == core-kafka / kafka.message.ByteBufferMessageSetTest ==
[info] Test Starting: testWrittenEqualsRead
[info] Test Passed: testWrittenEqualsRead
[info] Test Starting: testIteratorIsConsistent
[info] Test Passed: testIteratorIsConsistent
[info] Test Starting: testSizeInBytes
[info] Test Passed: testSizeInBytes
[info] Test Starting: testEquals
[info] Test Passed: testEquals
[info] Test Starting: testWriteTo
[info] Test Passed: testWriteTo
[info] Test Starting: testValidBytes
[info] Test Passed: testValidBytes
[info] Test Starting: testValidBytesWithCompression
[info] Test Passed: testValidBytesWithCompression
[info] Test Starting: testIterator
[info] Test Passed: testIterator
[info] Test Starting: testOffsetAssignment
[info] Test Passed: testOffsetAssignment
[info] == core-kafka / kafka.message.ByteBufferMessageSetTest ==
[info] 
[info] == core-kafka / kafka.metrics.KafkaTimerTest ==
[info] Test Starting: testKafkaTimer(kafka.metrics.KafkaTimerTest)
[info] Test Passed: testKafkaTimer(kafka.metrics.KafkaTimerTest)
[info] == core-kafka / kafka.metrics.KafkaTimerTest ==
[info] 
[info] == core-kafka / kafka.consumer.TopicFilterTest ==
[info] Test Starting: testWhitelists
[info] Test Passed: testWhitelists
[info] Test Starting: testBlacklists
[info] Test Passed: testBlacklists
[info] == core-kafka / kafka.consumer.TopicFilterTest ==
[info] 
[info] == core-kafka / kafka.log.LogTest ==
[info] Test Starting: testTimeBasedLogRoll
[info] Test Passed: testTimeBasedLogRoll
[info] Test Starting: testSizeBasedLogRoll
[info] Test Passed: testSizeBasedLogRoll
[info] Test Starting: testLoadEmptyLog
[info] Test Passed: testLoadEmptyLog
[info] Test Starting: testAppendAndRead
[info] Test Passed: testAppendAndRead
[info] Test Starting: testReadOutOfRange
[info] Test Passed: testReadOutOfRange
[info] Test Starting: testLogRolls
[2012-10-10 22:33:14,799] WARN Session 0x13a4ccefc670007 for server null, unexpected error,
closing socket connection and attempting reconnect (org.apache.zookeeper.ClientCnxn:1188)
java.net.ConnectException: Connection refused
	at sun.nio.ch.SocketChannelImpl.checkConnect(Native Method)
	at sun.nio.ch.SocketChannelImpl.finishConnect(SocketChannelImpl.java:567)
	at org.apache.zookeeper.ClientCnxn$SendThread.run(ClientCnxn.java:1146)
[2012-10-10 22:33:14,862] WARN Session 0x13a4ccf44e40002 for server null, unexpected error,
closing socket connection and attempting reconnect (org.apache.zookeeper.ClientCnxn:1188)
java.net.ConnectException: Connection refused
	at sun.nio.ch.SocketChannelImpl.checkConnect(Native Method)
	at sun.nio.ch.SocketChannelImpl.finishConnect(SocketChannelImpl.java:567)
	at org.apache.zookeeper.ClientCnxn$SendThread.run(ClientCnxn.java:1146)
[info] Test Passed: testLogRolls
[info] Test Starting: testCompressedMessages
[info] Test Passed: testCompressedMessages
[info] Test Starting: testFindSegment
[info] Test Passed: testFindSegment
[info] Test Starting: testEdgeLogRollsStartingAtZero
[info] Test Passed: testEdgeLogRollsStartingAtZero
[info] Test Starting: testEdgeLogRollsStartingAtNonZero
[info] Test Passed: testEdgeLogRollsStartingAtNonZero
[info] Test Starting: testMessageSizeCheck
[info] Test Passed: testMessageSizeCheck
[info] Test Starting: testLogRecoversToCorrectOffset
[2012-10-10 22:33:16,140] WARN Session 0x13a4ccefc670007 for server null, unexpected error,
closing socket connection and attempting reconnect (org.apache.zookeeper.ClientCnxn:1188)
java.net.ConnectException: Connection refused
	at sun.nio.ch.SocketChannelImpl.checkConnect(Native Method)
	at sun.nio.ch.SocketChannelImpl.finishConnect(SocketChannelImpl.java:567)
	at org.apache.zookeeper.ClientCnxn$SendThread.run(ClientCnxn.java:1146)
[info] Test Passed: testLogRecoversToCorrectOffset
[info] Test Starting: testTruncateTo
[2012-10-10 22:33:16,346] ERROR [Kafka Log on Broker 0], Target offset 11 cannot be greater
than the last message offset 10 in the log /tmp/kafka-986068/00000000000000000000.log (kafka.log.Log:96)
[info] Test Passed: testTruncateTo
[info] Test Starting: testReopenThenTruncate
[2012-10-10 22:33:16,506] WARN Session 0x13a4ccf44e40002 for server null, unexpected error,
closing socket connection and attempting reconnect (org.apache.zookeeper.ClientCnxn:1188)
java.net.ConnectException: Connection refused
	at sun.nio.ch.SocketChannelImpl.checkConnect(Native Method)
	at sun.nio.ch.SocketChannelImpl.finishConnect(SocketChannelImpl.java:567)
	at org.apache.zookeeper.ClientCnxn$SendThread.run(ClientCnxn.java:1146)
[info] Test Passed: testReopenThenTruncate
[info] == core-kafka / kafka.log.LogTest ==
[info] 
[info] == core-kafka / kafka.server.RequestPurgatoryTest ==
[info] Test Starting: testRequestSatisfaction(kafka.server.RequestPurgatoryTest)
[info] Test Passed: testRequestSatisfaction(kafka.server.RequestPurgatoryTest)
[info] Test Starting: testRequestExpiry(kafka.server.RequestPurgatoryTest)
[info] Test Passed: testRequestExpiry(kafka.server.RequestPurgatoryTest)
[info] == core-kafka / kafka.server.RequestPurgatoryTest ==
[info] 
[info] == core-kafka / kafka.server.ServerShutdownTest ==
[info] Test Starting: testCleanShutdown(kafka.server.ServerShutdownTest)
[info] Test Passed: testCleanShutdown(kafka.server.ServerShutdownTest)
[info] == core-kafka / kafka.server.ServerShutdownTest ==
[info] 
[info] == core-kafka / kafka.server.HighwatermarkPersistenceTest ==
[info] Test Starting: testHighWatermarkPersistenceSinglePartition(kafka.server.HighwatermarkPersistenceTest)
[info] Test Passed: testHighWatermarkPersistenceSinglePartition(kafka.server.HighwatermarkPersistenceTest)
[info] Test Starting: testHighWatermarkPersistenceMultiplePartitions(kafka.server.HighwatermarkPersistenceTest)
[info] Test Passed: testHighWatermarkPersistenceMultiplePartitions(kafka.server.HighwatermarkPersistenceTest)
[info] == core-kafka / kafka.server.HighwatermarkPersistenceTest ==
[info] 
[info] == core-kafka / kafka.log4j.KafkaLog4jAppenderTest ==
[info] Test Starting: testKafkaLog4jConfigs(kafka.log4j.KafkaLog4jAppenderTest)
log4j:WARN No appenders could be found for logger (org.I0Itec.zkclient.ZkEventThread).
log4j:WARN Please initialize the log4j system properly.
[info] Test Passed: testKafkaLog4jConfigs(kafka.log4j.KafkaLog4jAppenderTest)
[info] Test Starting: testLog4jAppends(kafka.log4j.KafkaLog4jAppenderTest)
[info] Test Passed: testLog4jAppends(kafka.log4j.KafkaLog4jAppenderTest)
[info] == core-kafka / kafka.log4j.KafkaLog4jAppenderTest ==
[info] 
[info] == core-kafka / kafka.integration.AutoOffsetResetTest ==
[info] Test Starting: testResetToEarliestWhenOffsetTooHigh(kafka.integration.AutoOffsetResetTest)
[info] Test Passed: testResetToEarliestWhenOffsetTooHigh(kafka.integration.AutoOffsetResetTest)
[info] Test Starting: testResetToEarliestWhenOffsetTooLow(kafka.integration.AutoOffsetResetTest)
[info] Test Passed: testResetToEarliestWhenOffsetTooLow(kafka.integration.AutoOffsetResetTest)
[info] Test Starting: testResetToLatestWhenOffsetTooHigh(kafka.integration.AutoOffsetResetTest)
[info] Test Passed: testResetToLatestWhenOffsetTooHigh(kafka.integration.AutoOffsetResetTest)
[info] Test Starting: testResetToLatestWhenOffsetTooLow(kafka.integration.AutoOffsetResetTest)
[info] Test Passed: testResetToLatestWhenOffsetTooLow(kafka.integration.AutoOffsetResetTest)
[info] == core-kafka / kafka.integration.AutoOffsetResetTest ==
[info] 
[info] == core-kafka / kafka.zk.ZKEphemeralTest ==
[info] Test Starting: testEphemeralNodeCleanup(kafka.zk.ZKEphemeralTest)
[info] Test Passed: testEphemeralNodeCleanup(kafka.zk.ZKEphemeralTest)
[info] == core-kafka / kafka.zk.ZKEphemeralTest ==
[info] 
[info] == core-kafka / kafka.api.RequestResponseSerializationTest ==
[info] Test Starting: testSerializationAndDeserialization
[info] Test Passed: testSerializationAndDeserialization
[info] == core-kafka / kafka.api.RequestResponseSerializationTest ==
[info] 
[info] == core-kafka / kafka.utils.UtilsTest ==
[info] Test Starting: testSwallow
[info] Test Passed: testSwallow
[info] Test Starting: testCircularIterator
[info] Test Passed: testCircularIterator
[info] == core-kafka / kafka.utils.UtilsTest ==
[info] 
[info] == core-kafka / kafka.integration.PrimitiveApiTest ==
[info] Test Starting: testProduceAndMultiFetch(kafka.integration.PrimitiveApiTest)
[info] Test Passed: testProduceAndMultiFetch(kafka.integration.PrimitiveApiTest)
[info] Test Starting: testMultiProduce(kafka.integration.PrimitiveApiTest)
[info] Test Passed: testMultiProduce(kafka.integration.PrimitiveApiTest)
[info] Test Starting: testFetchRequestCanProperlySerialize(kafka.integration.PrimitiveApiTest)
[info] Test Passed: testFetchRequestCanProperlySerialize(kafka.integration.PrimitiveApiTest)
[info] Test Starting: testEmptyFetchRequest(kafka.integration.PrimitiveApiTest)
[info] Test Passed: testEmptyFetchRequest(kafka.integration.PrimitiveApiTest)
[info] Test Starting: testDefaultEncoderProducerAndFetch(kafka.integration.PrimitiveApiTest)
[info] Test Passed: testDefaultEncoderProducerAndFetch(kafka.integration.PrimitiveApiTest)
[info] Test Starting: testDefaultEncoderProducerAndFetchWithCompression(kafka.integration.PrimitiveApiTest)
[info] Test Passed: testDefaultEncoderProducerAndFetchWithCompression(kafka.integration.PrimitiveApiTest)
[info] Test Starting: testProduceAndMultiFetchWithCompression(kafka.integration.PrimitiveApiTest)
[info] Test Passed: testProduceAndMultiFetchWithCompression(kafka.integration.PrimitiveApiTest)
[info] Test Starting: testMultiProduceWithCompression(kafka.integration.PrimitiveApiTest)
[info] Test Passed: testMultiProduceWithCompression(kafka.integration.PrimitiveApiTest)
[info] Test Starting: testConsumerEmptyTopic(kafka.integration.PrimitiveApiTest)
[info] Test Passed: testConsumerEmptyTopic(kafka.integration.PrimitiveApiTest)
[info] == core-kafka / kafka.integration.PrimitiveApiTest ==
[info] 
[info] == core-kafka / Test cleanup 1 ==
[info] Deleting directory /tmp/sbt_4a40cbdb
[info] == core-kafka / Test cleanup 1 ==
[info] 
[info] == core-kafka / test-finish ==
[error] Failed: : Total 157, Failed 1, Errors 0, Passed 156, Skipped 0
[info] == core-kafka / test-finish ==
[info] 
[info] == core-kafka / test-cleanup ==
[info] == core-kafka / test-cleanup ==
[error] Error running kafka.server.LogRecoveryTest: Test FAILED
[error] Error running test: One or more subtasks failed
[info] 
[info] Total time: 217 s, completed Oct 10, 2012 10:33:39 PM
[info] 
[info] Total session time: 217 s, completed Oct 10, 2012 10:33:39 PM
[error] Error during build.
Build step 'Execute shell' marked build as failure

Mime
View raw message