kafka-commits mailing list archives

Site index · List index
Message view « Date » · « Thread »
Top « Date » · « Thread »
From Apache Jenkins Server <jenk...@builds.apache.org>
Subject Build failed in Jenkins: Kafka-0.8 #77
Date Fri, 12 Oct 2012 03:20:02 GMT
See <https://builds.apache.org/job/Kafka-0.8/77/changes>

Changes:

[nehanarkhede] KAFKA-432 allow consumer to read from followers; patched by Yang Ye; reviewed
by Neha and Jun

------------------------------------------
[...truncated 5272 lines...]
[info] 
[info] == core-kafka / kafka.metrics.KafkaTimerTest ==
[2012-10-12 03:20:22,609] ERROR Unable to open socket to localhost/127.0.0.1:2182 (org.apache.zookeeper.ClientCnxn:1076)
[2012-10-12 03:20:22,609] WARN Session 0x13a52fa5802000c for server null, unexpected error,
closing socket connection and attempting reconnect (org.apache.zookeeper.ClientCnxn:1188)
java.net.ConnectException: Connection refused
	at sun.nio.ch.Net.connect(Native Method)
	at sun.nio.ch.SocketChannelImpl.connect(SocketChannelImpl.java:507)
	at org.apache.zookeeper.ClientCnxn$SendThread.startConnect(ClientCnxn.java:1071)
	at org.apache.zookeeper.ClientCnxn$SendThread.run(ClientCnxn.java:1104)
[info] Test Starting: testKafkaTimer(kafka.metrics.KafkaTimerTest)
[info] Test Passed: testKafkaTimer(kafka.metrics.KafkaTimerTest)
[info] == core-kafka / kafka.metrics.KafkaTimerTest ==
[info] 
[info] == core-kafka / kafka.log.OffsetIndexTest ==
[info] Test Starting: truncate
[info] Test Passed: truncate
[info] Test Starting: randomLookupTest
[info] Test Passed: randomLookupTest
[info] Test Starting: lookupExtremeCases
[info] Test Passed: lookupExtremeCases
[info] Test Starting: appendTooMany
[info] Test Passed: appendTooMany
[info] Test Starting: appendOutOfOrder
[info] Test Passed: appendOutOfOrder
[info] Test Starting: testReopen
[info] Test Passed: testReopen
[info] == core-kafka / kafka.log.OffsetIndexTest ==
[info] 
[info] == core-kafka / kafka.network.SocketServerTest ==
[2012-10-12 03:20:22,805] ERROR Unable to open socket to localhost/127.0.0.1:2182 (org.apache.zookeeper.ClientCnxn:1076)
[2012-10-12 03:20:22,805] WARN Session 0x13a52fa58020008 for server null, unexpected error,
closing socket connection and attempting reconnect (org.apache.zookeeper.ClientCnxn:1188)
java.net.ConnectException: Connection refused
	at sun.nio.ch.Net.connect(Native Method)
	at sun.nio.ch.SocketChannelImpl.connect(SocketChannelImpl.java:507)
	at org.apache.zookeeper.ClientCnxn$SendThread.startConnect(ClientCnxn.java:1071)
	at org.apache.zookeeper.ClientCnxn$SendThread.run(ClientCnxn.java:1104)
[2012-10-12 03:20:22,839] ERROR Unable to open socket to localhost/127.0.0.1:2182 (org.apache.zookeeper.ClientCnxn:1076)
[2012-10-12 03:20:22,839] WARN Session 0x13a52fc9bc60002 for server null, unexpected error,
closing socket connection and attempting reconnect (org.apache.zookeeper.ClientCnxn:1188)
java.net.ConnectException: Connection refused
	at sun.nio.ch.Net.connect(Native Method)
	at sun.nio.ch.SocketChannelImpl.connect(SocketChannelImpl.java:507)
	at org.apache.zookeeper.ClientCnxn$SendThread.startConnect(ClientCnxn.java:1071)
	at org.apache.zookeeper.ClientCnxn$SendThread.run(ClientCnxn.java:1104)
[info] Test Starting: simpleRequest
[info] Test Passed: simpleRequest
[info] Test Starting: tooBigRequestIsRejected
[info] Test Passed: tooBigRequestIsRejected
[info] == core-kafka / kafka.network.SocketServerTest ==
[info] 
[info] == core-kafka / kafka.server.ReplicaFetchTest ==
[info] Test Starting: testReplicaFetcherThread(kafka.server.ReplicaFetchTest)
[2012-10-12 03:20:23,849] WARN EndOfStreamException: Unable to read additional data from client
sessionid 0x13a52fca64d0004, likely client has closed socket (org.apache.zookeeper.server.NIOServerCnxn:634)
[2012-10-12 03:20:24,079] WARN Exception causing close of session 0x13a52fc9d970002 due to
java.io.IOException: Connection reset by peer (org.apache.zookeeper.server.NIOServerCnxn:639)
[2012-10-12 03:20:24,279] WARN EndOfStreamException: Unable to read additional data from client
sessionid 0x13a52fca64d0002, likely client has closed socket (org.apache.zookeeper.server.NIOServerCnxn:634)
[2012-10-12 03:20:24,909] WARN EndOfStreamException: Unable to read additional data from client
sessionid 0x13a52fc9bc60002, likely client has closed socket (org.apache.zookeeper.server.NIOServerCnxn:634)
[2012-10-12 03:20:24,999] WARN EndOfStreamException: Unable to read additional data from client
sessionid 0x13a52fca64d0004, likely client has closed socket (org.apache.zookeeper.server.NIOServerCnxn:634)
[2012-10-12 03:20:25,509] WARN EndOfStreamException: Unable to read additional data from client
sessionid 0x13a52fca64d0002, likely client has closed socket (org.apache.zookeeper.server.NIOServerCnxn:634)
[2012-10-12 03:20:25,959] WARN Exception causing close of session 0x13a52fc9d970002 due to
java.io.IOException: Connection reset by peer (org.apache.zookeeper.server.NIOServerCnxn:639)
[2012-10-12 03:20:26,480] WARN Exception causing close of session 0x13a52fca64d0004 due to
java.io.IOException: Connection reset by peer (org.apache.zookeeper.server.NIOServerCnxn:639)
[2012-10-12 03:20:26,670] WARN Exception causing close of session 0x13a52fc9bc60002 due to
java.io.IOException: Connection reset by peer (org.apache.zookeeper.server.NIOServerCnxn:639)
[info] Test Passed: testReplicaFetcherThread(kafka.server.ReplicaFetchTest)
[info] == core-kafka / kafka.server.ReplicaFetchTest ==
[info] 
[info] == core-kafka / kafka.log.LogManagerTest ==
[info] Test Starting: testCreateLog(kafka.log.LogManagerTest)
[info] Test Passed: testCreateLog(kafka.log.LogManagerTest)
[info] Test Starting: testGetLog(kafka.log.LogManagerTest)
[info] Test Passed: testGetLog(kafka.log.LogManagerTest)
[info] Test Starting: testCleanupExpiredSegments(kafka.log.LogManagerTest)
[2012-10-12 03:20:26,879] ERROR Unable to open socket to localhost/127.0.0.1:2182 (org.apache.zookeeper.ClientCnxn:1076)
[2012-10-12 03:20:26,879] WARN Session 0x13a52fa58020007 for server null, unexpected error,
closing socket connection and attempting reconnect (org.apache.zookeeper.ClientCnxn:1188)
java.net.ConnectException: Connection refused
	at sun.nio.ch.Net.connect(Native Method)
	at sun.nio.ch.SocketChannelImpl.connect(SocketChannelImpl.java:507)
	at org.apache.zookeeper.ClientCnxn$SendThread.startConnect(ClientCnxn.java:1071)
	at org.apache.zookeeper.ClientCnxn$SendThread.run(ClientCnxn.java:1104)
[2012-10-12 03:20:26,899] ERROR Unable to open socket to localhost/127.0.0.1:2182 (org.apache.zookeeper.ClientCnxn:1076)
[2012-10-12 03:20:26,899] WARN Session 0x13a52fa5802000d for server null, unexpected error,
closing socket connection and attempting reconnect (org.apache.zookeeper.ClientCnxn:1188)
java.net.ConnectException: Connection refused
	at sun.nio.ch.Net.connect(Native Method)
	at sun.nio.ch.SocketChannelImpl.connect(SocketChannelImpl.java:507)
	at org.apache.zookeeper.ClientCnxn$SendThread.startConnect(ClientCnxn.java:1071)
	at org.apache.zookeeper.ClientCnxn$SendThread.run(ClientCnxn.java:1104)
[2012-10-12 03:20:26,989] ERROR Unable to open socket to localhost/127.0.0.1:2182 (org.apache.zookeeper.ClientCnxn:1076)
[2012-10-12 03:20:26,989] WARN Session 0x13a52fca64d0002 for server null, unexpected error,
closing socket connection and attempting reconnect (org.apache.zookeeper.ClientCnxn:1188)
java.net.ConnectException: Connection refused
	at sun.nio.ch.Net.connect(Native Method)
	at sun.nio.ch.SocketChannelImpl.connect(SocketChannelImpl.java:507)
	at org.apache.zookeeper.ClientCnxn$SendThread.startConnect(ClientCnxn.java:1071)
	at org.apache.zookeeper.ClientCnxn$SendThread.run(ClientCnxn.java:1104)
[info] Test Passed: testCleanupExpiredSegments(kafka.log.LogManagerTest)
[info] Test Starting: testCleanupSegmentsToMaintainSize(kafka.log.LogManagerTest)
[2012-10-12 03:20:27,069] ERROR Unable to open socket to localhost/127.0.0.1:2182 (org.apache.zookeeper.ClientCnxn:1076)
[2012-10-12 03:20:27,069] WARN Session 0x13a52fa58020004 for server null, unexpected error,
closing socket connection and attempting reconnect (org.apache.zookeeper.ClientCnxn:1188)
java.net.ConnectException: Connection refused
	at sun.nio.ch.Net.connect(Native Method)
	at sun.nio.ch.SocketChannelImpl.connect(SocketChannelImpl.java:507)
	at org.apache.zookeeper.ClientCnxn$SendThread.startConnect(ClientCnxn.java:1071)
	at org.apache.zookeeper.ClientCnxn$SendThread.run(ClientCnxn.java:1104)
[2012-10-12 03:20:27,209] ERROR Unable to open socket to localhost/127.0.0.1:2182 (org.apache.zookeeper.ClientCnxn:1076)
[2012-10-12 03:20:27,209] WARN Session 0x13a52fa58020005 for server null, unexpected error,
closing socket connection and attempting reconnect (org.apache.zookeeper.ClientCnxn:1188)
java.net.ConnectException: Connection refused
	at sun.nio.ch.Net.connect(Native Method)
	at sun.nio.ch.SocketChannelImpl.connect(SocketChannelImpl.java:507)
	at org.apache.zookeeper.ClientCnxn$SendThread.startConnect(ClientCnxn.java:1071)
	at org.apache.zookeeper.ClientCnxn$SendThread.run(ClientCnxn.java:1104)
[2012-10-12 03:20:27,219] ERROR Unable to open socket to localhost/127.0.0.1:2182 (org.apache.zookeeper.ClientCnxn:1076)
[2012-10-12 03:20:27,219] WARN Session 0x13a52fc9d970002 for server null, unexpected error,
closing socket connection and attempting reconnect (org.apache.zookeeper.ClientCnxn:1188)
java.net.ConnectException: Connection refused
	at sun.nio.ch.Net.connect(Native Method)
	at sun.nio.ch.SocketChannelImpl.connect(SocketChannelImpl.java:507)
	at org.apache.zookeeper.ClientCnxn$SendThread.startConnect(ClientCnxn.java:1071)
	at org.apache.zookeeper.ClientCnxn$SendThread.run(ClientCnxn.java:1104)
[2012-10-12 03:20:27,289] ERROR Unable to open socket to localhost/127.0.0.1:2182 (org.apache.zookeeper.ClientCnxn:1076)
[2012-10-12 03:20:27,289] WARN Session 0x13a52fa58020009 for server null, unexpected error,
closing socket connection and attempting reconnect (org.apache.zookeeper.ClientCnxn:1188)
java.net.ConnectException: Connection refused
	at sun.nio.ch.Net.connect(Native Method)
	at sun.nio.ch.SocketChannelImpl.connect(SocketChannelImpl.java:507)
	at org.apache.zookeeper.ClientCnxn$SendThread.startConnect(ClientCnxn.java:1071)
	at org.apache.zookeeper.ClientCnxn$SendThread.run(ClientCnxn.java:1104)
[info] Test Passed: testCleanupSegmentsToMaintainSize(kafka.log.LogManagerTest)
[info] Test Starting: testTimeBasedFlush(kafka.log.LogManagerTest)
now = 1350012027715 last flush = 1350012027705
[error] Test Failed: testTimeBasedFlush(kafka.log.LogManagerTest)
junit.framework.AssertionFailedError: The last flush time has to be within defaultflushInterval
of current time 
	at junit.framework.Assert.fail(Assert.java:47)
	at junit.framework.Assert.assertTrue(Assert.java:20)
	at kafka.log.LogManagerTest.testTimeBasedFlush(LogManagerTest.scala:172)
	at sun.reflect.NativeMethodAccessorImpl.invoke0(Native Method)
	at sun.reflect.NativeMethodAccessorImpl.invoke(NativeMethodAccessorImpl.java:39)
	at sun.reflect.DelegatingMethodAccessorImpl.invoke(DelegatingMethodAccessorImpl.java:25)
	at java.lang.reflect.Method.invoke(Method.java:597)
	at junit.framework.TestCase.runTest(TestCase.java:164)
	at junit.framework.TestCase.runBare(TestCase.java:130)
	at junit.framework.TestResult$1.protect(TestResult.java:110)
	at junit.framework.TestResult.runProtected(TestResult.java:128)
	at junit.framework.TestResult.run(TestResult.java:113)
	at junit.framework.TestCase.run(TestCase.java:120)
	at junit.framework.TestSuite.runTest(TestSuite.java:228)
	at junit.framework.TestSuite.run(TestSuite.java:223)
	at junit.framework.TestSuite.runTest(TestSuite.java:228)
	at junit.framework.TestSuite.run(TestSuite.java:223)
	at org.scalatest.junit.JUnit3Suite.run(JUnit3Suite.scala:309)
	at org.scalatest.tools.ScalaTestFramework$ScalaTestRunner.run(ScalaTestFramework.scala:40)
	at sbt.TestRunner.run(TestFramework.scala:53)
	at sbt.TestRunner.runTest$1(TestFramework.scala:67)
	at sbt.TestRunner.run(TestFramework.scala:76)
	at sbt.TestFramework$$anonfun$10$$anonfun$apply$11.runTest$2(TestFramework.scala:194)
	at sbt.TestFramework$$anonfun$10$$anonfun$apply$11$$anonfun$apply$12.apply(TestFramework.scala:205)
	at sbt.TestFramework$$anonfun$10$$anonfun$apply$11$$anonfun$apply$12.apply(TestFramework.scala:205)
	at sbt.NamedTestTask.run(TestFramework.scala:92)
	at sbt.ScalaProject$$anonfun$sbt$ScalaProject$$toTask$1.apply(ScalaProject.scala:193)
	at sbt.ScalaProject$$anonfun$sbt$ScalaProject$$toTask$1.apply(ScalaProject.scala:193)
	at sbt.TaskManager$Task.invoke(TaskManager.scala:62)
	at sbt.impl.RunTask.doRun$1(RunTask.scala:77)
	at sbt.impl.RunTask.runTask(RunTask.scala:85)
	at sbt.impl.RunTask.sbt$impl$RunTask$$runIfNotRoot(RunTask.scala:60)
	at sbt.impl.RunTask$$anonfun$runTasksExceptRoot$2.apply(RunTask.scala:48)
	at sbt.impl.RunTask$$anonfun$runTasksExceptRoot$2.apply(RunTask.scala:48)
	at sbt.Distributor$Run$Worker$$anonfun$2.apply(ParallelRunner.scala:131)
	at sbt.Distributor$Run$Worker$$anonfun$2.apply(ParallelRunner.scala:131)
	at sbt.Control$.trapUnit(Control.scala:19)
	at sbt.Distributor$Run$Worker.run(ParallelRunner.scala:131)
[info] == core-kafka / kafka.log.LogManagerTest ==
[info] 
[info] == core-kafka / kafka.zk.ZKEphemeralTest ==
[info] Test Starting: testEphemeralNodeCleanup(kafka.zk.ZKEphemeralTest)
[info] Test Passed: testEphemeralNodeCleanup(kafka.zk.ZKEphemeralTest)
[info] == core-kafka / kafka.zk.ZKEphemeralTest ==
[info] 
[info] == core-kafka / kafka.server.LeaderElectionTest ==
[info] Test Starting: testLeaderElectionAndEpoch(kafka.server.LeaderElectionTest)
[2012-10-12 03:20:28,290] WARN Exception causing close of session 0x13a52fca64d0004 due to
java.io.IOException: Connection reset by peer (org.apache.zookeeper.server.NIOServerCnxn:639)
[2012-10-12 03:20:29,520] WARN Exception causing close of session 0x13a52fca64d0004 due to
java.io.IOException: Connection reset by peer (org.apache.zookeeper.server.NIOServerCnxn:639)
[2012-10-12 03:20:29,770] WARN Exception causing close of session 0x13a52fcc3e70002 due to
java.io.IOException: Connection reset by peer (org.apache.zookeeper.server.NIOServerCnxn:639)
[2012-10-12 03:20:30,210] WARN Exception causing close of session 0x13a52fc9bc60002 due to
java.io.IOException: Connection reset by peer (org.apache.zookeeper.server.NIOServerCnxn:639)
[2012-10-12 03:20:30,829] WARN EndOfStreamException: Unable to read additional data from client
sessionid 0x13a52fc9d970002, likely client has closed socket (org.apache.zookeeper.server.NIOServerCnxn:634)
[2012-10-12 03:20:30,949] WARN EndOfStreamException: Unable to read additional data from client
sessionid 0x13a52fca64d0004, likely client has closed socket (org.apache.zookeeper.server.NIOServerCnxn:634)
[2012-10-12 03:20:31,500] WARN EndOfStreamException: Unable to read additional data from client
sessionid 0x13a52fca64d0002, likely client has closed socket (org.apache.zookeeper.server.NIOServerCnxn:634)
[2012-10-12 03:20:31,620] WARN EndOfStreamException: Unable to read additional data from client
sessionid 0x13a52fcc3e70002, likely client has closed socket (org.apache.zookeeper.server.NIOServerCnxn:634)
[info] Test Passed: testLeaderElectionAndEpoch(kafka.server.LeaderElectionTest)
[info] == core-kafka / kafka.server.LeaderElectionTest ==
[info] 
[info] == core-kafka / kafka.log4j.KafkaLog4jAppenderTest ==
[info] Test Starting: testKafkaLog4jConfigs(kafka.log4j.KafkaLog4jAppenderTest)
[2012-10-12 03:20:32,209] WARN Exception causing close of session 0x13a52fca64d0004 due to
java.io.IOException: Connection reset by peer (org.apache.zookeeper.server.NIOServerCnxn:639)
log4j:WARN No appenders could be found for logger (org.I0Itec.zkclient.ZkEventThread).
log4j:WARN Please initialize the log4j system properly.
[info] Test Passed: testKafkaLog4jConfigs(kafka.log4j.KafkaLog4jAppenderTest)
[info] Test Starting: testLog4jAppends(kafka.log4j.KafkaLog4jAppenderTest)
[info] Test Passed: testLog4jAppends(kafka.log4j.KafkaLog4jAppenderTest)
[info] == core-kafka / kafka.log4j.KafkaLog4jAppenderTest ==
[info] 
[info] == core-kafka / kafka.producer.SyncProducerTest ==
[info] Test Starting: testReachableServer(kafka.producer.SyncProducerTest)
[info] Test Passed: testReachableServer(kafka.producer.SyncProducerTest)
[info] Test Starting: testEmptyProduceRequest(kafka.producer.SyncProducerTest)
[info] Test Passed: testEmptyProduceRequest(kafka.producer.SyncProducerTest)
[info] Test Starting: testMessageSizeTooLarge(kafka.producer.SyncProducerTest)
[info] Test Passed: testMessageSizeTooLarge(kafka.producer.SyncProducerTest)
[info] Test Starting: testProduceCorrectlyReceivesResponse(kafka.producer.SyncProducerTest)
[info] Test Passed: testProduceCorrectlyReceivesResponse(kafka.producer.SyncProducerTest)
[info] Test Starting: testProducerCanTimeout(kafka.producer.SyncProducerTest)
[info] Test Passed: testProducerCanTimeout(kafka.producer.SyncProducerTest)
[info] == core-kafka / kafka.producer.SyncProducerTest ==
[info] 
[info] == core-kafka / kafka.log.FileMessageSetTest ==
[info] Test Starting: testWrittenEqualsRead
[info] Test Passed: testWrittenEqualsRead
[info] Test Starting: testIteratorIsConsistent
[info] Test Passed: testIteratorIsConsistent
[info] Test Starting: testSizeInBytes
[info] Test Passed: testSizeInBytes
[info] Test Starting: testWriteTo
[info] Test Passed: testWriteTo
[info] Test Starting: testFileSize
[info] Test Passed: testFileSize
[info] Test Starting: testIterationOverPartialAndTruncation
[info] Test Passed: testIterationOverPartialAndTruncation
[info] Test Starting: testIterationDoesntChangePosition
[info] Test Passed: testIterationDoesntChangePosition
[info] Test Starting: testRead
[info] Test Passed: testRead
[info] Test Starting: testSearch
[info] Test Passed: testSearch
[info] == core-kafka / kafka.log.FileMessageSetTest ==
[info] 
[info] == core-kafka / test-finish ==
[error] Failed: : Total 158, Failed 3, Errors 0, Passed 155, Skipped 0
[info] == core-kafka / test-finish ==
[info] 
[info] == core-kafka / Test cleanup 1 ==
[info] Deleting directory /var/tmp/sbt_ca5a0270
[info] == core-kafka / Test cleanup 1 ==
[info] 
[info] == core-kafka / test-cleanup ==
[info] == core-kafka / test-cleanup ==
[info] 
[info] == hadoop consumer / copy-resources ==
[info] == hadoop consumer / copy-resources ==
[error] Error running kafka.admin.AdminTest: Test FAILED
[error] Error running kafka.log.LogManagerTest: Test FAILED
[error] Error running test: One or more subtasks failed
[info] 
[info] Total time: 275 s, completed Oct 12, 2012 3:20:35 AM
[info] 
[info] Total session time: 276 s, completed Oct 12, 2012 3:20:35 AM
[error] Error during build.
Build step 'Execute shell' marked build as failure

Mime
View raw message