kafka-commits mailing list archives

Site index · List index
Message view « Date » · « Thread »
Top « Date » · « Thread »
From Apache Jenkins Server <jenk...@builds.apache.org>
Subject Build failed in Jenkins: Kafka-0.8 #95
Date Tue, 30 Oct 2012 03:33:54 GMT
See <https://builds.apache.org/job/Kafka-0.8/95/changes>

Changes:

[junrao] Register metrics beans at kafka server startup; patched by Swapnil Ghike; reviewed
by Jun Rao; KAFKA-592

[junrao] Partition.makeFollower() reads broker info from ZK; patched by Swapnil Ghike; reviewed
by Jun Rao; KAFKA-575

------------------------------------------
[...truncated 7577 lines...]
[info] 
[info] == core-kafka / kafka.message.ByteBufferMessageSetTest ==
[info] Test Starting: testWrittenEqualsRead
[info] Test Passed: testWrittenEqualsRead
[info] Test Starting: testIteratorIsConsistent
[info] Test Passed: testIteratorIsConsistent
[info] Test Starting: testSizeInBytes
[info] Test Passed: testSizeInBytes
[info] Test Starting: testWriteTo
[info] Test Passed: testWriteTo
[info] Test Starting: testValidBytes
[info] Test Passed: testValidBytes
[info] Test Starting: testValidBytesWithCompression
[info] Test Passed: testValidBytesWithCompression
[info] Test Starting: testEquals
[info] Test Passed: testEquals
[info] Test Starting: testIterator
[info] Test Passed: testIterator
[info] Test Starting: testOffsetAssignment
[info] Test Passed: testOffsetAssignment
[info] == core-kafka / kafka.message.ByteBufferMessageSetTest ==
[info] 
[info] == core-kafka / kafka.log.LogManagerTest ==
[info] Test Starting: testCreateLog(kafka.log.LogManagerTest)
[info] Test Passed: testCreateLog(kafka.log.LogManagerTest)
[info] Test Starting: testGetLog(kafka.log.LogManagerTest)
[info] Test Passed: testGetLog(kafka.log.LogManagerTest)
[info] Test Starting: testCleanupExpiredSegments(kafka.log.LogManagerTest)
[info] Test Passed: testCleanupExpiredSegments(kafka.log.LogManagerTest)
[info] Test Starting: testCleanupSegmentsToMaintainSize(kafka.log.LogManagerTest)
[info] Test Passed: testCleanupSegmentsToMaintainSize(kafka.log.LogManagerTest)
[info] Test Starting: testTimeBasedFlush(kafka.log.LogManagerTest)
now = 1351568019351 last flush = 1351568019303
[error] Test Failed: testTimeBasedFlush(kafka.log.LogManagerTest)
junit.framework.AssertionFailedError: The last flush time has to be within defaultflushInterval
of current time 
	at junit.framework.Assert.fail(Assert.java:47)
	at junit.framework.Assert.assertTrue(Assert.java:20)
	at kafka.log.LogManagerTest.testTimeBasedFlush(LogManagerTest.scala:170)
	at sun.reflect.NativeMethodAccessorImpl.invoke0(Native Method)
	at sun.reflect.NativeMethodAccessorImpl.invoke(NativeMethodAccessorImpl.java:39)
	at sun.reflect.DelegatingMethodAccessorImpl.invoke(DelegatingMethodAccessorImpl.java:25)
	at java.lang.reflect.Method.invoke(Method.java:597)
	at junit.framework.TestCase.runTest(TestCase.java:164)
	at junit.framework.TestCase.runBare(TestCase.java:130)
	at junit.framework.TestResult$1.protect(TestResult.java:110)
	at junit.framework.TestResult.runProtected(TestResult.java:128)
	at junit.framework.TestResult.run(TestResult.java:113)
	at junit.framework.TestCase.run(TestCase.java:120)
	at junit.framework.TestSuite.runTest(TestSuite.java:228)
	at junit.framework.TestSuite.run(TestSuite.java:223)
	at junit.framework.TestSuite.runTest(TestSuite.java:228)
	at junit.framework.TestSuite.run(TestSuite.java:223)
	at org.scalatest.junit.JUnit3Suite.run(JUnit3Suite.scala:309)
	at org.scalatest.tools.ScalaTestFramework$ScalaTestRunner.run(ScalaTestFramework.scala:40)
	at sbt.TestRunner.run(TestFramework.scala:53)
	at sbt.TestRunner.runTest$1(TestFramework.scala:67)
	at sbt.TestRunner.run(TestFramework.scala:76)
	at sbt.TestFramework$$anonfun$10$$anonfun$apply$11.runTest$2(TestFramework.scala:194)
	at sbt.TestFramework$$anonfun$10$$anonfun$apply$11$$anonfun$apply$12.apply(TestFramework.scala:205)
	at sbt.TestFramework$$anonfun$10$$anonfun$apply$11$$anonfun$apply$12.apply(TestFramework.scala:205)
	at sbt.NamedTestTask.run(TestFramework.scala:92)
	at sbt.ScalaProject$$anonfun$sbt$ScalaProject$$toTask$1.apply(ScalaProject.scala:193)
	at sbt.ScalaProject$$anonfun$sbt$ScalaProject$$toTask$1.apply(ScalaProject.scala:193)
	at sbt.TaskManager$Task.invoke(TaskManager.scala:62)
	at sbt.impl.RunTask.doRun$1(RunTask.scala:77)
	at sbt.impl.RunTask.runTask(RunTask.scala:85)
	at sbt.impl.RunTask.sbt$impl$RunTask$$runIfNotRoot(RunTask.scala:60)
	at sbt.impl.RunTask$$anonfun$runTasksExceptRoot$2.apply(RunTask.scala:48)
	at sbt.impl.RunTask$$anonfun$runTasksExceptRoot$2.apply(RunTask.scala:48)
	at sbt.Distributor$Run$Worker$$anonfun$2.apply(ParallelRunner.scala:131)
	at sbt.Distributor$Run$Worker$$anonfun$2.apply(ParallelRunner.scala:131)
	at sbt.Control$.trapUnit(Control.scala:19)
	at sbt.Distributor$Run$Worker.run(ParallelRunner.scala:131)
[info] == core-kafka / kafka.log.LogManagerTest ==
[info] 
[info] == core-kafka / kafka.integration.TopicMetadataTest ==
[info] Test Starting: testTopicMetadataRequest(kafka.integration.TopicMetadataTest)
[info] Test Passed: testTopicMetadataRequest(kafka.integration.TopicMetadataTest)
[info] Test Starting: testBasicTopicMetadata(kafka.integration.TopicMetadataTest)
[info] Test Passed: testBasicTopicMetadata(kafka.integration.TopicMetadataTest)
[info] Test Starting: testAutoCreateTopic(kafka.integration.TopicMetadataTest)
[info] Test Passed: testAutoCreateTopic(kafka.integration.TopicMetadataTest)
[info] == core-kafka / kafka.integration.TopicMetadataTest ==
[info] 
[info] == core-kafka / kafka.server.LeaderElectionTest ==
[info] Test Starting: testLeaderElectionAndEpoch(kafka.server.LeaderElectionTest)
[info] Test Passed: testLeaderElectionAndEpoch(kafka.server.LeaderElectionTest)
[info] == core-kafka / kafka.server.LeaderElectionTest ==
[info] 
[info] == core-kafka / kafka.log.LogOffsetTest ==
[info] Test Starting: testGetOffsetsForUnknownTopic(kafka.log.LogOffsetTest)
[info] Test Passed: testGetOffsetsForUnknownTopic(kafka.log.LogOffsetTest)
[info] Test Starting: testGetOffsetsBeforeLatestTime(kafka.log.LogOffsetTest)
[info] Test Passed: testGetOffsetsBeforeLatestTime(kafka.log.LogOffsetTest)
[info] Test Starting: testEmptyLogsGetOffsets(kafka.log.LogOffsetTest)
[info] Test Passed: testEmptyLogsGetOffsets(kafka.log.LogOffsetTest)
[info] Test Starting: testGetOffsetsBeforeNow(kafka.log.LogOffsetTest)
[info] Test Passed: testGetOffsetsBeforeNow(kafka.log.LogOffsetTest)
[info] Test Starting: testGetOffsetsBeforeEarliestTime(kafka.log.LogOffsetTest)
[info] Test Passed: testGetOffsetsBeforeEarliestTime(kafka.log.LogOffsetTest)
[info] == core-kafka / kafka.log.LogOffsetTest ==
[info] 
[info] == core-kafka / kafka.server.HighwatermarkPersistenceTest ==
[info] Test Starting: testHighWatermarkPersistenceSinglePartition(kafka.server.HighwatermarkPersistenceTest)
[info] Test Passed: testHighWatermarkPersistenceSinglePartition(kafka.server.HighwatermarkPersistenceTest)
[info] Test Starting: testHighWatermarkPersistenceMultiplePartitions(kafka.server.HighwatermarkPersistenceTest)
[info] Test Passed: testHighWatermarkPersistenceMultiplePartitions(kafka.server.HighwatermarkPersistenceTest)
[info] == core-kafka / kafka.server.HighwatermarkPersistenceTest ==
[info] 
[info] == core-kafka / kafka.javaapi.message.ByteBufferMessageSetTest ==
[info] Test Starting: testWrittenEqualsRead
[info] Test Passed: testWrittenEqualsRead
[info] Test Starting: testIteratorIsConsistent
[info] Test Passed: testIteratorIsConsistent
[info] Test Starting: testSizeInBytes
[info] Test Passed: testSizeInBytes
[info] Test Starting: testEquals
[info] Test Passed: testEquals
[info] Test Starting: testIteratorIsConsistentWithCompression
[info] Test Passed: testIteratorIsConsistentWithCompression
[info] Test Starting: testSizeInBytesWithCompression
[info] Test Passed: testSizeInBytesWithCompression
[info] Test Starting: testEqualsWithCompression
[info] Test Passed: testEqualsWithCompression
[info] == core-kafka / kafka.javaapi.message.ByteBufferMessageSetTest ==
[info] 
[info] == core-kafka / kafka.server.SimpleFetchTest ==
[info] Test Starting: testNonReplicaSeesHwWhenFetching(kafka.server.SimpleFetchTest)
[info] Test Passed: testNonReplicaSeesHwWhenFetching(kafka.server.SimpleFetchTest)
[info] Test Starting: testReplicaSeesLeoWhenFetching(kafka.server.SimpleFetchTest)
[info] Test Passed: testReplicaSeesLeoWhenFetching(kafka.server.SimpleFetchTest)
[info] == core-kafka / kafka.server.SimpleFetchTest ==
[info] 
[info] == core-kafka / kafka.log.OffsetIndexTest ==
[info] Test Starting: truncate
[info] Test Passed: truncate
[info] Test Starting: randomLookupTest
[info] Test Passed: randomLookupTest
[info] Test Starting: lookupExtremeCases
[info] Test Passed: lookupExtremeCases
[info] Test Starting: appendTooMany
[info] Test Passed: appendTooMany
[info] Test Starting: appendOutOfOrder
[info] Test Passed: appendOutOfOrder
[info] Test Starting: testReopen
[info] Test Passed: testReopen
[info] == core-kafka / kafka.log.OffsetIndexTest ==
[info] 
[info] == core-kafka / kafka.log.SegmentListTest ==
[info] Test Starting: testAppend
[info] Test Passed: testAppend
[info] Test Starting: testTrunc
[info] Test Passed: testTrunc
[info] Test Starting: testTruncLast
[info] Test Passed: testTruncLast
[info] == core-kafka / kafka.log.SegmentListTest ==
[info] 
[info] == core-kafka / kafka.integration.FetcherTest ==
[info] Test Starting: testFetcher(kafka.integration.FetcherTest)
[info] Test Passed: testFetcher(kafka.integration.FetcherTest)
[info] == core-kafka / kafka.integration.FetcherTest ==
[info] 
[info] == core-kafka / kafka.producer.SyncProducerTest ==
[info] Test Starting: testReachableServer(kafka.producer.SyncProducerTest)
[info] Test Passed: testReachableServer(kafka.producer.SyncProducerTest)
[info] Test Starting: testEmptyProduceRequest(kafka.producer.SyncProducerTest)
[info] Test Passed: testEmptyProduceRequest(kafka.producer.SyncProducerTest)
[info] Test Starting: testMessageSizeTooLarge(kafka.producer.SyncProducerTest)
[info] Test Passed: testMessageSizeTooLarge(kafka.producer.SyncProducerTest)
[info] Test Starting: testProduceCorrectlyReceivesResponse(kafka.producer.SyncProducerTest)
[info] Test Passed: testProduceCorrectlyReceivesResponse(kafka.producer.SyncProducerTest)
[info] Test Starting: testProducerCanTimeout(kafka.producer.SyncProducerTest)
[info] Test Passed: testProducerCanTimeout(kafka.producer.SyncProducerTest)
[info] == core-kafka / kafka.producer.SyncProducerTest ==
[info] 
[info] == core-kafka / kafka.message.MessageTest ==
[info] Test Starting: testFieldValues
[info] Test Passed: testFieldValues
[info] Test Starting: testChecksum
[info] Test Passed: testChecksum
[info] Test Starting: testEquality
[info] Test Passed: testEquality
[info] Test Starting: testIsHashable
[info] Test Passed: testIsHashable
[info] == core-kafka / kafka.message.MessageTest ==
[info] 
[info] == core-kafka / test-finish ==
[error] Failed: : Total 160, Failed 7, Errors 0, Passed 153, Skipped 0
[info] == core-kafka / test-finish ==
[info] 
[info] == core-kafka / Test cleanup 1 ==
[info] Deleting directory /var/tmp/sbt_eeab8743
[info] == core-kafka / Test cleanup 1 ==
[info] 
[info] == core-kafka / test-cleanup ==
[info] == core-kafka / test-cleanup ==
[info] 
[info] == hadoop producer / copy-test-resources ==
[info] == hadoop producer / copy-test-resources ==
[info] 
[info] == hadoop producer / test-compile ==
[info]   Source analysis: 0 new/modified, 0 indirectly invalidated, 0 removed.
[info] Compiling test sources...
[info] Nothing to compile.
[info]   Post-analysis: 0 classes.
[info] == hadoop producer / test-compile ==
[info] 
[info] == java-examples / test-compile ==
[info]   Source analysis: 0 new/modified, 0 indirectly invalidated, 0 removed.
[info] Compiling test sources...
[info] Nothing to compile.
[info]   Post-analysis: 0 classes.
[info] == java-examples / test-compile ==
[info] 
[info] == perf / copy-resources ==
[info] == perf / copy-resources ==
[info] 
[info] == perf / test-compile ==
[info]   Source analysis: 0 new/modified, 0 indirectly invalidated, 0 removed.
[info] Compiling test sources...
[info] Nothing to compile.
[info]   Post-analysis: 0 classes.
[info] == perf / test-compile ==
[info] 
[info] == hadoop producer / copy-resources ==
[info] == hadoop producer / copy-resources ==
[info] 
[info] == perf / copy-test-resources ==
[info] == perf / copy-test-resources ==
[info] 
[info] == hadoop consumer / copy-resources ==
[info] == hadoop consumer / copy-resources ==
[info] 
[info] == hadoop consumer / test-compile ==
[info]   Source analysis: 0 new/modified, 0 indirectly invalidated, 0 removed.
[info] Compiling test sources...
[info] Nothing to compile.
[info]   Post-analysis: 0 classes.
[info] == hadoop consumer / test-compile ==
[error] Error running kafka.producer.AsyncProducerTest: Test FAILED
[error] Error running kafka.admin.AdminTest: Test FAILED
[error] Error running kafka.log.LogManagerTest: Test FAILED
[error] Error running test: One or more subtasks failed
[info] 
[info] Total time: 942 s, completed Oct 30, 2012 3:34:38 AM
[info] 
[info] Total session time: 945 s, completed Oct 30, 2012 3:34:38 AM
[error] Error during build.
Build step 'Execute shell' marked build as failure

Mime
View raw message