kafka-commits mailing list archives

Site index · List index
Message view « Date » · « Thread »
Top « Date » · « Thread »
From Apache Jenkins Server <jenk...@builds.apache.org>
Subject Build failed in Jenkins: Kafka-0.8 #82
Date Sat, 13 Oct 2012 04:08:33 GMT
See <https://builds.apache.org/job/Kafka-0.8/82/changes>

Changes:

[jkreps] KAFKA-569 Split up utils package and do some cleanup. Patch reviewed by Neha.

------------------------------------------
[...truncated 1565 lines...]
[info] == core-kafka / kafka.integration.PrimitiveApiTest ==
[info] 
[info] == core-kafka / kafka.message.MessageCompressionTest ==
[info] Test Starting: testSimpleCompressDecompress
[info] Test Passed: testSimpleCompressDecompress
[info] Test Starting: testComplexCompressDecompress
[info] Test Passed: testComplexCompressDecompress
[info] == core-kafka / kafka.message.MessageCompressionTest ==
[info] 
[info] == core-kafka / kafka.utils.UtilsTest ==
[info] Test Starting: testSwallow
[info] Test Passed: testSwallow
[info] Test Starting: testCircularIterator
[info] Test Passed: testCircularIterator
[info] == core-kafka / kafka.utils.UtilsTest ==
[info] 
[info] == core-kafka / kafka.integration.TopicMetadataTest ==
[info] Test Starting: testTopicMetadataRequest(kafka.integration.TopicMetadataTest)
[info] Test Passed: testTopicMetadataRequest(kafka.integration.TopicMetadataTest)
[info] Test Starting: testBasicTopicMetadata(kafka.integration.TopicMetadataTest)
[info] Test Passed: testBasicTopicMetadata(kafka.integration.TopicMetadataTest)
[info] Test Starting: testAutoCreateTopic(kafka.integration.TopicMetadataTest)
[info] Test Passed: testAutoCreateTopic(kafka.integration.TopicMetadataTest)
[info] == core-kafka / kafka.integration.TopicMetadataTest ==
[info] 
[info] == core-kafka / kafka.consumer.ZookeeperConsumerConnectorTest ==
[info] Test Starting: testBasic(kafka.consumer.ZookeeperConsumerConnectorTest)
[error] Test Failed: testBasic(kafka.consumer.ZookeeperConsumerConnectorTest)
org.I0Itec.zkclient.exception.ZkTimeoutException: Unable to connect to zookeeper server within
timeout: 400
	at org.I0Itec.zkclient.ZkClient.connect(ZkClient.java:876)
	at org.I0Itec.zkclient.ZkClient.<init>(ZkClient.java:98)
	at org.I0Itec.zkclient.ZkClient.<init>(ZkClient.java:84)
	at kafka.consumer.ZookeeperConsumerConnector.connectZk(ZookeeperConsumerConnector.scala:143)
	at kafka.consumer.ZookeeperConsumerConnector.<init>(ZookeeperConsumerConnector.scala:112)
	at kafka.consumer.ZookeeperConsumerConnectorTest.testBasic(ZookeeperConsumerConnectorTest.scala:103)
	at sun.reflect.NativeMethodAccessorImpl.invoke0(Native Method)
	at sun.reflect.NativeMethodAccessorImpl.invoke(NativeMethodAccessorImpl.java:39)
	at sun.reflect.DelegatingMethodAccessorImpl.invoke(DelegatingMethodAccessorImpl.java:25)
	at java.lang.reflect.Method.invoke(Method.java:597)
	at junit.framework.TestCase.runTest(TestCase.java:164)
	at junit.framework.TestCase.runBare(TestCase.java:130)
	at junit.framework.TestResult$1.protect(TestResult.java:110)
	at junit.framework.TestResult.runProtected(TestResult.java:128)
	at junit.framework.TestResult.run(TestResult.java:113)
	at junit.framework.TestCase.run(TestCase.java:120)
	at junit.framework.TestSuite.runTest(TestSuite.java:228)
	at junit.framework.TestSuite.run(TestSuite.java:223)
	at junit.framework.TestSuite.runTest(TestSuite.java:228)
	at junit.framework.TestSuite.run(TestSuite.java:223)
	at org.scalatest.junit.JUnit3Suite.run(JUnit3Suite.scala:309)
	at org.scalatest.tools.ScalaTestFramework$ScalaTestRunner.run(ScalaTestFramework.scala:40)
	at sbt.TestRunner.run(TestFramework.scala:53)
	at sbt.TestRunner.runTest$1(TestFramework.scala:67)
	at sbt.TestRunner.run(TestFramework.scala:76)
	at sbt.TestFramework$$anonfun$10$$anonfun$apply$11.runTest$2(TestFramework.scala:194)
	at sbt.TestFramework$$anonfun$10$$anonfun$apply$11$$anonfun$apply$12.apply(TestFramework.scala:205)
	at sbt.TestFramework$$anonfun$10$$anonfun$apply$11$$anonfun$apply$12.apply(TestFramework.scala:205)
	at sbt.NamedTestTask.run(TestFramework.scala:92)
	at sbt.ScalaProject$$anonfun$sbt$ScalaProject$$toTask$1.apply(ScalaProject.scala:193)
	at sbt.ScalaProject$$anonfun$sbt$ScalaProject$$toTask$1.apply(ScalaProject.scala:193)
	at sbt.TaskManager$Task.invoke(TaskManager.scala:62)
	at sbt.impl.RunTask.doRun$1(RunTask.scala:77)
	at sbt.impl.RunTask.runTask(RunTask.scala:85)
	at sbt.impl.RunTask.sbt$impl$RunTask$$runIfNotRoot(RunTask.scala:60)
	at sbt.impl.RunTask$$anonfun$runTasksExceptRoot$2.apply(RunTask.scala:48)
	at sbt.impl.RunTask$$anonfun$runTasksExceptRoot$2.apply(RunTask.scala:48)
	at sbt.Distributor$Run$Worker$$anonfun$2.apply(ParallelRunner.scala:131)
	at sbt.Distributor$Run$Worker$$anonfun$2.apply(ParallelRunner.scala:131)
	at sbt.Control$.trapUnit(Control.scala:19)
	at sbt.Distributor$Run$Worker.run(ParallelRunner.scala:131)
[info] Test Starting: testCompression(kafka.consumer.ZookeeperConsumerConnectorTest)
[info] Test Passed: testCompression(kafka.consumer.ZookeeperConsumerConnectorTest)
[info] Test Starting: testCompressionSetConsumption(kafka.consumer.ZookeeperConsumerConnectorTest)
[info] Test Passed: testCompressionSetConsumption(kafka.consumer.ZookeeperConsumerConnectorTest)
[info] Test Starting: testConsumerDecoder(kafka.consumer.ZookeeperConsumerConnectorTest)
[info] Test Passed: testConsumerDecoder(kafka.consumer.ZookeeperConsumerConnectorTest)
[info] Test Starting: testLeaderSelectionForPartition(kafka.consumer.ZookeeperConsumerConnectorTest)
[info] Test Passed: testLeaderSelectionForPartition(kafka.consumer.ZookeeperConsumerConnectorTest)
[info] == core-kafka / kafka.consumer.ZookeeperConsumerConnectorTest ==
[info] 
[info] == core-kafka / kafka.server.IsrExpirationTest ==
[info] Test Starting: testIsrExpirationForStuckFollowers(kafka.server.IsrExpirationTest)
[info] Test Passed: testIsrExpirationForStuckFollowers(kafka.server.IsrExpirationTest)
[info] Test Starting: testIsrExpirationForSlowFollowers(kafka.server.IsrExpirationTest)
[info] Test Passed: testIsrExpirationForSlowFollowers(kafka.server.IsrExpirationTest)
[info] == core-kafka / kafka.server.IsrExpirationTest ==
[info] 
[info] == core-kafka / kafka.log.FileMessageSetTest ==
[info] Test Starting: testWrittenEqualsRead
[info] Test Passed: testWrittenEqualsRead
[info] Test Starting: testIteratorIsConsistent
[info] Test Passed: testIteratorIsConsistent
[info] Test Starting: testSizeInBytes
[info] Test Passed: testSizeInBytes
[info] Test Starting: testWriteTo
[info] Test Passed: testWriteTo
[info] Test Starting: testFileSize
[info] Test Passed: testFileSize
[info] Test Starting: testIterationOverPartialAndTruncation
[info] Test Passed: testIterationOverPartialAndTruncation
[info] Test Starting: testIterationDoesntChangePosition
[info] Test Passed: testIterationDoesntChangePosition
[info] Test Starting: testRead
[info] Test Passed: testRead
[info] Test Starting: testSearch
[info] Test Passed: testSearch
[info] == core-kafka / kafka.log.FileMessageSetTest ==
[info] 
[info] == core-kafka / kafka.integration.LazyInitProducerTest ==
[info] Test Starting: testProduceAndMultiFetch(kafka.integration.LazyInitProducerTest)
[info] Test Passed: testProduceAndMultiFetch(kafka.integration.LazyInitProducerTest)
[info] Test Starting: testMultiProduce(kafka.integration.LazyInitProducerTest)
[info] Test Passed: testMultiProduce(kafka.integration.LazyInitProducerTest)
[info] Test Starting: testProduceAndFetch(kafka.integration.LazyInitProducerTest)
[info] Test Passed: testProduceAndFetch(kafka.integration.LazyInitProducerTest)
[info] Test Starting: testMultiProduceResend(kafka.integration.LazyInitProducerTest)
[info] Test Passed: testMultiProduceResend(kafka.integration.LazyInitProducerTest)
[info] == core-kafka / kafka.integration.LazyInitProducerTest ==
[info] 
[info] == core-kafka / kafka.server.LogRecoveryTest ==
[info] Test Starting: testHWCheckpointNoFailuresSingleLogSegment(kafka.server.LogRecoveryTest)
[info] Test Passed: testHWCheckpointNoFailuresSingleLogSegment(kafka.server.LogRecoveryTest)
[info] Test Starting: testHWCheckpointWithFailuresSingleLogSegment(kafka.server.LogRecoveryTest)
[error] Test Failed: testHWCheckpointWithFailuresSingleLogSegment(kafka.server.LogRecoveryTest)
java.lang.AssertionError: expected:<2> but was:<1>
	at org.junit.Assert.fail(Assert.java:69)
	at org.junit.Assert.failNotEquals(Assert.java:314)
	at org.junit.Assert.assertEquals(Assert.java:94)
	at org.junit.Assert.assertEquals(Assert.java:104)
	at kafka.server.LogRecoveryTest.testHWCheckpointWithFailuresSingleLogSegment(LogRecoveryTest.scala:149)
	at sun.reflect.NativeMethodAccessorImpl.invoke0(Native Method)
	at sun.reflect.NativeMethodAccessorImpl.invoke(NativeMethodAccessorImpl.java:39)
	at sun.reflect.DelegatingMethodAccessorImpl.invoke(DelegatingMethodAccessorImpl.java:25)
	at java.lang.reflect.Method.invoke(Method.java:597)
	at junit.framework.TestCase.runTest(TestCase.java:164)
	at junit.framework.TestCase.runBare(TestCase.java:130)
	at junit.framework.TestResult$1.protect(TestResult.java:110)
	at junit.framework.TestResult.runProtected(TestResult.java:128)
	at junit.framework.TestResult.run(TestResult.java:113)
	at junit.framework.TestCase.run(TestCase.java:120)
	at junit.framework.TestSuite.runTest(TestSuite.java:228)
	at junit.framework.TestSuite.run(TestSuite.java:223)
	at junit.framework.TestSuite.runTest(TestSuite.java:228)
	at junit.framework.TestSuite.run(TestSuite.java:223)
	at org.scalatest.junit.JUnit3Suite.run(JUnit3Suite.scala:309)
	at org.scalatest.tools.ScalaTestFramework$ScalaTestRunner.run(ScalaTestFramework.scala:40)
	at sbt.TestRunner.run(TestFramework.scala:53)
	at sbt.TestRunner.runTest$1(TestFramework.scala:67)
	at sbt.TestRunner.run(TestFramework.scala:76)
	at sbt.TestFramework$$anonfun$10$$anonfun$apply$11.runTest$2(TestFramework.scala:194)
	at sbt.TestFramework$$anonfun$10$$anonfun$apply$11$$anonfun$apply$12.apply(TestFramework.scala:205)
	at sbt.TestFramework$$anonfun$10$$anonfun$apply$11$$anonfun$apply$12.apply(TestFramework.scala:205)
	at sbt.NamedTestTask.run(TestFramework.scala:92)
	at sbt.ScalaProject$$anonfun$sbt$ScalaProject$$toTask$1.apply(ScalaProject.scala:193)
	at sbt.ScalaProject$$anonfun$sbt$ScalaProject$$toTask$1.apply(ScalaProject.scala:193)
	at sbt.TaskManager$Task.invoke(TaskManager.scala:62)
	at sbt.impl.RunTask.doRun$1(RunTask.scala:77)
	at sbt.impl.RunTask.runTask(RunTask.scala:85)
	at sbt.impl.RunTask.sbt$impl$RunTask$$runIfNotRoot(RunTask.scala:60)
	at sbt.impl.RunTask$$anonfun$runTasksExceptRoot$2.apply(RunTask.scala:48)
	at sbt.impl.RunTask$$anonfun$runTasksExceptRoot$2.apply(RunTask.scala:48)
	at sbt.Distributor$Run$Worker$$anonfun$2.apply(ParallelRunner.scala:131)
	at sbt.Distributor$Run$Worker$$anonfun$2.apply(ParallelRunner.scala:131)
	at sbt.Control$.trapUnit(Control.scala:19)
	at sbt.Distributor$Run$Worker.run(ParallelRunner.scala:131)
[info] Test Starting: testHWCheckpointNoFailuresMultipleLogSegments(kafka.server.LogRecoveryTest)
[info] Test Passed: testHWCheckpointNoFailuresMultipleLogSegments(kafka.server.LogRecoveryTest)
[info] Test Starting: testHWCheckpointWithFailuresMultipleLogSegments(kafka.server.LogRecoveryTest)
[info] Test Passed: testHWCheckpointWithFailuresMultipleLogSegments(kafka.server.LogRecoveryTest)
[info] == core-kafka / kafka.server.LogRecoveryTest ==
[info] 
[info] == core-kafka / kafka.integration.FetcherTest ==
[info] Test Starting: testFetcher(kafka.integration.FetcherTest)
[info] Test Passed: testFetcher(kafka.integration.FetcherTest)
[info] == core-kafka / kafka.integration.FetcherTest ==
[info] 
[info] == core-kafka / kafka.metrics.KafkaTimerTest ==
[info] Test Starting: testKafkaTimer(kafka.metrics.KafkaTimerTest)
[info] Test Passed: testKafkaTimer(kafka.metrics.KafkaTimerTest)
[info] == core-kafka / kafka.metrics.KafkaTimerTest ==
[info] 
[info] == core-kafka / kafka.server.LeaderElectionTest ==
[info] Test Starting: testLeaderElectionAndEpoch(kafka.server.LeaderElectionTest)
[info] Test Passed: testLeaderElectionAndEpoch(kafka.server.LeaderElectionTest)
[info] == core-kafka / kafka.server.LeaderElectionTest ==
[info] 
[info] == core-kafka / kafka.log.OffsetIndexTest ==
[info] Test Starting: truncate
[info] Test Passed: truncate
[info] Test Starting: randomLookupTest
[info] Test Passed: randomLookupTest
[info] Test Starting: lookupExtremeCases
[info] Test Passed: lookupExtremeCases
[info] Test Starting: appendTooMany
[info] Test Passed: appendTooMany
[info] Test Starting: appendOutOfOrder
[info] Test Passed: appendOutOfOrder
[info] Test Starting: testReopen
[info] Test Passed: testReopen
[info] == core-kafka / kafka.log.OffsetIndexTest ==
[info] 
[info] == core-kafka / kafka.producer.ProducerTest ==
[info] Test Starting: testUpdateBrokerPartitionInfo(kafka.producer.ProducerTest)
[info] Test Passed: testUpdateBrokerPartitionInfo(kafka.producer.ProducerTest)
[info] Test Starting: testSendToNewTopic(kafka.producer.ProducerTest)
[info] Test Passed: testSendToNewTopic(kafka.producer.ProducerTest)
[info] Test Starting: testSendWithDeadBroker(kafka.producer.ProducerTest)
[info] Test Passed: testSendWithDeadBroker(kafka.producer.ProducerTest)
[info] Test Starting: testAsyncSendCanCorrectlyFailWithTimeout(kafka.producer.ProducerTest)
[info] Test Passed: testAsyncSendCanCorrectlyFailWithTimeout(kafka.producer.ProducerTest)
[info] == core-kafka / kafka.producer.ProducerTest ==
[info] 
[info] == core-kafka / kafka.server.HighwatermarkPersistenceTest ==
[info] Test Starting: testHighWatermarkPersistenceSinglePartition(kafka.server.HighwatermarkPersistenceTest)
[info] Test Passed: testHighWatermarkPersistenceSinglePartition(kafka.server.HighwatermarkPersistenceTest)
[info] Test Starting: testHighWatermarkPersistenceMultiplePartitions(kafka.server.HighwatermarkPersistenceTest)
[info] Test Passed: testHighWatermarkPersistenceMultiplePartitions(kafka.server.HighwatermarkPersistenceTest)
[info] == core-kafka / kafka.server.HighwatermarkPersistenceTest ==
[info] 
[info] == core-kafka / kafka.integration.AutoOffsetResetTest ==
[info] Test Starting: testResetToEarliestWhenOffsetTooHigh(kafka.integration.AutoOffsetResetTest)
[info] Test Passed: testResetToEarliestWhenOffsetTooHigh(kafka.integration.AutoOffsetResetTest)
[info] Test Starting: testResetToEarliestWhenOffsetTooLow(kafka.integration.AutoOffsetResetTest)
[info] Test Passed: testResetToEarliestWhenOffsetTooLow(kafka.integration.AutoOffsetResetTest)
[info] Test Starting: testResetToLatestWhenOffsetTooHigh(kafka.integration.AutoOffsetResetTest)
[info] Test Passed: testResetToLatestWhenOffsetTooHigh(kafka.integration.AutoOffsetResetTest)
[info] Test Starting: testResetToLatestWhenOffsetTooLow(kafka.integration.AutoOffsetResetTest)
[info] Test Passed: testResetToLatestWhenOffsetTooLow(kafka.integration.AutoOffsetResetTest)
[info] == core-kafka / kafka.integration.AutoOffsetResetTest ==
[info] 
[info] == core-kafka / Test cleanup 1 ==
[info] Deleting directory /tmp/sbt_995d6018
[info] == core-kafka / Test cleanup 1 ==
[info] 
[info] == core-kafka / test-finish ==
[error] Failed: : Total 159, Failed 2, Errors 0, Passed 157, Skipped 0
[info] == core-kafka / test-finish ==
[info] 
[info] == core-kafka / test-cleanup ==
[info] == core-kafka / test-cleanup ==
[error] Error running kafka.consumer.ZookeeperConsumerConnectorTest: Test
FAILED
[error] Error running kafka.server.LogRecoveryTest: Test FAILED
[error] Error running test: One or more subtasks failed
[info] 
[info] Total time: 245 s, completed Oct 13, 2012 4:08:32 AM
[info] 
[info] Total session time: 245 s, completed Oct 13, 2012 4:08:32 AM
[error] Error during build.
Build step 'Execute shell' marked build as failure

Mime
View raw message