kafka-commits mailing list archives

Site index · List index
Message view « Date » · « Thread »
Top « Date » · « Thread »
From Apache Jenkins Server <jenk...@builds.apache.org>
Subject Build failed in Jenkins: Kafka-0.8 #94
Date Mon, 29 Oct 2012 23:13:36 GMT
See <https://builds.apache.org/job/Kafka-0.8/94/changes>

Changes:

[junrao] extend DumpLogSegments to verify consistency btw data and index; patched by Yang
Ye; reviewed by Neha Narkhede and Jun Rao; KAFKA-577

------------------------------------------
[...truncated 2396 lines...]
kafka.common.UnknownTopicOrPartitionException: Topic test1 partition -1 doesn't exist on 0
	at kafka.server.ReplicaManager.getLeaderReplicaIfLocal(ReplicaManager.scala:143)
	at kafka.server.KafkaApis.kafka$server$KafkaApis$$readMessageSet(KafkaApis.scala:306)
	at kafka.server.KafkaApis$$anonfun$kafka$server$KafkaApis$$readMessageSets$1.apply(KafkaApis.scala:272)
	at kafka.server.KafkaApis$$anonfun$kafka$server$KafkaApis$$readMessageSets$1.apply(KafkaApis.scala:268)
	at scala.collection.TraversableLike$$anonfun$map$1.apply(TraversableLike.scala:206)
	at scala.collection.TraversableLike$$anonfun$map$1.apply(TraversableLike.scala:206)
	at scala.collection.immutable.Map$Map4.foreach(Map.scala:180)
	at scala.collection.TraversableLike$class.map(TraversableLike.scala:206)
	at scala.collection.immutable.Map$Map4.map(Map.scala:157)
	at kafka.server.KafkaApis.kafka$server$KafkaApis$$readMessageSets(KafkaApis.scala:268)
	at kafka.server.KafkaApis.handleFetchRequest(KafkaApis.scala:236)
	at kafka.server.KafkaApis.handle(KafkaApis.scala:57)
	at kafka.server.KafkaRequestHandler.run(KafkaRequestHandler.scala:40)
	at java.lang.Thread.run(Thread.java:662)
[2012-10-29 23:12:38,281] WARN Session 0x13aaecbcd6f0002 for server null, unexpected error,
closing socket connection and attempting reconnect (org.apache.zookeeper.ClientCnxn:1188)
java.net.ConnectException: Connection refused
	at sun.nio.ch.SocketChannelImpl.checkConnect(Native Method)
	at sun.nio.ch.SocketChannelImpl.finishConnect(SocketChannelImpl.java:574)
	at org.apache.zookeeper.ClientCnxn$SendThread.run(ClientCnxn.java:1146)
[info] Test Passed: testProduceAndMultiFetchWithCompression(kafka.integration.PrimitiveApiTest)
[info] Test Starting: testMultiProduce(kafka.integration.PrimitiveApiTest)
[2012-10-29 23:12:39,476] WARN EndOfStreamException: Unable to read additional data from client
sessionid 0x13aaecbcd6f0002, likely client has closed socket (org.apache.zookeeper.server.NIOServerCnxn:634)
[2012-10-29 23:12:40,086] WARN Exception causing close of session 0x13aaecbd0d50002 due to
java.io.IOException: Connection reset by peer (org.apache.zookeeper.server.NIOServerCnxn:639)
[2012-10-29 23:12:40,246] WARN EndOfStreamException: Unable to read additional data from client
sessionid 0x13aaecbd9f40002, likely client has closed socket (org.apache.zookeeper.server.NIOServerCnxn:634)
[info] Test Passed: testMultiProduce(kafka.integration.PrimitiveApiTest)
[info] Test Starting: testMultiProduceWithCompression(kafka.integration.PrimitiveApiTest)
[2012-10-29 23:12:43,536] WARN EndOfStreamException: Unable to read additional data from client
sessionid 0x13aaecbcf870002, likely client has closed socket (org.apache.zookeeper.server.NIOServerCnxn:634)
[2012-10-29 23:12:43,726] WARN EndOfStreamException: Unable to read additional data from client
sessionid 0x13aaecc444f0004, likely client has closed socket (org.apache.zookeeper.server.NIOServerCnxn:634)
[2012-10-29 23:12:43,836] WARN EndOfStreamException: Unable to read additional data from client
sessionid 0x13aaecbcd6f0002, likely client has closed socket (org.apache.zookeeper.server.NIOServerCnxn:634)
[2012-10-29 23:12:43,855] WARN EndOfStreamException: Unable to read additional data from client
sessionid 0x13aaecbd0d50002, likely client has closed socket (org.apache.zookeeper.server.NIOServerCnxn:634)
[2012-10-29 23:12:43,886] WARN EndOfStreamException: Unable to read additional data from client
sessionid 0x13aaecbd9f40002, likely client has closed socket (org.apache.zookeeper.server.NIOServerCnxn:634)
[info] Test Passed: testMultiProduceWithCompression(kafka.integration.PrimitiveApiTest)
[info] Test Starting: testConsumerEmptyTopic(kafka.integration.PrimitiveApiTest)
[info] Test Passed: testConsumerEmptyTopic(kafka.integration.PrimitiveApiTest)
[info] == core-kafka / kafka.integration.PrimitiveApiTest ==
[info] 
[info] == core-kafka / kafka.javaapi.message.ByteBufferMessageSetTest ==
[info] Test Starting: testWrittenEqualsRead
[info] Test Passed: testWrittenEqualsRead
[info] Test Starting: testIteratorIsConsistent
[info] Test Passed: testIteratorIsConsistent
[info] Test Starting: testSizeInBytes
[info] Test Passed: testSizeInBytes
[info] Test Starting: testEquals
[info] Test Passed: testEquals
[info] Test Starting: testIteratorIsConsistentWithCompression
[info] Test Passed: testIteratorIsConsistentWithCompression
[info] Test Starting: testSizeInBytesWithCompression
[info] Test Passed: testSizeInBytesWithCompression
[info] Test Starting: testEqualsWithCompression
[info] Test Passed: testEqualsWithCompression
[info] == core-kafka / kafka.javaapi.message.ByteBufferMessageSetTest ==
[info] 
[info] == core-kafka / kafka.utils.UtilsTest ==
[info] Test Starting: testSwallow
[info] Test Passed: testSwallow
[info] Test Starting: testCircularIterator
[info] Test Passed: testCircularIterator
[info] == core-kafka / kafka.utils.UtilsTest ==
[info] 
[info] == core-kafka / kafka.log.OffsetIndexTest ==
[info] Test Starting: truncate
[info] Test Passed: truncate
[info] Test Starting: randomLookupTest
[info] Test Passed: randomLookupTest
[info] Test Starting: lookupExtremeCases
[info] Test Passed: lookupExtremeCases
[info] Test Starting: appendTooMany
[info] Test Passed: appendTooMany
[info] Test Starting: appendOutOfOrder
[info] Test Passed: appendOutOfOrder
[info] Test Starting: testReopen
[info] Test Passed: testReopen
[info] == core-kafka / kafka.log.OffsetIndexTest ==
[info] 
[info] == core-kafka / kafka.api.RequestResponseSerializationTest ==
[2012-10-29 23:12:45,254] WARN Session 0x13aaecc444f0004 for server null, unexpected error,
closing socket connection and attempting reconnect (org.apache.zookeeper.ClientCnxn:1188)
java.net.ConnectException: Connection refused
	at sun.nio.ch.SocketChannelImpl.checkConnect(Native Method)
	at sun.nio.ch.SocketChannelImpl.finishConnect(SocketChannelImpl.java:574)
	at org.apache.zookeeper.ClientCnxn$SendThread.run(ClientCnxn.java:1146)
[info] Test Starting: testSerializationAndDeserialization
[info] Test Passed: testSerializationAndDeserialization
[info] == core-kafka / kafka.api.RequestResponseSerializationTest ==
[info] 
[info] == core-kafka / kafka.log.LogSegmentTest ==
[info] Test Starting: testReadOnEmptySegment(kafka.log.LogSegmentTest)
[info] Test Passed: testReadOnEmptySegment(kafka.log.LogSegmentTest)
[info] Test Starting: testReadBeforeFirstOffset(kafka.log.LogSegmentTest)
[info] Test Passed: testReadBeforeFirstOffset(kafka.log.LogSegmentTest)
[info] Test Starting: testReadSingleMessage(kafka.log.LogSegmentTest)
[info] Test Passed: testReadSingleMessage(kafka.log.LogSegmentTest)
[info] Test Starting: testReadAfterLast(kafka.log.LogSegmentTest)
[info] Test Passed: testReadAfterLast(kafka.log.LogSegmentTest)
[info] Test Starting: testReadFromGap(kafka.log.LogSegmentTest)
[info] Test Passed: testReadFromGap(kafka.log.LogSegmentTest)
[info] Test Starting: testTruncate(kafka.log.LogSegmentTest)
[info] Test Passed: testTruncate(kafka.log.LogSegmentTest)
[info] Test Starting: testNextOffsetCalculation(kafka.log.LogSegmentTest)
[info] Test Passed: testNextOffsetCalculation(kafka.log.LogSegmentTest)
[info] == core-kafka / kafka.log.LogSegmentTest ==
[info] 
[info] == core-kafka / kafka.log4j.KafkaLog4jAppenderTest ==
[info] Test Starting: testKafkaLog4jConfigs(kafka.log4j.KafkaLog4jAppenderTest)
log4j:WARN No appenders could be found for logger (org.I0Itec.zkclient.ZkEventThread).
log4j:WARN Please initialize the log4j system properly.
[info] Test Passed: testKafkaLog4jConfigs(kafka.log4j.KafkaLog4jAppenderTest)
[info] Test Starting: testLog4jAppends(kafka.log4j.KafkaLog4jAppenderTest)
[info] Test Passed: testLog4jAppends(kafka.log4j.KafkaLog4jAppenderTest)
[info] == core-kafka / kafka.log4j.KafkaLog4jAppenderTest ==
[info] 
[info] == core-kafka / kafka.server.LogRecoveryTest ==
[info] Test Starting: testHWCheckpointNoFailuresSingleLogSegment(kafka.server.LogRecoveryTest)
[info] Test Passed: testHWCheckpointNoFailuresSingleLogSegment(kafka.server.LogRecoveryTest)
[info] Test Starting: testHWCheckpointWithFailuresSingleLogSegment(kafka.server.LogRecoveryTest)
[info] Test Passed: testHWCheckpointWithFailuresSingleLogSegment(kafka.server.LogRecoveryTest)
[info] Test Starting: testHWCheckpointNoFailuresMultipleLogSegments(kafka.server.LogRecoveryTest)
[info] Test Passed: testHWCheckpointNoFailuresMultipleLogSegments(kafka.server.LogRecoveryTest)
[info] Test Starting: testHWCheckpointWithFailuresMultipleLogSegments(kafka.server.LogRecoveryTest)
[info] Test Passed: testHWCheckpointWithFailuresMultipleLogSegments(kafka.server.LogRecoveryTest)
[info] == core-kafka / kafka.server.LogRecoveryTest ==
[info] 
[info] == core-kafka / kafka.network.SocketServerTest ==
[info] Test Starting: simpleRequest
[info] Test Passed: simpleRequest
[info] Test Starting: tooBigRequestIsRejected
[info] Test Passed: tooBigRequestIsRejected
[info] == core-kafka / kafka.network.SocketServerTest ==
[info] 
[info] == core-kafka / kafka.consumer.TopicFilterTest ==
[info] Test Starting: testWhitelists
[info] Test Passed: testWhitelists
[info] Test Starting: testBlacklists
[info] Test Passed: testBlacklists
[info] == core-kafka / kafka.consumer.TopicFilterTest ==
[info] 
[info] == core-kafka / kafka.zk.ZKEphemeralTest ==
[info] Test Starting: testEphemeralNodeCleanup(kafka.zk.ZKEphemeralTest)
[info] Test Passed: testEphemeralNodeCleanup(kafka.zk.ZKEphemeralTest)
[info] == core-kafka / kafka.zk.ZKEphemeralTest ==
[info] 
[info] == core-kafka / kafka.producer.AsyncProducerTest ==
[info] Test Starting: testProducerQueueSize(kafka.producer.AsyncProducerTest)
[info] Test Passed: testProducerQueueSize(kafka.producer.AsyncProducerTest)
[info] Test Starting: testProduceAfterClosed(kafka.producer.AsyncProducerTest)
[info] Test Passed: testProduceAfterClosed(kafka.producer.AsyncProducerTest)
[info] Test Starting: testBatchSize(kafka.producer.AsyncProducerTest)
[info] Test Passed: testBatchSize(kafka.producer.AsyncProducerTest)
[info] Test Starting: testQueueTimeExpired(kafka.producer.AsyncProducerTest)
[info] Test Passed: testQueueTimeExpired(kafka.producer.AsyncProducerTest)
[info] Test Starting: testPartitionAndCollateEvents(kafka.producer.AsyncProducerTest)
[info] Test Passed: testPartitionAndCollateEvents(kafka.producer.AsyncProducerTest)
[info] Test Starting: testSerializeEvents(kafka.producer.AsyncProducerTest)
[info] Test Passed: testSerializeEvents(kafka.producer.AsyncProducerTest)
[info] Test Starting: testInvalidPartition(kafka.producer.AsyncProducerTest)
[info] Test Passed: testInvalidPartition(kafka.producer.AsyncProducerTest)
[info] Test Starting: testNoBroker(kafka.producer.AsyncProducerTest)
[info] Test Passed: testNoBroker(kafka.producer.AsyncProducerTest)
[info] Test Starting: testIncompatibleEncoder(kafka.producer.AsyncProducerTest)
[info] Test Passed: testIncompatibleEncoder(kafka.producer.AsyncProducerTest)
[info] Test Starting: testRandomPartitioner(kafka.producer.AsyncProducerTest)
[info] Test Passed: testRandomPartitioner(kafka.producer.AsyncProducerTest)
[info] Test Starting: testBrokerListAndAsync(kafka.producer.AsyncProducerTest)
[info] Test Passed: testBrokerListAndAsync(kafka.producer.AsyncProducerTest)
[info] Test Starting: testFailedSendRetryLogic(kafka.producer.AsyncProducerTest)
[info] Test Passed: testFailedSendRetryLogic(kafka.producer.AsyncProducerTest)
[info] Test Starting: testJavaProducer(kafka.producer.AsyncProducerTest)
[info] Test Passed: testJavaProducer(kafka.producer.AsyncProducerTest)
[info] Test Starting: testInvalidConfiguration(kafka.producer.AsyncProducerTest)
[info] Test Passed: testInvalidConfiguration(kafka.producer.AsyncProducerTest)
[info] == core-kafka / kafka.producer.AsyncProducerTest ==
[info] 
[info] == core-kafka / kafka.server.ReplicaFetchTest ==
[info] Test Starting: testReplicaFetcherThread(kafka.server.ReplicaFetchTest)
[info] Test Passed: testReplicaFetcherThread(kafka.server.ReplicaFetchTest)
[info] == core-kafka / kafka.server.ReplicaFetchTest ==
[info] 
[info] == core-kafka / kafka.metrics.KafkaTimerTest ==
[info] Test Starting: testKafkaTimer(kafka.metrics.KafkaTimerTest)
[info] Test Passed: testKafkaTimer(kafka.metrics.KafkaTimerTest)
[info] == core-kafka / kafka.metrics.KafkaTimerTest ==
[info] 
[info] == core-kafka / kafka.admin.AdminTest ==
[info] Test Starting: testReplicaAssignment(kafka.admin.AdminTest)
[info] Test Passed: testReplicaAssignment(kafka.admin.AdminTest)
[info] Test Starting: testManualReplicaAssignment(kafka.admin.AdminTest)
[info] Test Passed: testManualReplicaAssignment(kafka.admin.AdminTest)
[info] Test Starting: testTopicCreationInZK(kafka.admin.AdminTest)
[info] Test Passed: testTopicCreationInZK(kafka.admin.AdminTest)
[info] Test Starting: testGetTopicMetadata(kafka.admin.AdminTest)
[info] Test Passed: testGetTopicMetadata(kafka.admin.AdminTest)
[info] Test Starting: testPartitionReassignmentWithLeaderInNewReplicas(kafka.admin.AdminTest)
[info] Test Passed: testPartitionReassignmentWithLeaderInNewReplicas(kafka.admin.AdminTest)
[info] Test Starting: testPartitionReassignmentWithLeaderNotInNewReplicas(kafka.admin.AdminTest)
[info] Test Passed: testPartitionReassignmentWithLeaderNotInNewReplicas(kafka.admin.AdminTest)
[info] Test Starting: testPartitionReassignmentNonOverlappingReplicas(kafka.admin.AdminTest)
[info] Test Passed: testPartitionReassignmentNonOverlappingReplicas(kafka.admin.AdminTest)
[info] Test Starting: testReassigningNonExistingPartition(kafka.admin.AdminTest)
[info] Test Passed: testReassigningNonExistingPartition(kafka.admin.AdminTest)
[info] Test Starting: testResumePartitionReassignmentThatWasCompleted(kafka.admin.AdminTest)
[info] Test Passed: testResumePartitionReassignmentThatWasCompleted(kafka.admin.AdminTest)
[info] Test Starting: testPreferredReplicaJsonData(kafka.admin.AdminTest)
[info] Test Passed: testPreferredReplicaJsonData(kafka.admin.AdminTest)
[info] Test Starting: testBasicPreferredReplicaElection(kafka.admin.AdminTest)
[info] Test Passed: testBasicPreferredReplicaElection(kafka.admin.AdminTest)
[info] Test Starting: testShutdownBroker(kafka.admin.AdminTest)
[info] Test Passed: testShutdownBroker(kafka.admin.AdminTest)
[info] == core-kafka / kafka.admin.AdminTest ==
[info] 
[info] == core-kafka / kafka.server.LeaderElectionTest ==
[info] Test Starting: testLeaderElectionAndEpoch(kafka.server.LeaderElectionTest)
[info] Test Passed: testLeaderElectionAndEpoch(kafka.server.LeaderElectionTest)
[info] == core-kafka / kafka.server.LeaderElectionTest ==
[info] 
[info] == core-kafka / kafka.javaapi.consumer.ZookeeperConsumerConnectorTest
==
[info] Test Starting: testBasic(kafka.javaapi.consumer.ZookeeperConsumerConnectorTest)
[info] Test Passed: testBasic(kafka.javaapi.consumer.ZookeeperConsumerConnectorTest)
[info] == core-kafka / kafka.javaapi.consumer.ZookeeperConsumerConnectorTest
==
[info] 
[info] == core-kafka / kafka.integration.LazyInitProducerTest ==
[info] Test Starting: testProduceAndMultiFetch(kafka.integration.LazyInitProducerTest)
[info] Test Passed: testProduceAndMultiFetch(kafka.integration.LazyInitProducerTest)
[info] Test Starting: testMultiProduce(kafka.integration.LazyInitProducerTest)
[info] Test Passed: testMultiProduce(kafka.integration.LazyInitProducerTest)
[info] Test Starting: testProduceAndFetch(kafka.integration.LazyInitProducerTest)
[info] Test Passed: testProduceAndFetch(kafka.integration.LazyInitProducerTest)
[info] Test Starting: testMultiProduceResend(kafka.integration.LazyInitProducerTest)
[info] Test Passed: testMultiProduceResend(kafka.integration.LazyInitProducerTest)
[info] == core-kafka / kafka.integration.LazyInitProducerTest ==
[info] 
[info] == core-kafka / Test cleanup 1 ==
[info] Deleting directory /var/tmp/sbt_85ea01f8
[info] == core-kafka / Test cleanup 1 ==
[info] 
[info] == core-kafka / test-finish ==
[error] Failed: : Total 160, Failed 1, Errors 0, Passed 159, Skipped 0
[info] == core-kafka / test-finish ==
[info] 
[info] == core-kafka / test-cleanup ==
[info] == core-kafka / test-cleanup ==
[error] Error running kafka.producer.SyncProducerTest: Test FAILED
[error] Error running test: One or more subtasks failed
[info] 
[info] Total time: 288 s, completed Oct 29, 2012 11:14:18 PM
[info] 
[info] Total session time: 289 s, completed Oct 29, 2012 11:14:18 PM
[error] Error during build.
Build step 'Execute shell' marked build as failure

Mime
View raw message