kafka-commits mailing list archives

Site index · List index
Message view « Date » · « Thread »
Top « Date » · « Thread »
From Apache Jenkins Server <jenk...@builds.apache.org>
Subject Build failed in Jenkins: Kafka-0.8 #51
Date Thu, 27 Sep 2012 01:46:29 GMT
See <https://builds.apache.org/job/Kafka-0.8/51/changes>

Changes:

[junrao] restrict topic names (reopened); patched by Swapnil Ghike; reviewed by Jun Rao; KAFKA-495

[junrao] Use getMetadata Api in ZookeeperConsumerConnector; patched by Yang Ye; reviewed by
Jun Rao; KAFKA-473

[joestein] KAFKA-533 changes to NOTICE and LICENSE related to KAFKA-534 removing client libraries
from repo

[joestein] KAFKA-534 remove client library directory

------------------------------------------
[...truncated 5063 lines...]
	at junit.framework.TestSuite.run(TestSuite.java:223)
	at org.scalatest.junit.JUnit3Suite.run(JUnit3Suite.scala:309)
	at org.scalatest.tools.ScalaTestFramework$ScalaTestRunner.run(ScalaTestFramework.scala:40)
	at sbt.TestRunner.run(TestFramework.scala:53)
	at sbt.TestRunner.runTest$1(TestFramework.scala:67)
	at sbt.TestRunner.run(TestFramework.scala:76)
	at sbt.TestFramework$$anonfun$10$$anonfun$apply$11.runTest$2(TestFramework.scala:194)
	at sbt.TestFramework$$anonfun$10$$anonfun$apply$11$$anonfun$apply$12.apply(TestFramework.scala:205)
	at sbt.TestFramework$$anonfun$10$$anonfun$apply$11$$anonfun$apply$12.apply(TestFramework.scala:205)
	at sbt.NamedTestTask.run(TestFramework.scala:92)
	at sbt.ScalaProject$$anonfun$sbt$ScalaProject$$toTask$1.apply(ScalaProject.scala:193)
	at sbt.ScalaProject$$anonfun$sbt$ScalaProject$$toTask$1.apply(ScalaProject.scala:193)
	at sbt.TaskManager$Task.invoke(TaskManager.scala:62)
	at sbt.impl.RunTask.doRun$1(RunTask.scala:77)
	at sbt.impl.RunTask.runTask(RunTask.scala:85)
	at sbt.impl.RunTask.sbt$impl$RunTask$$runIfNotRoot(RunTask.scala:60)
	at sbt.impl.RunTask$$anonfun$runTasksExceptRoot$2.apply(RunTask.scala:48)
	at sbt.impl.RunTask$$anonfun$runTasksExceptRoot$2.apply(RunTask.scala:48)
	at sbt.Distributor$Run$Worker$$anonfun$2.apply(ParallelRunner.scala:131)
	at sbt.Distributor$Run$Worker$$anonfun$2.apply(ParallelRunner.scala:131)
	at sbt.Control$.trapUnit(Control.scala:19)
	at sbt.Distributor$Run$Worker.run(ParallelRunner.scala:131)
[2012-09-27 01:46:39,980] ERROR Connection attempt to localhost:44303 failed, next attempt
in 1000 ms (kafka.producer.SyncProducer:102)
java.net.ConnectException: Connection refused
	at sun.nio.ch.Net.connect(Native Method)
	at sun.nio.ch.SocketChannelImpl.connect(SocketChannelImpl.java:507)
	at kafka.network.BlockingChannel.connect(BlockingChannel.scala:57)
	at kafka.producer.SyncProducer.connect(SyncProducer.scala:148)
	at kafka.producer.SyncProducer.getOrMakeConnection(SyncProducer.scala:169)
	at kafka.producer.SyncProducer.kafka$producer$SyncProducer$$doSend(SyncProducer.scala:74)
	at kafka.producer.SyncProducer.send(SyncProducer.scala:112)
	at kafka.utils.Utils$.getTopicMetadata(Utils.scala:689)
	at kafka.producer.BrokerPartitionInfo.updateInfo(BrokerPartitionInfo.scala:74)
	at kafka.producer.async.DefaultEventHandler$$anonfun$handle$1.apply$mcV$sp(DefaultEventHandler.scala:58)
	at kafka.utils.Utils$.swallow(Utils.scala:251)
	at kafka.utils.Logging$class.swallowError(Logging.scala:105)
	at kafka.utils.Utils$.swallowError(Utils.scala:41)
	at kafka.producer.async.DefaultEventHandler.handle(DefaultEventHandler.scala:58)
	at kafka.producer.Producer.send(Producer.scala:66)
	at kafka.producer.ProducerTest.testSendWithDeadBroker(ProducerTest.scala:237)
	at sun.reflect.NativeMethodAccessorImpl.invoke0(Native Method)
	at sun.reflect.NativeMethodAccessorImpl.invoke(NativeMethodAccessorImpl.java:39)
	at sun.reflect.DelegatingMethodAccessorImpl.invoke(DelegatingMethodAccessorImpl.java:25)
	at java.lang.reflect.Method.invoke(Method.java:597)
	at junit.framework.TestCase.runTest(TestCase.java:164)
	at junit.framework.TestCase.runBare(TestCase.java:130)
	at junit.framework.TestResult$1.protect(TestResult.java:110)
	at junit.framework.TestResult.runProtected(TestResult.java:128)
	at junit.framework.TestResult.run(TestResult.java:113)
	at junit.framework.TestCase.run(TestCase.java:120)
	at junit.framework.TestSuite.runTest(TestSuite.java:228)
	at junit.framework.TestSuite.run(TestSuite.java:223)
	at junit.framework.TestSuite.runTest(TestSuite.java:228)
	at junit.framework.TestSuite.run(TestSuite.java:223)
	at org.scalatest.junit.JUnit3Suite.run(JUnit3Suite.scala:309)
	at org.scalatest.tools.ScalaTestFramework$ScalaTestRunner.run(ScalaTestFramework.scala:40)
	at sbt.TestRunner.run(TestFramework.scala:53)
	at sbt.TestRunner.runTest$1(TestFramework.scala:67)
	at sbt.TestRunner.run(TestFramework.scala:76)
	at sbt.TestFramework$$anonfun$10$$anonfun$apply$11.runTest$2(TestFramework.scala:194)
	at sbt.TestFramework$$anonfun$10$$anonfun$apply$11$$anonfun$apply$12.apply(TestFramework.scala:205)
	at sbt.TestFramework$$anonfun$10$$anonfun$apply$11$$anonfun$apply$12.apply(TestFramework.scala:205)
	at sbt.NamedTestTask.run(TestFramework.scala:92)
	at sbt.ScalaProject$$anonfun$sbt$ScalaProject$$toTask$1.apply(ScalaProject.scala:193)
	at sbt.ScalaProject$$anonfun$sbt$ScalaProject$$toTask$1.apply(ScalaProject.scala:193)
	at sbt.TaskManager$Task.invoke(TaskManager.scala:62)
	at sbt.impl.RunTask.doRun$1(RunTask.scala:77)
	at sbt.impl.RunTask.runTask(RunTask.scala:85)
	at sbt.impl.RunTask.sbt$impl$RunTask$$runIfNotRoot(RunTask.scala:60)
	at sbt.impl.RunTask$$anonfun$runTasksExceptRoot$2.apply(RunTask.scala:48)
	at sbt.impl.RunTask$$anonfun$runTasksExceptRoot$2.apply(RunTask.scala:48)
	at sbt.Distributor$Run$Worker$$anonfun$2.apply(ParallelRunner.scala:131)
	at sbt.Distributor$Run$Worker$$anonfun$2.apply(ParallelRunner.scala:131)
	at sbt.Control$.trapUnit(Control.scala:19)
	at sbt.Distributor$Run$Worker.run(ParallelRunner.scala:131)
[2012-09-27 01:46:39,980] WARN EndOfStreamException: Unable to read additional data from client
sessionid 0x13a0566de200002, likely client has closed socket (org.apache.zookeeper.server.NIOServerCnxn:634)
[2012-09-27 01:46:40,990] ERROR Producer connection to localhost:44303 timing out after 5000
ms (kafka.producer.SyncProducer:102)
java.net.ConnectException: Connection refused
	at sun.nio.ch.Net.connect(Native Method)
	at sun.nio.ch.SocketChannelImpl.connect(SocketChannelImpl.java:507)
	at kafka.network.BlockingChannel.connect(BlockingChannel.scala:57)
	at kafka.producer.SyncProducer.connect(SyncProducer.scala:148)
	at kafka.producer.SyncProducer.getOrMakeConnection(SyncProducer.scala:169)
	at kafka.producer.SyncProducer.kafka$producer$SyncProducer$$doSend(SyncProducer.scala:74)
	at kafka.producer.SyncProducer.send(SyncProducer.scala:112)
	at kafka.utils.Utils$.getTopicMetadata(Utils.scala:689)
	at kafka.producer.BrokerPartitionInfo.updateInfo(BrokerPartitionInfo.scala:74)
	at kafka.producer.async.DefaultEventHandler$$anonfun$handle$1.apply$mcV$sp(DefaultEventHandler.scala:58)
	at kafka.utils.Utils$.swallow(Utils.scala:251)
	at kafka.utils.Logging$class.swallowError(Logging.scala:105)
	at kafka.utils.Utils$.swallowError(Utils.scala:41)
	at kafka.producer.async.DefaultEventHandler.handle(DefaultEventHandler.scala:58)
	at kafka.producer.Producer.send(Producer.scala:66)
	at kafka.producer.ProducerTest.testSendWithDeadBroker(ProducerTest.scala:237)
	at sun.reflect.NativeMethodAccessorImpl.invoke0(Native Method)
	at sun.reflect.NativeMethodAccessorImpl.invoke(NativeMethodAccessorImpl.java:39)
	at sun.reflect.DelegatingMethodAccessorImpl.invoke(DelegatingMethodAccessorImpl.java:25)
	at java.lang.reflect.Method.invoke(Method.java:597)
	at junit.framework.TestCase.runTest(TestCase.java:164)
	at junit.framework.TestCase.runBare(TestCase.java:130)
	at junit.framework.TestResult$1.protect(TestResult.java:110)
	at junit.framework.TestResult.runProtected(TestResult.java:128)
	at junit.framework.TestResult.run(TestResult.java:113)
	at junit.framework.TestCase.run(TestCase.java:120)
	at junit.framework.TestSuite.runTest(TestSuite.java:228)
	at junit.framework.TestSuite.run(TestSuite.java:223)
	at junit.framework.TestSuite.runTest(TestSuite.java:228)
	at junit.framework.TestSuite.run(TestSuite.java:223)
	at org.scalatest.junit.JUnit3Suite.run(JUnit3Suite.scala:309)
	at org.scalatest.tools.ScalaTestFramework$ScalaTestRunner.run(ScalaTestFramework.scala:40)
	at sbt.TestRunner.run(TestFramework.scala:53)
	at sbt.TestRunner.runTest$1(TestFramework.scala:67)
	at sbt.TestRunner.run(TestFramework.scala:76)
	at sbt.TestFramework$$anonfun$10$$anonfun$apply$11.runTest$2(TestFramework.scala:194)
	at sbt.TestFramework$$anonfun$10$$anonfun$apply$11$$anonfun$apply$12.apply(TestFramework.scala:205)
	at sbt.TestFramework$$anonfun$10$$anonfun$apply$11$$anonfun$apply$12.apply(TestFramework.scala:205)
	at sbt.NamedTestTask.run(TestFramework.scala:92)
	at sbt.ScalaProject$$anonfun$sbt$ScalaProject$$toTask$1.apply(ScalaProject.scala:193)
	at sbt.ScalaProject$$anonfun$sbt$ScalaProject$$toTask$1.apply(ScalaProject.scala:193)
	at sbt.TaskManager$Task.invoke(TaskManager.scala:62)
	at sbt.impl.RunTask.doRun$1(RunTask.scala:77)
	at sbt.impl.RunTask.runTask(RunTask.scala:85)
	at sbt.impl.RunTask.sbt$impl$RunTask$$runIfNotRoot(RunTask.scala:60)
	at sbt.impl.RunTask$$anonfun$runTasksExceptRoot$2.apply(RunTask.scala:48)
	at sbt.impl.RunTask$$anonfun$runTasksExceptRoot$2.apply(RunTask.scala:48)
	at sbt.Distributor$Run$Worker$$anonfun$2.apply(ParallelRunner.scala:131)
	at sbt.Distributor$Run$Worker$$anonfun$2.apply(ParallelRunner.scala:131)
	at sbt.Control$.trapUnit(Control.scala:19)
	at sbt.Distributor$Run$Worker.run(ParallelRunner.scala:131)
[2012-09-27 01:46:41,003] ERROR Failed to send the following requests: ListBuffer(ProducerData(new-topic,test,ListBuffer(message(magic
= 1, attributes = 0, crc = 2326977762, payload = java.nio.HeapByteBuffer[pos=0 lim=5 cap=5]))))
(kafka.producer.async.DefaultEventHandler:96)
[info] Test Passed: testSendWithDeadBroker(kafka.producer.ProducerTest)
[info] Test Starting: testAsyncSendCanCorrectlyFailWithTimeout(kafka.producer.ProducerTest)
[2012-09-27 01:46:41,810] WARN EndOfStreamException: Unable to read additional data from client
sessionid 0x13a0566de200002, likely client has closed socket (org.apache.zookeeper.server.NIOServerCnxn:634)
[2012-09-27 01:46:42,211] WARN EndOfStreamException: Unable to read additional data from client
sessionid 0x13a056731ef0004, likely client has closed socket (org.apache.zookeeper.server.NIOServerCnxn:634)
[2012-09-27 01:46:43,500] WARN EndOfStreamException: Unable to read additional data from client
sessionid 0x13a0566de200002, likely client has closed socket (org.apache.zookeeper.server.NIOServerCnxn:634)
[2012-09-27 01:46:43,660] WARN EndOfStreamException: Unable to read additional data from client
sessionid 0x13a056731ef0004, likely client has closed socket (org.apache.zookeeper.server.NIOServerCnxn:634)
[2012-09-27 01:46:45,211] WARN EndOfStreamException: Unable to read additional data from client
sessionid 0x13a0566de200002, likely client has closed socket (org.apache.zookeeper.server.NIOServerCnxn:634)
[2012-09-27 01:46:45,670] WARN EndOfStreamException: Unable to read additional data from client
sessionid 0x13a056731ef0004, likely client has closed socket (org.apache.zookeeper.server.NIOServerCnxn:634)
[2012-09-27 01:46:46,670] ERROR Failed to send the following requests: ListBuffer(ProducerData(new-topic,test,ListBuffer(message(magic
= 1, attributes = 0, crc = 3632233996, payload = java.nio.HeapByteBuffer[pos=0 lim=4 cap=4]))))
(kafka.producer.async.DefaultEventHandler:96)
[2012-09-27 01:46:46,890] WARN EndOfStreamException: Unable to read additional data from client
sessionid 0x13a0566de200002, likely client has closed socket (org.apache.zookeeper.server.NIOServerCnxn:634)
[info] Test Passed: testAsyncSendCanCorrectlyFailWithTimeout(kafka.producer.ProducerTest)
[info] == core-kafka / kafka.producer.ProducerTest ==
[info] 
[info] == core-kafka / kafka.server.RequestPurgatoryTest ==
[info] Test Starting: testRequestSatisfaction(kafka.server.RequestPurgatoryTest)
[info] Test Passed: testRequestSatisfaction(kafka.server.RequestPurgatoryTest)
[info] Test Starting: testRequestExpiry(kafka.server.RequestPurgatoryTest)
[info] Test Passed: testRequestExpiry(kafka.server.RequestPurgatoryTest)
[info] == core-kafka / kafka.server.RequestPurgatoryTest ==
[info] 
[info] == core-kafka / kafka.message.MessageTest ==
[info] Test Starting: testFieldValues
[2012-09-27 01:46:47,550] ERROR Unable to open socket to localhost/127.0.0.1:2182 (org.apache.zookeeper.ClientCnxn:1076)
[2012-09-27 01:46:47,550] WARN Session 0x13a056731ef0004 for server null, unexpected error,
closing socket connection and attempting reconnect (org.apache.zookeeper.ClientCnxn:1188)
java.net.ConnectException: Connection refused
	at sun.nio.ch.Net.connect(Native Method)
	at sun.nio.ch.SocketChannelImpl.connect(SocketChannelImpl.java:507)
	at org.apache.zookeeper.ClientCnxn$SendThread.startConnect(ClientCnxn.java:1071)
	at org.apache.zookeeper.ClientCnxn$SendThread.run(ClientCnxn.java:1104)
[info] Test Passed: testFieldValues
[info] Test Starting: testChecksum
[info] Test Passed: testChecksum
[info] Test Starting: testEquality
[info] Test Passed: testEquality
[info] Test Starting: testIsHashable
[info] Test Passed: testIsHashable
[info] == core-kafka / kafka.message.MessageTest ==
[info] 
[info] == core-kafka / kafka.log4j.KafkaLog4jAppenderTest ==
[info] Test Starting: testKafkaLog4jConfigs(kafka.log4j.KafkaLog4jAppenderTest)
log4j:WARN No appenders could be found for logger (org.I0Itec.zkclient.ZkEventThread).
log4j:WARN Please initialize the log4j system properly.
[info] Test Passed: testKafkaLog4jConfigs(kafka.log4j.KafkaLog4jAppenderTest)
[info] Test Starting: testLog4jAppends(kafka.log4j.KafkaLog4jAppenderTest)
[info] Test Passed: testLog4jAppends(kafka.log4j.KafkaLog4jAppenderTest)
[info] == core-kafka / kafka.log4j.KafkaLog4jAppenderTest ==
[info] 
[info] == core-kafka / kafka.network.SocketServerTest ==
[info] Test Starting: simpleRequest
[info] Test Passed: simpleRequest
[info] Test Starting: tooBigRequestIsRejected
[info] Test Passed: tooBigRequestIsRejected
[info] == core-kafka / kafka.network.SocketServerTest ==
[info] 
[info] == core-kafka / kafka.integration.TopicMetadataTest ==
[info] Test Starting: testTopicMetadataRequest(kafka.integration.TopicMetadataTest)
[info] Test Passed: testTopicMetadataRequest(kafka.integration.TopicMetadataTest)
[info] Test Starting: testBasicTopicMetadata(kafka.integration.TopicMetadataTest)
[info] Test Passed: testBasicTopicMetadata(kafka.integration.TopicMetadataTest)
[info] Test Starting: testAutoCreateTopic(kafka.integration.TopicMetadataTest)
[info] Test Passed: testAutoCreateTopic(kafka.integration.TopicMetadataTest)
[info] == core-kafka / kafka.integration.TopicMetadataTest ==
[info] 
[info] == core-kafka / kafka.admin.AdminTest ==
[info] Test Starting: testReplicaAssignment(kafka.admin.AdminTest)
[info] Test Passed: testReplicaAssignment(kafka.admin.AdminTest)
[info] Test Starting: testManualReplicaAssignment(kafka.admin.AdminTest)
[info] Test Passed: testManualReplicaAssignment(kafka.admin.AdminTest)
[info] Test Starting: testTopicCreationInZK(kafka.admin.AdminTest)
[info] Test Passed: testTopicCreationInZK(kafka.admin.AdminTest)
[info] Test Starting: testGetTopicMetadata(kafka.admin.AdminTest)
[info] Test Passed: testGetTopicMetadata(kafka.admin.AdminTest)
[info] == core-kafka / kafka.admin.AdminTest ==
[info] 
[info] == core-kafka / kafka.integration.LazyInitProducerTest ==
[info] Test Starting: testProduceAndMultiFetch(kafka.integration.LazyInitProducerTest)
[info] Test Passed: testProduceAndMultiFetch(kafka.integration.LazyInitProducerTest)
[info] Test Starting: testMultiProduce(kafka.integration.LazyInitProducerTest)
[info] Test Passed: testMultiProduce(kafka.integration.LazyInitProducerTest)
[info] Test Starting: testProduceAndFetch(kafka.integration.LazyInitProducerTest)
[info] Test Passed: testProduceAndFetch(kafka.integration.LazyInitProducerTest)
[info] Test Starting: testMultiProduceResend(kafka.integration.LazyInitProducerTest)
[info] Test Passed: testMultiProduceResend(kafka.integration.LazyInitProducerTest)
[info] == core-kafka / kafka.integration.LazyInitProducerTest ==
[info] 
[info] == core-kafka / kafka.integration.AutoOffsetResetTest ==
[info] Test Starting: testResetToEarliestWhenOffsetTooHigh(kafka.integration.AutoOffsetResetTest)
[info] Test Passed: testResetToEarliestWhenOffsetTooHigh(kafka.integration.AutoOffsetResetTest)
[info] Test Starting: testResetToEarliestWhenOffsetTooLow(kafka.integration.AutoOffsetResetTest)
[info] Test Passed: testResetToEarliestWhenOffsetTooLow(kafka.integration.AutoOffsetResetTest)
[info] Test Starting: testResetToLatestWhenOffsetTooHigh(kafka.integration.AutoOffsetResetTest)
[info] Test Passed: testResetToLatestWhenOffsetTooHigh(kafka.integration.AutoOffsetResetTest)
[info] Test Starting: testResetToLatestWhenOffsetTooLow(kafka.integration.AutoOffsetResetTest)
[info] Test Passed: testResetToLatestWhenOffsetTooLow(kafka.integration.AutoOffsetResetTest)
[info] == core-kafka / kafka.integration.AutoOffsetResetTest ==
[info] 
[info] == core-kafka / kafka.consumer.FetcherTest ==
[info] Test Starting: testFetcher(kafka.consumer.FetcherTest)
[info] Test Passed: testFetcher(kafka.consumer.FetcherTest)
[info] == core-kafka / kafka.consumer.FetcherTest ==
[info] 
[info] == core-kafka / Test cleanup 1 ==
[info] Deleting directory /var/tmp/sbt_ab10d986
[info] == core-kafka / Test cleanup 1 ==
[info] 
[info] == core-kafka / test-finish ==
[error] Failed: : Total 136, Failed 1, Errors 0, Passed 135, Skipped 0
[info] == core-kafka / test-finish ==
[info] 
[info] == core-kafka / test-cleanup ==
[info] == core-kafka / test-cleanup ==
[error] Error running kafka.message.CompressionUtilTest: Test FAILED
[error] Error running test: One or more subtasks failed
[info] 
[info] Total time: 269 s, completed Sep 27, 2012 1:47:01 AM
[info] 
[info] Total session time: 270 s, completed Sep 27, 2012 1:47:01 AM
[error] Error during build.
Build step 'Execute shell' marked build as failure

Mime
View raw message