kafka-commits mailing list archives

Site index · List index
Message view « Date » · « Thread »
Top « Date » · « Thread »
From Apache Jenkins Server <jenk...@builds.apache.org>
Subject Build failed in Jenkins: Kafka-0.8 #38
Date Mon, 10 Sep 2012 21:15:01 GMT
See <https://builds.apache.org/job/Kafka-0.8/38/changes>

Changes:

[junrao] remove errorcode from ByteBufferMessageSet; patched by Swapnil Ghike; reviewed by
Jay Kreps and Jun Rao; KAFKA-458

------------------------------------------
[...truncated 662 lines...]
[info] Test Passed: testCleanupSegmentsToMaintainSize(kafka.log.LogManagerTest)
[info] Test Starting: testTimeBasedFlush(kafka.log.LogManagerTest)
[info] Test Passed: testTimeBasedFlush(kafka.log.LogManagerTest)
[info] Test Starting: testConfigurablePartitions(kafka.log.LogManagerTest)
[info] Test Passed: testConfigurablePartitions(kafka.log.LogManagerTest)
[info] == core-kafka / kafka.log.LogManagerTest ==
[info] 
[info] == core-kafka / kafka.server.ServerShutdownTest ==
[info] Test Starting: testCleanShutdown(kafka.server.ServerShutdownTest)
[info] Test Passed: testCleanShutdown(kafka.server.ServerShutdownTest)
[info] == core-kafka / kafka.server.ServerShutdownTest ==
[info] 
[info] == core-kafka / kafka.log.LogTest ==
[info] Test Starting: testTimeBasedLogRoll
[info] Test Passed: testTimeBasedLogRoll
[info] Test Starting: testSizeBasedLogRoll
[info] Test Passed: testSizeBasedLogRoll
[info] Test Starting: testLoadEmptyLog
[info] Test Passed: testLoadEmptyLog
[info] Test Starting: testLoadInvalidLogsFails
[info] Test Passed: testLoadInvalidLogsFails
[info] Test Starting: testAppendAndRead
[info] Test Passed: testAppendAndRead
[info] Test Starting: testReadOutOfRange
[info] Test Passed: testReadOutOfRange
[info] Test Starting: testLogRolls
[info] Test Passed: testLogRolls
[info] Test Starting: testFindSegment
[info] Test Passed: testFindSegment
[info] Test Starting: testEdgeLogRolls
[info] Test Passed: testEdgeLogRolls
[info] == core-kafka / kafka.log.LogTest ==
[info] 
[info] == core-kafka / kafka.log.LogCorruptionTest ==
[info] Test Starting: testMessageSizeTooLarge(kafka.log.LogCorruptionTest)
[info] Test Passed: testMessageSizeTooLarge(kafka.log.LogCorruptionTest)
[info] == core-kafka / kafka.log.LogCorruptionTest ==
[info] 
[info] == core-kafka / kafka.log.LogOffsetTest ==
[info] Test Starting: testGetOffsetsForUnknownTopic(kafka.log.LogOffsetTest)
[info] Test Passed: testGetOffsetsForUnknownTopic(kafka.log.LogOffsetTest)
[info] Test Starting: testGetOffsetsBeforeLatestTime(kafka.log.LogOffsetTest)
[info] Test Passed: testGetOffsetsBeforeLatestTime(kafka.log.LogOffsetTest)
[info] Test Starting: testEmptyLogsGetOffsets(kafka.log.LogOffsetTest)
[info] Test Passed: testEmptyLogsGetOffsets(kafka.log.LogOffsetTest)
[info] Test Starting: testGetOffsetsBeforeNow(kafka.log.LogOffsetTest)
Offsets = 240,216,108,0
[info] Test Passed: testGetOffsetsBeforeNow(kafka.log.LogOffsetTest)
[info] Test Starting: testGetOffsetsBeforeEarliestTime(kafka.log.LogOffsetTest)
[info] Test Passed: testGetOffsetsBeforeEarliestTime(kafka.log.LogOffsetTest)
[info] == core-kafka / kafka.log.LogOffsetTest ==
[info] 
[info] == core-kafka / kafka.admin.AdminTest ==
[info] Test Starting: testReplicaAssignment(kafka.admin.AdminTest)
[info] Test Passed: testReplicaAssignment(kafka.admin.AdminTest)
[info] Test Starting: testManualReplicaAssignment(kafka.admin.AdminTest)
[info] Test Passed: testManualReplicaAssignment(kafka.admin.AdminTest)
[info] Test Starting: testTopicCreationInZK(kafka.admin.AdminTest)
[info] Test Passed: testTopicCreationInZK(kafka.admin.AdminTest)
[info] Test Starting: testGetTopicMetadata(kafka.admin.AdminTest)
[info] Test Passed: testGetTopicMetadata(kafka.admin.AdminTest)
[info] == core-kafka / kafka.admin.AdminTest ==
[info] 
[info] == core-kafka / kafka.consumer.FetcherTest ==
[info] Test Starting: testFetcher(kafka.consumer.FetcherTest)
[info] Test Passed: testFetcher(kafka.consumer.FetcherTest)
[info] == core-kafka / kafka.consumer.FetcherTest ==
[info] 
[info] == core-kafka / kafka.utils.UtilsTest ==
[info] Test Starting: testSwallow
[info] Test Passed: testSwallow
[info] Test Starting: testCircularIterator
[info] Test Passed: testCircularIterator
[info] == core-kafka / kafka.utils.UtilsTest ==
[info] 
[info] == core-kafka / kafka.message.ByteBufferMessageSetTest ==
[info] Test Starting: testWrittenEqualsRead
[info] Test Passed: testWrittenEqualsRead
[info] Test Starting: testIteratorIsConsistent
[info] Test Passed: testIteratorIsConsistent
[info] Test Starting: testSizeInBytes
[info] Test Passed: testSizeInBytes
[info] Test Starting: testWriteTo
[info] Test Passed: testWriteTo
[info] Test Starting: testSmallFetchSize
[info] Test Passed: testSmallFetchSize
[info] Test Starting: testValidBytes
[info] Test Passed: testValidBytes
[info] Test Starting: testValidBytesWithCompression
[info] Test Passed: testValidBytesWithCompression
[info] Test Starting: testEquals
[info] Test Passed: testEquals
[info] Test Starting: testIterator
[info] Test Passed: testIterator
[info] == core-kafka / kafka.message.ByteBufferMessageSetTest ==
[info] 
[info] == core-kafka / kafka.javaapi.consumer.ZookeeperConsumerConnectorTest
==
[info] Test Starting: testBasic(kafka.javaapi.consumer.ZookeeperConsumerConnectorTest)
[info] Test Passed: testBasic(kafka.javaapi.consumer.ZookeeperConsumerConnectorTest)
[info] == core-kafka / kafka.javaapi.consumer.ZookeeperConsumerConnectorTest
==
[info] 
[info] == core-kafka / kafka.server.LogRecoveryTest ==
[info] Test Starting: testHWCheckpointNoFailuresSingleLogSegment(kafka.server.LogRecoveryTest)
[info] Test Passed: testHWCheckpointNoFailuresSingleLogSegment(kafka.server.LogRecoveryTest)
[info] Test Starting: testHWCheckpointWithFailuresSingleLogSegment(kafka.server.LogRecoveryTest)
[info] Test Passed: testHWCheckpointWithFailuresSingleLogSegment(kafka.server.LogRecoveryTest)
[info] Test Starting: testHWCheckpointNoFailuresMultipleLogSegments(kafka.server.LogRecoveryTest)
[info] Test Passed: testHWCheckpointNoFailuresMultipleLogSegments(kafka.server.LogRecoveryTest)
[info] Test Starting: testHWCheckpointWithFailuresMultipleLogSegments(kafka.server.LogRecoveryTest)
[info] Test Passed: testHWCheckpointWithFailuresMultipleLogSegments(kafka.server.LogRecoveryTest)
[info] == core-kafka / kafka.server.LogRecoveryTest ==
[info] 
[info] == core-kafka / kafka.server.ReplicaFetchTest ==
[info] Test Starting: testReplicaFetcherThread(kafka.server.ReplicaFetchTest)
[info] Test Passed: testReplicaFetcherThread(kafka.server.ReplicaFetchTest)
[info] == core-kafka / kafka.server.ReplicaFetchTest ==
[info] 
[info] == core-kafka / kafka.server.LeaderElectionTest ==
[info] Test Starting: testLeaderElectionAndEpoch(kafka.server.LeaderElectionTest)
[info] Test Passed: testLeaderElectionAndEpoch(kafka.server.LeaderElectionTest)
[info] == core-kafka / kafka.server.LeaderElectionTest ==
[info] 
[info] == core-kafka / kafka.zk.ZKEphemeralTest ==
[info] Test Starting: testEphemeralNodeCleanup(kafka.zk.ZKEphemeralTest)
[info] Test Passed: testEphemeralNodeCleanup(kafka.zk.ZKEphemeralTest)
[info] == core-kafka / kafka.zk.ZKEphemeralTest ==
[info] 
[info] == core-kafka / kafka.server.ISRExpirationTest ==
[info] Test Starting: testISRExpirationForStuckFollowers(kafka.server.ISRExpirationTest)
[info] Test Passed: testISRExpirationForStuckFollowers(kafka.server.ISRExpirationTest)
[info] Test Starting: testISRExpirationForSlowFollowers(kafka.server.ISRExpirationTest)
[info] Test Passed: testISRExpirationForSlowFollowers(kafka.server.ISRExpirationTest)
[info] == core-kafka / kafka.server.ISRExpirationTest ==
[info] 
[info] == core-kafka / kafka.consumer.ZookeeperConsumerConnectorTest ==
[info] Test Starting: testBasic(kafka.consumer.ZookeeperConsumerConnectorTest)
[info] Test Passed: testBasic(kafka.consumer.ZookeeperConsumerConnectorTest)
[info] Test Starting: testCompression(kafka.consumer.ZookeeperConsumerConnectorTest)
[info] Test Passed: testCompression(kafka.consumer.ZookeeperConsumerConnectorTest)
[info] Test Starting: testCompressionSetConsumption(kafka.consumer.ZookeeperConsumerConnectorTest)
[info] Test Passed: testCompressionSetConsumption(kafka.consumer.ZookeeperConsumerConnectorTest)
[info] Test Starting: testConsumerDecoder(kafka.consumer.ZookeeperConsumerConnectorTest)
[info] Test Passed: testConsumerDecoder(kafka.consumer.ZookeeperConsumerConnectorTest)
[info] Test Starting: testLeaderSelectionForPartition(kafka.consumer.ZookeeperConsumerConnectorTest)
[info] Test Passed: testLeaderSelectionForPartition(kafka.consumer.ZookeeperConsumerConnectorTest)
[info] == core-kafka / kafka.consumer.ZookeeperConsumerConnectorTest ==
[info] 
[info] == core-kafka / kafka.producer.SyncProducerTest ==
[info] Test Starting: testReachableServer(kafka.producer.SyncProducerTest)
[info] Test Passed: testReachableServer(kafka.producer.SyncProducerTest)
[info] Test Starting: testEmptyProduceRequest(kafka.producer.SyncProducerTest)
[info] Test Passed: testEmptyProduceRequest(kafka.producer.SyncProducerTest)
[info] Test Starting: testSingleMessageSizeTooLarge(kafka.producer.SyncProducerTest)
[info] Test Passed: testSingleMessageSizeTooLarge(kafka.producer.SyncProducerTest)
[info] Test Starting: testCompressedMessageSizeTooLarge(kafka.producer.SyncProducerTest)
[info] Test Passed: testCompressedMessageSizeTooLarge(kafka.producer.SyncProducerTest)
[info] Test Starting: testProduceCorrectlyReceivesResponse(kafka.producer.SyncProducerTest)
[info] Test Passed: testProduceCorrectlyReceivesResponse(kafka.producer.SyncProducerTest)
[info] Test Starting: testProducerCanTimeout(kafka.producer.SyncProducerTest)
[info] Test Passed: testProducerCanTimeout(kafka.producer.SyncProducerTest)
[info] == core-kafka / kafka.producer.SyncProducerTest ==
[info] 
[info] == core-kafka / kafka.integration.PrimitiveApiTest ==
[info] Test Starting: testProduceAndMultiFetch(kafka.integration.PrimitiveApiTest)
[info] Test Passed: testProduceAndMultiFetch(kafka.integration.PrimitiveApiTest)
[info] Test Starting: testMultiProduce(kafka.integration.PrimitiveApiTest)
[info] Test Passed: testMultiProduce(kafka.integration.PrimitiveApiTest)
[info] Test Starting: testFetchRequestCanProperlySerialize(kafka.integration.PrimitiveApiTest)
[info] Test Passed: testFetchRequestCanProperlySerialize(kafka.integration.PrimitiveApiTest)
[info] Test Starting: testFetchRequestEnforcesUniqueTopicsForOffsetDetails(kafka.integration.PrimitiveApiTest)
[info] Test Passed: testFetchRequestEnforcesUniqueTopicsForOffsetDetails(kafka.integration.PrimitiveApiTest)
[info] Test Starting: testEmptyFetchRequest(kafka.integration.PrimitiveApiTest)
[info] Test Passed: testEmptyFetchRequest(kafka.integration.PrimitiveApiTest)
[info] Test Starting: testDefaultEncoderProducerAndFetch(kafka.integration.PrimitiveApiTest)
[info] Test Passed: testDefaultEncoderProducerAndFetch(kafka.integration.PrimitiveApiTest)
[info] Test Starting: testDefaultEncoderProducerAndFetchWithCompression(kafka.integration.PrimitiveApiTest)
[info] Test Passed: testDefaultEncoderProducerAndFetchWithCompression(kafka.integration.PrimitiveApiTest)
[info] Test Starting: testProduceAndMultiFetchWithCompression(kafka.integration.PrimitiveApiTest)
[info] Test Passed: testProduceAndMultiFetchWithCompression(kafka.integration.PrimitiveApiTest)
[info] Test Starting: testMultiProduceWithCompression(kafka.integration.PrimitiveApiTest)
[info] Test Passed: testMultiProduceWithCompression(kafka.integration.PrimitiveApiTest)
[info] Test Starting: testConsumerEmptyTopic(kafka.integration.PrimitiveApiTest)
[info] Test Passed: testConsumerEmptyTopic(kafka.integration.PrimitiveApiTest)
[info] == core-kafka / kafka.integration.PrimitiveApiTest ==
[info] 
[info] == core-kafka / kafka.javaapi.message.ByteBufferMessageSetTest ==
[info] Test Starting: testWrittenEqualsRead
[info] Test Passed: testWrittenEqualsRead
[info] Test Starting: testIteratorIsConsistent
[info] Test Passed: testIteratorIsConsistent
[info] Test Starting: testSizeInBytes
[info] Test Passed: testSizeInBytes
[info] Test Starting: testEquals
[info] Test Passed: testEquals
[info] Test Starting: testIteratorIsConsistentWithCompression
[info] Test Passed: testIteratorIsConsistentWithCompression
[info] Test Starting: testSizeInBytesWithCompression
[info] Test Passed: testSizeInBytesWithCompression
[info] Test Starting: testEqualsWithCompression
[info] Test Passed: testEqualsWithCompression
[info] == core-kafka / kafka.javaapi.message.ByteBufferMessageSetTest ==
[info] 
[info] == core-kafka / kafka.message.FileMessageSetTest ==
[info] Test Starting: testWrittenEqualsRead
[info] Test Passed: testWrittenEqualsRead
[info] Test Starting: testIteratorIsConsistent
[info] Test Passed: testIteratorIsConsistent
[info] Test Starting: testSizeInBytes
[info] Test Passed: testSizeInBytes
[info] Test Starting: testWriteTo
[info] Test Passed: testWriteTo
[info] Test Starting: testFileSize
[info] Test Passed: testFileSize
[info] Test Starting: testIterationOverPartialAndTruncation
[info] Test Passed: testIterationOverPartialAndTruncation
[info] Test Starting: testIterationDoesntChangePosition
[info] Test Passed: testIterationDoesntChangePosition
[info] Test Starting: testRead
[info] Test Passed: testRead
[info] == core-kafka / kafka.message.FileMessageSetTest ==
[info] 
[info] == core-kafka / kafka.consumer.TopicFilterTest ==
[info] Test Starting: testWhitelists
[info] Test Passed: testWhitelists
[info] Test Starting: testBlacklists
[info] Test Passed: testBlacklists
[info] == core-kafka / kafka.consumer.TopicFilterTest ==
[info] 
[info] == core-kafka / Test cleanup 1 ==
[info] Deleting directory /var/tmp/sbt_7ae428e4
[info] == core-kafka / Test cleanup 1 ==
[info] 
[info] == core-kafka / test-finish ==
[error] Failed: : Total 138, Failed 4, Errors 0, Passed 134, Skipped 0
[info] == core-kafka / test-finish ==
[info] 
[info] == core-kafka / test-cleanup ==
[info] == core-kafka / test-cleanup ==
[error] Error running kafka.log4j.KafkaLog4jAppenderTest: Test FAILED
[error] Error running kafka.message.CompressionUtilTest: Test FAILED
[error] Error running test: One or more subtasks failed
[error] Error running kafka.producer.AsyncProducerTest: Test FAILED
[error] Error running kafka.integration.LazyInitProducerTest: Test FAILED
[info] 
[info] Total time: 391 s, completed Sep 10, 2012 9:15:25 PM
[info] 
[info] Total session time: 392 s, completed Sep 10, 2012 9:15:25 PM
[error] Error during build.
Build step 'Execute shell' marked build as failure

Mime
View raw message