kafka-commits mailing list archives

Site index · List index
Message view « Date » · « Thread »
Top « Date » · « Thread »
From Apache Jenkins Server <jenk...@builds.apache.org>
Subject Build failed in Jenkins: Kafka-0.8 #43
Date Fri, 14 Sep 2012 02:13:59 GMT
See <https://builds.apache.org/job/Kafka-0.8/43/changes>

Changes:

[junrao] revisit broker config in 0.8; patched by Swapnil Ghike; reviewed by Jun Rao; KAFKA-325

------------------------------------------
[...truncated 5 lines...]
A         core/src/test/scala/unit/kafka/utils/TopicTest.scala
U         core/src/test/scala/unit/kafka/utils/TestUtils.scala
U         core/src/test/scala/unit/kafka/log/LogManagerTest.scala
U         core/src/test/scala/unit/kafka/integration/TopicMetadataTest.scala
U         core/src/test/scala/unit/kafka/server/SimpleFetchTest.scala
U         core/src/test/scala/unit/kafka/network/SocketServerTest.scala
U         core/src/main/scala/kafka/cluster/Replica.scala
U         core/src/main/scala/kafka/cluster/Partition.scala
D         core/src/main/scala/kafka/log/LogStats.scala
U         core/src/main/scala/kafka/log/Log.scala
U         core/src/main/scala/kafka/log/LogManager.scala
U         core/src/main/scala/kafka/producer/SyncProducer.scala
U         core/src/main/scala/kafka/producer/Producer.scala
D         core/src/main/scala/kafka/producer/async/AsyncProducerStatsMBean.scala
U         core/src/main/scala/kafka/producer/async/AsyncProducerStats.scala
U         core/src/main/scala/kafka/producer/async/DefaultEventHandler.scala
U         core/src/main/scala/kafka/producer/async/ProducerSendThread.scala
U         core/src/main/scala/kafka/message/FileMessageSet.scala
U         core/src/main/scala/kafka/admin/CreateTopicCommand.scala
D         core/src/main/scala/kafka/network/SocketServerStats.scala
U         core/src/main/scala/kafka/network/SocketServer.scala
U         core/src/main/scala/kafka/network/RequestChannel.scala
U         core/src/main/scala/kafka/consumer/ConsumerIterator.scala
U         core/src/main/scala/kafka/consumer/SimpleConsumer.scala
U         core/src/main/scala/kafka/consumer/ConsumerConnector.scala
U         core/src/main/scala/kafka/consumer/PartitionTopicInfo.scala
U         core/src/main/scala/kafka/consumer/ConsumerTopicStat.scala
U         core/src/main/scala/kafka/consumer/ZookeeperConsumerConnector.scala
U         core/src/main/scala/kafka/utils/Utils.scala
U         core/src/main/scala/kafka/utils/Pool.scala
A         core/src/main/scala/kafka/utils/Topic.scala
U         core/src/main/scala/kafka/metrics/KafkaMetricsGroup.scala
U         core/src/main/scala/kafka/server/KafkaConfig.scala
U         core/src/main/scala/kafka/server/KafkaServer.scala
U         core/src/main/scala/kafka/server/RequestPurgatory.scala
U         core/src/main/scala/kafka/server/ReplicaManager.scala
U         core/src/main/scala/kafka/server/KafkaController.scala
U         core/src/main/scala/kafka/server/KafkaRequestHandler.scala
U         core/src/main/scala/kafka/server/KafkaApis.scala
U         core/src/main/scala/kafka/server/AbstractFetcherThread.scala
U         core/src/main/scala/kafka/api/StopReplicaRequest.scala
U         core/src/main/scala/kafka/api/OffsetRequest.scala
U         core/src/main/scala/kafka/api/FetchRequest.scala
U         core/src/main/scala/kafka/api/RequestKeys.scala
U         core/src/main/scala/kafka/api/LeaderAndIsrRequest.scala
U         core/src/main/scala/kafka/api/TopicMetadataRequest.scala
U         core/src/main/scala/kafka/api/ProducerRequest.scala
U         core/src/main/scala/kafka/javaapi/ProducerRequest.scala
At revision 1384629
[Kafka-0.8] $ /bin/bash -xe /var/tmp/hudson3795267082552113480.sh
+ ./sbt update
[info] Building project Kafka 0.8.0 against Scala 2.8.0
[info]    using KafkaProject with sbt 0.7.5 and Scala 2.7.7
[info] 
[info] == core-kafka / update ==
[info] :: retrieving :: kafka#core-kafka_2.8.0 [sync]
[info] 	confs: [compile, runtime, test, provided, system, optional, sources,
javadoc]
[info] 	0 artifacts copied, 12 already retrieved (0kB/87ms)
[info] == core-kafka / update ==
[info] 
[info] == hadoop producer / update ==
[info] :: retrieving :: kafka#hadoop-producer_2.8.0 [sync]
[info] 	confs: [compile, runtime, test, provided, system, optional, sources,
javadoc]
[info] 	0 artifacts copied, 40 already retrieved (0kB/66ms)
[info] == hadoop producer / update ==
[info] 
[info] == hadoop consumer / update ==
[info] :: retrieving :: kafka#hadoop-consumer_2.8.0 [sync]
[info] 	confs: [compile, runtime, test, provided, system, optional, sources,
javadoc]
[info] 	0 artifacts copied, 37 already retrieved (0kB/63ms)
[info] == hadoop consumer / update ==
[info] 
[info] == contrib / update ==
[warn] No dependency configuration found, using defaults.
[info] :: retrieving :: kafka#contrib_2.8.0 [sync]
[info] 	confs: [default]
[info] 	0 artifacts copied, 0 already retrieved (0kB/2ms)
[info] == contrib / update ==
[info] 
[info] == perf / update ==
[info] :: retrieving :: kafka#perf_2.8.0 [sync]
[info] 	confs: [compile, runtime, test, provided, system, optional, sources,
javadoc]
[info] 	0 artifacts copied, 5 already retrieved (0kB/41ms)
[info] == perf / update ==
[info] 
[info] == java-examples / update ==
[info] :: retrieving :: kafka#java-examples_2.8.0 [sync]
[info] 	confs: [compile, runtime, test, provided, system, optional, sources,
javadoc]
[info] 	0 artifacts copied, 5 already retrieved (0kB/27ms)
[info] == java-examples / update ==
[info] 
[info] == Kafka / update ==
[info] :: retrieving :: kafka#kafka_2.8.0 [sync]
[info] 	confs: [compile, runtime, test, provided, system, optional, sources,
javadoc]
[info] 	0 artifacts copied, 8 already retrieved (0kB/223ms)
[info] == Kafka / update ==
[success] Successful.
[info] 
[info] Total time: 27 s, completed Sep 14, 2012 2:12:20 AM
[info] 
[info] Total session time: 32 s, completed Sep 14, 2012 2:12:20 AM
[success] Build completed successfully.
[Kafka-0.8] $ /bin/bash -xe /var/tmp/hudson3758644180412537828.sh
+ ./sbt test
[info] Building project Kafka 0.8.0 against Scala 2.8.0
[info]    using KafkaProject with sbt 0.7.5 and Scala 2.7.7
[info] 
[info] == core-kafka / compile ==
[info]   Source analysis: 39 new/modified, 83 indirectly invalidated, 3 removed.
[info] Compiling main sources...
[warn] there were unchecked warnings; re-run with -unchecked for details
[warn] one warning found
java.io.IOException: Cannot run program "javac": error=12, Not enough space
	at java.lang.ProcessBuilder.start(ProcessBuilder.java:460)
	at sbt.SimpleProcessBuilder.run(ProcessImpl.scala:381)
	at sbt.AbstractProcessBuilder.run(ProcessImpl.scala:132)
	at sbt.AbstractProcessBuilder$$anonfun$runBuffered$1.apply(ProcessImpl.scala:165)
	at sbt.AbstractProcessBuilder$$anonfun$runBuffered$1.apply(ProcessImpl.scala:165)
	at sbt.BufferedLogger.bufferAll(Logger.scala:179)
	at sbt.AbstractProcessBuilder.runBuffered(ProcessImpl.scala:165)
	at sbt.AbstractProcessBuilder.$bang(ProcessImpl.scala:160)
	at sbt.Compile.externalJavac$1(Compile.scala:94)
	at sbt.Compile$$anonfun$forkJavac$2.apply(Compile.scala:95)
	at sbt.Compile$$anonfun$forkJavac$2.apply(Compile.scala:95)
	at sbt.WithArgumentFile$$anonfun$withArgumentFile$1.apply(Compile.scala:117)
	at sbt.WithArgumentFile$$anonfun$withArgumentFile$1.apply(Compile.scala:114)
	at xsbt.FileUtilities$.withTemporaryDirectory(FileUtilities.scala:169)
	at sbt.WithArgumentFile$class.withArgumentFile(Compile.scala:114)
	at sbt.Compile.withArgumentFile(Compile.scala:71)
	at sbt.Compile.forkJavac(Compile.scala:95)
	at sbt.Compile.processJava(Compile.scala:86)
	at sbt.CompilerCore$$anonfun$2.apply(Compile.scala:28)
	at sbt.CompilerCore$$anonfun$2.apply(Compile.scala:28)
	at sbt.CompilerCore$$anonfun$process$1$1.apply(Compile.scala:22)
	at sbt.CompilerCore$$anonfun$process$1$1.apply(Compile.scala:22)
	at sbt.CompilerCore$$anonfun$doCompile$3.apply(Compile.scala:46)
	at sbt.CompilerCore$$anonfun$doCompile$3.apply(Compile.scala:42)
	at scala.Option.orElse(Option.scala:102)
	at sbt.CompilerCore.doCompile(Compile.scala:41)
	at sbt.CompilerCore.apply(Compile.scala:29)
	at sbt.AbstractCompileConditional.run$1(Conditional.scala:341)
	at sbt.AbstractCompileConditional$$anonfun$3.apply(Conditional.scala:344)
	at sbt.AbstractCompileConditional$$anonfun$3.apply(Conditional.scala:344)
	at sbt.classfile.Analyze$.apply(Analyze.scala:110)
	at sbt.AbstractCompileConditional.execute(Conditional.scala:344)
	at sbt.Conditional$class.run(Conditional.scala:43)
	at sbt.AbstractCompileConditional.run(Conditional.scala:231)
	at sbt.BasicScalaProject.sbt$BasicScalaProject$$doCompile(DefaultProject.scala:260)
	at sbt.BasicScalaProject$$anonfun$compileAction$1.apply(DefaultProject.scala:274)
	at sbt.BasicScalaProject$$anonfun$compileAction$1.apply(DefaultProject.scala:274)
	at sbt.TaskManager$Task.invoke(TaskManager.scala:62)
	at sbt.impl.RunTask.doRun$1(RunTask.scala:77)
	at sbt.impl.RunTask.runTask(RunTask.scala:85)
	at sbt.impl.RunTask.sbt$impl$RunTask$$runIfNotRoot(RunTask.scala:60)
	at sbt.impl.RunTask$$anonfun$runTasksExceptRoot$2.apply(RunTask.scala:48)
	at sbt.impl.RunTask$$anonfun$runTasksExceptRoot$2.apply(RunTask.scala:48)
	at sbt.Distributor$Run$Worker$$anonfun$2.apply(ParallelRunner.scala:131)
	at sbt.Distributor$Run$Worker$$anonfun$2.apply(ParallelRunner.scala:131)
	at sbt.Control$.trapUnit(Control.scala:19)
	at sbt.Distributor$Run$Worker.run(ParallelRunner.scala:131)
Caused by: java.io.IOException: error=12, Not enough space
	at java.lang.UNIXProcess.forkAndExec(Native Method)
	at java.lang.UNIXProcess.<init>(UNIXProcess.java:53)
	at java.lang.ProcessImpl.start(ProcessImpl.java:65)
	at java.lang.ProcessBuilder.start(ProcessBuilder.java:453)
	at sbt.SimpleProcessBuilder.run(ProcessImpl.scala:381)
	at sbt.AbstractProcessBuilder.run(ProcessImpl.scala:132)
	at sbt.AbstractProcessBuilder$$anonfun$runBuffered$1.apply(ProcessImpl.scala:165)
	at sbt.AbstractProcessBuilder$$anonfun$runBuffered$1.apply(ProcessImpl.scala:165)
	at sbt.BufferedLogger.bufferAll(Logger.scala:179)
	at sbt.AbstractProcessBuilder.runBuffered(ProcessImpl.scala:165)
	at sbt.AbstractProcessBuilder.$bang(ProcessImpl.scala:160)
	at sbt.Compile.externalJavac$1(Compile.scala:94)
	at sbt.Compile$$anonfun$forkJavac$2.apply(Compile.scala:95)
	at sbt.Compile$$anonfun$forkJavac$2.apply(Compile.scala:95)
	at sbt.WithArgumentFile$$anonfun$withArgumentFile$1.apply(Compile.scala:117)
	at sbt.WithArgumentFile$$anonfun$withArgumentFile$1.apply(Compile.scala:114)
	at xsbt.FileUtilities$.withTemporaryDirectory(FileUtilities.scala:169)
	at sbt.WithArgumentFile$class.withArgumentFile(Compile.scala:114)
	at sbt.Compile.withArgumentFile(Compile.scala:71)
	at sbt.Compile.forkJavac(Compile.scala:95)
	at sbt.Compile.processJava(Compile.scala:86)
	at sbt.CompilerCore$$anonfun$2.apply(Compile.scala:28)
	at sbt.CompilerCore$$anonfun$2.apply(Compile.scala:28)
	at sbt.CompilerCore$$anonfun$process$1$1.apply(Compile.scala:22)
	at sbt.CompilerCore$$anonfun$process$1$1.apply(Compile.scala:22)
	at sbt.CompilerCore$$anonfun$doCompile$3.apply(Compile.scala:46)
	at sbt.CompilerCore$$anonfun$doCompile$3.apply(Compile.scala:42)
	at scala.Option.orElse(Option.scala:102)
	at sbt.CompilerCore.doCompile(Compile.scala:41)
	at sbt.CompilerCore.apply(Compile.scala:29)
	at sbt.AbstractCompileConditional.run$1(Conditional.scala:341)
	at sbt.AbstractCompileConditional$$anonfun$3.apply(Conditional.scala:344)
	at sbt.AbstractCompileConditional$$anonfun$3.apply(Conditional.scala:344)
	at sbt.classfile.Analyze$.apply(Analyze.scala:110)
	at sbt.AbstractCompileConditional.execute(Conditional.scala:344)
	at sbt.Conditional$class.run(Conditional.scala:43)
	at sbt.AbstractCompileConditional.run(Conditional.scala:231)
	at sbt.BasicScalaProject.sbt$BasicScalaProject$$doCompile(DefaultProject.scala:260)
	at sbt.BasicScalaProject$$anonfun$compileAction$1.apply(DefaultProject.scala:274)
	at sbt.BasicScalaProject$$anonfun$compileAction$1.apply(DefaultProject.scala:274)
	at sbt.TaskManager$Task.invoke(TaskManager.scala:62)
	at sbt.impl.RunTask.doRun$1(RunTask.scala:77)
	at sbt.impl.RunTask.runTask(RunTask.scala:85)
	at sbt.impl.RunTask.sbt$impl$RunTask$$runIfNotRoot(RunTask.scala:60)
	at sbt.impl.RunTask$$anonfun$runTasksExceptRoot$2.apply(RunTask.scala:48)
	at sbt.impl.RunTask$$anonfun$runTasksExceptRoot$2.apply(RunTask.scala:48)
	at sbt.Distributor$Run$Worker$$anonfun$2.apply(ParallelRunner.scala:131)
	at sbt.Distributor$Run$Worker$$anonfun$2.apply(ParallelRunner.scala:131)
	at sbt.Control$.trapUnit(Control.scala:19)
	at sbt.Distributor$Run$Worker.run(ParallelRunner.scala:131)
[info] == core-kafka / compile ==
[info] 
[info] == core-kafka / copy-test-resources ==
[info] == core-kafka / copy-test-resources ==
[info] 
[info] == core-kafka / copy-resources ==
[info] == core-kafka / copy-resources ==
[info] 
[info] == perf / copy-test-resources ==
[info] == perf / copy-test-resources ==
[info] 
[info] == hadoop consumer / copy-resources ==
[info] == hadoop consumer / copy-resources ==
[info] 
[info] == hadoop consumer / copy-test-resources ==
[info] == hadoop consumer / copy-test-resources ==
[info] 
[info] == java-examples / copy-test-resources ==
[info] == java-examples / copy-test-resources ==
[info] 
[info] == perf / copy-resources ==
[info] == perf / copy-resources ==
[info] 
[info] == hadoop producer / copy-test-resources ==
[info] == hadoop producer / copy-test-resources ==
[info] 
[info] == hadoop producer / copy-resources ==
[info] == hadoop producer / copy-resources ==
[info] 
[info] == java-examples / copy-resources ==
[info] == java-examples / copy-resources ==
[error] Error running compile: java.io.IOException: Cannot run program "javac":
error=12, Not enough space
[info] 
[info] Total time: 106 s, completed Sep 14, 2012 2:14:17 AM
[info] 
[info] Total session time: 109 s, completed Sep 14, 2012 2:14:17 AM
[error] Error during build.
Build step 'Execute shell' marked build as failure

Mime
View raw message