kafka-commits mailing list archives

Site index · List index
Message view « Date » · « Thread »
Top « Date » · « Thread »
From Apache Jenkins Server <jenk...@builds.apache.org>
Subject Build failed in Jenkins: Kafka-0.8 #53
Date Sat, 29 Sep 2012 02:15:10 GMT
See <https://builds.apache.org/job/Kafka-0.8/53/changes>

Changes:

[joestein] KAFKA-538 missing apache license header in sbt and util.h

------------------------------------------
[...truncated 1172 lines...]
[info] 
[info] == core-kafka / kafka.server.LogRecoveryTest ==
[info] Test Starting: testHWCheckpointNoFailuresSingleLogSegment(kafka.server.LogRecoveryTest)
[info] Test Passed: testHWCheckpointNoFailuresSingleLogSegment(kafka.server.LogRecoveryTest)
[info] Test Starting: testHWCheckpointWithFailuresSingleLogSegment(kafka.server.LogRecoveryTest)
[info] Test Passed: testHWCheckpointWithFailuresSingleLogSegment(kafka.server.LogRecoveryTest)
[info] Test Starting: testHWCheckpointNoFailuresMultipleLogSegments(kafka.server.LogRecoveryTest)
[info] Test Passed: testHWCheckpointNoFailuresMultipleLogSegments(kafka.server.LogRecoveryTest)
[info] Test Starting: testHWCheckpointWithFailuresMultipleLogSegments(kafka.server.LogRecoveryTest)
[info] Test Passed: testHWCheckpointWithFailuresMultipleLogSegments(kafka.server.LogRecoveryTest)
[info] == core-kafka / kafka.server.LogRecoveryTest ==
[info] 
[info] == core-kafka / kafka.consumer.TopicFilterTest ==
[info] Test Starting: testWhitelists
[info] Test Passed: testWhitelists
[info] Test Starting: testBlacklists
[info] Test Passed: testBlacklists
[info] == core-kafka / kafka.consumer.TopicFilterTest ==
[info] 
[info] == core-kafka / kafka.network.SocketServerTest ==
[info] Test Starting: simpleRequest
[info] Test Passed: simpleRequest
[info] Test Starting: tooBigRequestIsRejected
[info] Test Passed: tooBigRequestIsRejected
[info] == core-kafka / kafka.network.SocketServerTest ==
[info] 
[info] == core-kafka / kafka.server.RequestPurgatoryTest ==
[info] Test Starting: testRequestSatisfaction(kafka.server.RequestPurgatoryTest)
[info] Test Passed: testRequestSatisfaction(kafka.server.RequestPurgatoryTest)
[info] Test Starting: testRequestExpiry(kafka.server.RequestPurgatoryTest)
[info] Test Passed: testRequestExpiry(kafka.server.RequestPurgatoryTest)
[info] == core-kafka / kafka.server.RequestPurgatoryTest ==
[info] 
[info] == core-kafka / kafka.integration.LazyInitProducerTest ==
[info] Test Starting: testProduceAndMultiFetch(kafka.integration.LazyInitProducerTest)
[info] Test Passed: testProduceAndMultiFetch(kafka.integration.LazyInitProducerTest)
[info] Test Starting: testMultiProduce(kafka.integration.LazyInitProducerTest)
[info] Test Passed: testMultiProduce(kafka.integration.LazyInitProducerTest)
[info] Test Starting: testProduceAndFetch(kafka.integration.LazyInitProducerTest)
[info] Test Passed: testProduceAndFetch(kafka.integration.LazyInitProducerTest)
[info] Test Starting: testMultiProduceResend(kafka.integration.LazyInitProducerTest)
[info] Test Passed: testMultiProduceResend(kafka.integration.LazyInitProducerTest)
[info] == core-kafka / kafka.integration.LazyInitProducerTest ==
[info] 
[info] == core-kafka / kafka.producer.ProducerTest ==
[info] Test Starting: testUpdateBrokerPartitionInfo(kafka.producer.ProducerTest)
[info] Test Passed: testUpdateBrokerPartitionInfo(kafka.producer.ProducerTest)
[info] Test Starting: testSendToNewTopic(kafka.producer.ProducerTest)
[info] Test Passed: testSendToNewTopic(kafka.producer.ProducerTest)
[info] Test Starting: testSendWithDeadBroker(kafka.producer.ProducerTest)
[info] Test Passed: testSendWithDeadBroker(kafka.producer.ProducerTest)
[info] Test Starting: testAsyncSendCanCorrectlyFailWithTimeout(kafka.producer.ProducerTest)
[info] Test Passed: testAsyncSendCanCorrectlyFailWithTimeout(kafka.producer.ProducerTest)
[info] == core-kafka / kafka.producer.ProducerTest ==
[info] 
[info] == core-kafka / kafka.utils.UtilsTest ==
[info] Test Starting: testSwallow
[info] Test Passed: testSwallow
[info] Test Starting: testCircularIterator
[info] Test Passed: testCircularIterator
[info] == core-kafka / kafka.utils.UtilsTest ==
[info] 
[info] == core-kafka / kafka.consumer.FetcherTest ==
[info] Test Starting: testFetcher(kafka.consumer.FetcherTest)
[info] Test Passed: testFetcher(kafka.consumer.FetcherTest)
[info] == core-kafka / kafka.consumer.FetcherTest ==
[info] 
[info] == core-kafka / kafka.consumer.ZookeeperConsumerConnectorTest ==
[info] Test Starting: testBasic(kafka.consumer.ZookeeperConsumerConnectorTest)
[info] Test Passed: testBasic(kafka.consumer.ZookeeperConsumerConnectorTest)
[info] Test Starting: testCompression(kafka.consumer.ZookeeperConsumerConnectorTest)
[info] Test Passed: testCompression(kafka.consumer.ZookeeperConsumerConnectorTest)
[info] Test Starting: testCompressionSetConsumption(kafka.consumer.ZookeeperConsumerConnectorTest)
[info] Test Passed: testCompressionSetConsumption(kafka.consumer.ZookeeperConsumerConnectorTest)
[info] Test Starting: testConsumerDecoder(kafka.consumer.ZookeeperConsumerConnectorTest)
[info] Test Passed: testConsumerDecoder(kafka.consumer.ZookeeperConsumerConnectorTest)
[info] Test Starting: testLeaderSelectionForPartition(kafka.consumer.ZookeeperConsumerConnectorTest)
[info] Test Passed: testLeaderSelectionForPartition(kafka.consumer.ZookeeperConsumerConnectorTest)
[info] == core-kafka / kafka.consumer.ZookeeperConsumerConnectorTest ==
[info] 
[info] == core-kafka / kafka.log.LogOffsetTest ==
[info] Test Starting: testGetOffsetsForUnknownTopic(kafka.log.LogOffsetTest)
[info] Test Passed: testGetOffsetsForUnknownTopic(kafka.log.LogOffsetTest)
[info] Test Starting: testGetOffsetsBeforeLatestTime(kafka.log.LogOffsetTest)
[info] Test Passed: testGetOffsetsBeforeLatestTime(kafka.log.LogOffsetTest)
[info] Test Starting: testEmptyLogsGetOffsets(kafka.log.LogOffsetTest)
[info] Test Passed: testEmptyLogsGetOffsets(kafka.log.LogOffsetTest)
[info] Test Starting: testGetOffsetsBeforeNow(kafka.log.LogOffsetTest)
[info] Test Passed: testGetOffsetsBeforeNow(kafka.log.LogOffsetTest)
[info] Test Starting: testGetOffsetsBeforeEarliestTime(kafka.log.LogOffsetTest)
[info] Test Passed: testGetOffsetsBeforeEarliestTime(kafka.log.LogOffsetTest)
[info] == core-kafka / kafka.log.LogOffsetTest ==
[info] 
[info] == core-kafka / kafka.message.CompressionUtilTest ==
[info] Test Starting: testSimpleCompressDecompress
[info] Test Passed: testSimpleCompressDecompress
[info] Test Starting: testComplexCompressDecompress
[info] Test Passed: testComplexCompressDecompress
[info] Test Starting: testSnappyCompressDecompressExplicit
java.lang.reflect.InvocationTargetException
	at sun.reflect.NativeMethodAccessorImpl.invoke0(Native Method)
	at sun.reflect.NativeMethodAccessorImpl.invoke(NativeMethodAccessorImpl.java:39)
	at sun.reflect.DelegatingMethodAccessorImpl.invoke(DelegatingMethodAccessorImpl.java:25)
	at java.lang.reflect.Method.invoke(Method.java:597)
	at org.xerial.snappy.SnappyLoader.loadNativeLibrary(SnappyLoader.java:317)
	at org.xerial.snappy.SnappyLoader.load(SnappyLoader.java:219)
	at org.xerial.snappy.Snappy.<clinit>(Snappy.java:44)
	at org.xerial.snappy.SnappyOutputStream.<init>(SnappyOutputStream.java:79)
	at org.xerial.snappy.SnappyOutputStream.<init>(SnappyOutputStream.java:66)
	at kafka.message.SnappyCompression.<init>(CompressionUtils.scala:61)
	at kafka.message.CompressionFactory$.apply(CompressionUtils.scala:82)
	at kafka.message.CompressionUtils$.compress(CompressionUtils.scala:109)
	at kafka.message.CompressionUtilTest.testSnappyCompressDecompressExplicit(CompressionUtilsTest.scala:65)
	at sun.reflect.NativeMethodAccessorImpl.invoke0(Native Method)
	at sun.reflect.NativeMethodAccessorImpl.invoke(NativeMethodAccessorImpl.java:39)
	at sun.reflect.DelegatingMethodAccessorImpl.invoke(DelegatingMethodAccessorImpl.java:25)
	at java.lang.reflect.Method.invoke(Method.java:597)
	at org.junit.internal.runners.TestMethodRunner.executeMethodBody(TestMethodRunner.java:99)
	at org.junit.internal.runners.TestMethodRunner.runUnprotected(TestMethodRunner.java:81)
	at org.junit.internal.runners.BeforeAndAfterRunner.runProtected(BeforeAndAfterRunner.java:34)
	at org.junit.internal.runners.TestMethodRunner.runMethod(TestMethodRunner.java:75)
	at org.junit.internal.runners.TestMethodRunner.run(TestMethodRunner.java:45)
	at org.junit.internal.runners.TestClassMethodsRunner.invokeTestMethod(TestClassMethodsRunner.java:71)
	at org.junit.internal.runners.TestClassMethodsRunner.run(TestClassMethodsRunner.java:35)
	at org.junit.internal.runners.TestClassRunner$1.runUnprotected(TestClassRunner.java:42)
	at org.junit.internal.runners.BeforeAndAfterRunner.runProtected(BeforeAndAfterRunner.java:34)
	at org.junit.internal.runners.TestClassRunner.run(TestClassRunner.java:52)
	at org.junit.internal.runners.CompositeRunner.run(CompositeRunner.java:29)
	at org.junit.runner.JUnitCore.run(JUnitCore.java:121)
	at org.junit.runner.JUnitCore.run(JUnitCore.java:100)
	at org.junit.runner.JUnitCore.run(JUnitCore.java:91)
	at org.scalatest.junit.JUnitSuite$class.run(JUnitSuite.scala:261)
	at kafka.message.CompressionUtilTest.run(CompressionUtilsTest.scala:25)
	at org.scalatest.tools.ScalaTestFramework$ScalaTestRunner.run(ScalaTestFramework.scala:40)
	at sbt.TestRunner.run(TestFramework.scala:53)
	at sbt.TestRunner.runTest$1(TestFramework.scala:67)
	at sbt.TestRunner.run(TestFramework.scala:76)
	at sbt.TestFramework$$anonfun$10$$anonfun$apply$11.runTest$2(TestFramework.scala:194)
	at sbt.TestFramework$$anonfun$10$$anonfun$apply$11$$anonfun$apply$12.apply(TestFramework.scala:205)
	at sbt.TestFramework$$anonfun$10$$anonfun$apply$11$$anonfun$apply$12.apply(TestFramework.scala:205)
	at sbt.NamedTestTask.run(TestFramework.scala:92)
	at sbt.ScalaProject$$anonfun$sbt$ScalaProject$$toTask$1.apply(ScalaProject.scala:193)
	at sbt.ScalaProject$$anonfun$sbt$ScalaProject$$toTask$1.apply(ScalaProject.scala:193)
	at sbt.TaskManager$Task.invoke(TaskManager.scala:62)
	at sbt.impl.RunTask.doRun$1(RunTask.scala:77)
	at sbt.impl.RunTask.runTask(RunTask.scala:85)
	at sbt.impl.RunTask.sbt$impl$RunTask$$runIfNotRoot(RunTask.scala:60)
	at sbt.impl.RunTask$$anonfun$runTasksExceptRoot$2.apply(RunTask.scala:48)
	at sbt.impl.RunTask$$anonfun$runTasksExceptRoot$2.apply(RunTask.scala:48)
	at sbt.Distributor$Run$Worker$$anonfun$2.apply(ParallelRunner.scala:131)
	at sbt.Distributor$Run$Worker$$anonfun$2.apply(ParallelRunner.scala:131)
	at sbt.Control$.trapUnit(Control.scala:19)
	at sbt.Distributor$Run$Worker.run(ParallelRunner.scala:131)
Caused by: java.lang.UnsatisfiedLinkError: no snappyjava in java.library.path
	at java.lang.ClassLoader.loadLibrary(ClassLoader.java:1734)
	at java.lang.Runtime.loadLibrary0(Runtime.java:823)
	at java.lang.System.loadLibrary(System.java:1028)
	at org.xerial.snappy.SnappyNativeLoader.loadLibrary(SnappyNativeLoader.java:52)
	... 53 more
[error] Test Failed: testSnappyCompressDecompressExplicit
org.xerial.snappy.SnappyError: [FAILED_TO_LOAD_NATIVE_LIBRARY] null
	at org.xerial.snappy.SnappyLoader.load(SnappyLoader.java:229)
	at org.xerial.snappy.Snappy.<clinit>(Snappy.java:44)
	at org.xerial.snappy.SnappyOutputStream.<init>(SnappyOutputStream.java:79)
	at org.xerial.snappy.SnappyOutputStream.<init>(SnappyOutputStream.java:66)
	at kafka.message.SnappyCompression.<init>(CompressionUtils.scala:61)
	at kafka.message.CompressionFactory$.apply(CompressionUtils.scala:82)
	at kafka.message.CompressionUtils$.compress(CompressionUtils.scala:109)
	at kafka.message.CompressionUtilTest.testSnappyCompressDecompressExplicit(CompressionUtilsTest.scala:65)
	at sun.reflect.NativeMethodAccessorImpl.invoke0(Native Method)
	at sun.reflect.NativeMethodAccessorImpl.invoke(NativeMethodAccessorImpl.java:39)
	at sun.reflect.DelegatingMethodAccessorImpl.invoke(DelegatingMethodAccessorImpl.java:25)
	at java.lang.reflect.Method.invoke(Method.java:597)
	at org.junit.internal.runners.TestMethodRunner.executeMethodBody(TestMethodRunner.java:99)
	at org.junit.internal.runners.TestMethodRunner.runUnprotected(TestMethodRunner.java:81)
	at org.junit.internal.runners.BeforeAndAfterRunner.runProtected(BeforeAndAfterRunner.java:34)
	at org.junit.internal.runners.TestMethodRunner.runMethod(TestMethodRunner.java:75)
	at org.junit.internal.runners.TestMethodRunner.run(TestMethodRunner.java:45)
	at org.junit.internal.runners.TestClassMethodsRunner.invokeTestMethod(TestClassMethodsRunner.java:71)
	at org.junit.internal.runners.TestClassMethodsRunner.run(TestClassMethodsRunner.java:35)
	at org.junit.internal.runners.TestClassRunner$1.runUnprotected(TestClassRunner.java:42)
	at org.junit.internal.runners.BeforeAndAfterRunner.runProtected(BeforeAndAfterRunner.java:34)
	at org.junit.internal.runners.TestClassRunner.run(TestClassRunner.java:52)
	at org.junit.internal.runners.CompositeRunner.run(CompositeRunner.java:29)
	at org.junit.runner.JUnitCore.run(JUnitCore.java:121)
	at org.junit.runner.JUnitCore.run(JUnitCore.java:100)
	at org.junit.runner.JUnitCore.run(JUnitCore.java:91)
	at org.scalatest.junit.JUnitSuite$class.run(JUnitSuite.scala:261)
	at kafka.message.CompressionUtilTest.run(CompressionUtilsTest.scala:25)
	at org.scalatest.tools.ScalaTestFramework$ScalaTestRunner.run(ScalaTestFramework.scala:40)
	at sbt.TestRunner.run(TestFramework.scala:53)
	at sbt.TestRunner.runTest$1(TestFramework.scala:67)
	at sbt.TestRunner.run(TestFramework.scala:76)
	at sbt.TestFramework$$anonfun$10$$anonfun$apply$11.runTest$2(TestFramework.scala:194)
	at sbt.TestFramework$$anonfun$10$$anonfun$apply$11$$anonfun$apply$12.apply(TestFramework.scala:205)
	at sbt.TestFramework$$anonfun$10$$anonfun$apply$11$$anonfun$apply$12.apply(TestFramework.scala:205)
	at sbt.NamedTestTask.run(TestFramework.scala:92)
	at sbt.ScalaProject$$anonfun$sbt$ScalaProject$$toTask$1.apply(ScalaProject.scala:193)
	at sbt.ScalaProject$$anonfun$sbt$ScalaProject$$toTask$1.apply(ScalaProject.scala:193)
	at sbt.TaskManager$Task.invoke(TaskManager.scala:62)
	at sbt.impl.RunTask.doRun$1(RunTask.scala:77)
	at sbt.impl.RunTask.runTask(RunTask.scala:85)
	at sbt.impl.RunTask.sbt$impl$RunTask$$runIfNotRoot(RunTask.scala:60)
	at sbt.impl.RunTask$$anonfun$runTasksExceptRoot$2.apply(RunTask.scala:48)
	at sbt.impl.RunTask$$anonfun$runTasksExceptRoot$2.apply(RunTask.scala:48)
	at sbt.Distributor$Run$Worker$$anonfun$2.apply(ParallelRunner.scala:131)
	at sbt.Distributor$Run$Worker$$anonfun$2.apply(ParallelRunner.scala:131)
	at sbt.Control$.trapUnit(Control.scala:19)
	at sbt.Distributor$Run$Worker.run(ParallelRunner.scala:131)
[info] == core-kafka / kafka.message.CompressionUtilTest ==
[info] 
[info] == core-kafka / kafka.network.RpcDataSerializationTest ==
[info] Test Starting: testSerializationAndDeserialization
[info] Test Passed: testSerializationAndDeserialization
[info] == core-kafka / kafka.network.RpcDataSerializationTest ==
[info] 
[info] == core-kafka / kafka.log.LogCorruptionTest ==
[info] Test Starting: testMessageSizeTooLarge(kafka.log.LogCorruptionTest)
[info] Test Passed: testMessageSizeTooLarge(kafka.log.LogCorruptionTest)
[info] == core-kafka / kafka.log.LogCorruptionTest ==
[info] 
[info] == core-kafka / kafka.integration.TopicMetadataTest ==
[info] Test Starting: testTopicMetadataRequest(kafka.integration.TopicMetadataTest)
[info] Test Passed: testTopicMetadataRequest(kafka.integration.TopicMetadataTest)
[info] Test Starting: testBasicTopicMetadata(kafka.integration.TopicMetadataTest)
[info] Test Passed: testBasicTopicMetadata(kafka.integration.TopicMetadataTest)
[info] Test Starting: testAutoCreateTopic(kafka.integration.TopicMetadataTest)
[info] Test Passed: testAutoCreateTopic(kafka.integration.TopicMetadataTest)
[info] == core-kafka / kafka.integration.TopicMetadataTest ==
[info] 
[info] == core-kafka / Test cleanup 1 ==
[info] Deleting directory /var/tmp/sbt_e5c2a16d
[info] == core-kafka / Test cleanup 1 ==
[info] 
[info] == core-kafka / test-finish ==
[error] Failed: : Total 136, Failed 2, Errors 0, Passed 134, Skipped 0
[info] == core-kafka / test-finish ==
[info] 
[info] == core-kafka / test-cleanup ==
[info] == core-kafka / test-cleanup ==
[error] Error running kafka.integration.AutoOffsetResetTest: Test FAILED
[error] Error running kafka.message.CompressionUtilTest: Test FAILED
[error] Error running test: One or more subtasks failed
[info] 
[info] Total time: 225 s, completed Sep 29, 2012 2:15:41 AM
[info] 
[info] Total session time: 226 s, completed Sep 29, 2012 2:15:41 AM
[error] Error during build.
Build step 'Execute shell' marked build as failure

Mime
View raw message