kafka-commits mailing list archives

Site index · List index
Message view « Date » · « Thread »
Top « Date » · « Thread »
From Apache Jenkins Server <jenk...@builds.apache.org>
Subject Build failed in Jenkins: Kafka-0.8 #48
Date Wed, 19 Sep 2012 23:05:34 GMT
See <https://builds.apache.org/job/Kafka-0.8/48/changes>

Changes:

[junrao] javaapi support for getTopoicMetaData; patched by Swapnil Ghike; reviewed by Jun
Rao; KAFKA-500

------------------------------------------
[...truncated 1525 lines...]
[info] Test Starting: testIncompatibleEncoder(kafka.producer.AsyncProducerTest)
[info] Test Passed: testIncompatibleEncoder(kafka.producer.AsyncProducerTest)
[info] Test Starting: testRandomPartitioner(kafka.producer.AsyncProducerTest)
[info] Test Passed: testRandomPartitioner(kafka.producer.AsyncProducerTest)
[info] Test Starting: testBrokerListAndAsync(kafka.producer.AsyncProducerTest)
[info] Test Passed: testBrokerListAndAsync(kafka.producer.AsyncProducerTest)
[info] Test Starting: testFailedSendRetryLogic(kafka.producer.AsyncProducerTest)
[info] Test Passed: testFailedSendRetryLogic(kafka.producer.AsyncProducerTest)
[info] Test Starting: testJavaProducer(kafka.producer.AsyncProducerTest)
[info] Test Passed: testJavaProducer(kafka.producer.AsyncProducerTest)
[info] Test Starting: testInvalidConfiguration(kafka.producer.AsyncProducerTest)
[info] Test Passed: testInvalidConfiguration(kafka.producer.AsyncProducerTest)
[info] == core-kafka / kafka.producer.AsyncProducerTest ==
[info] 
[info] == core-kafka / kafka.integration.PrimitiveApiTest ==
[info] Test Starting: testProduceAndMultiFetch(kafka.integration.PrimitiveApiTest)
[info] Test Passed: testProduceAndMultiFetch(kafka.integration.PrimitiveApiTest)
[info] Test Starting: testMultiProduce(kafka.integration.PrimitiveApiTest)
[info] Test Passed: testMultiProduce(kafka.integration.PrimitiveApiTest)
[info] Test Starting: testFetchRequestCanProperlySerialize(kafka.integration.PrimitiveApiTest)
[info] Test Passed: testFetchRequestCanProperlySerialize(kafka.integration.PrimitiveApiTest)
[info] Test Starting: testEmptyFetchRequest(kafka.integration.PrimitiveApiTest)
[info] Test Passed: testEmptyFetchRequest(kafka.integration.PrimitiveApiTest)
[info] Test Starting: testDefaultEncoderProducerAndFetch(kafka.integration.PrimitiveApiTest)
[info] Test Passed: testDefaultEncoderProducerAndFetch(kafka.integration.PrimitiveApiTest)
[info] Test Starting: testDefaultEncoderProducerAndFetchWithCompression(kafka.integration.PrimitiveApiTest)
[info] Test Passed: testDefaultEncoderProducerAndFetchWithCompression(kafka.integration.PrimitiveApiTest)
[info] Test Starting: testProduceAndMultiFetchWithCompression(kafka.integration.PrimitiveApiTest)
[info] Test Passed: testProduceAndMultiFetchWithCompression(kafka.integration.PrimitiveApiTest)
[info] Test Starting: testMultiProduceWithCompression(kafka.integration.PrimitiveApiTest)
[info] Test Passed: testMultiProduceWithCompression(kafka.integration.PrimitiveApiTest)
[info] Test Starting: testConsumerEmptyTopic(kafka.integration.PrimitiveApiTest)
[info] Test Passed: testConsumerEmptyTopic(kafka.integration.PrimitiveApiTest)
[info] == core-kafka / kafka.integration.PrimitiveApiTest ==
[info] 
[info] == core-kafka / kafka.log.SegmentListTest ==
[info] Test Starting: testAppend
[info] Test Passed: testAppend
[info] Test Starting: testTrunc
[info] Test Passed: testTrunc
[info] Test Starting: testTruncLast
[info] Test Passed: testTruncLast
[info] == core-kafka / kafka.log.SegmentListTest ==
[info] 
[info] == core-kafka / kafka.producer.ProducerTest ==
[info] Test Starting: testUpdateBrokerPartitionInfo(kafka.producer.ProducerTest)
[info] Test Passed: testUpdateBrokerPartitionInfo(kafka.producer.ProducerTest)
[info] Test Starting: testSendToNewTopic(kafka.producer.ProducerTest)
[info] Test Passed: testSendToNewTopic(kafka.producer.ProducerTest)
[info] Test Starting: testSendWithDeadBroker(kafka.producer.ProducerTest)
[info] Test Passed: testSendWithDeadBroker(kafka.producer.ProducerTest)
[info] Test Starting: testAsyncSendCanCorrectlyFailWithTimeout(kafka.producer.ProducerTest)
[info] Test Passed: testAsyncSendCanCorrectlyFailWithTimeout(kafka.producer.ProducerTest)
[info] == core-kafka / kafka.producer.ProducerTest ==
[info] 
[info] == core-kafka / kafka.javaapi.message.ByteBufferMessageSetTest ==
[info] Test Starting: testWrittenEqualsRead
[info] Test Passed: testWrittenEqualsRead
[info] Test Starting: testIteratorIsConsistent
[info] Test Passed: testIteratorIsConsistent
[info] Test Starting: testSizeInBytes
[info] Test Passed: testSizeInBytes
[info] Test Starting: testEquals
[info] Test Passed: testEquals
[info] Test Starting: testIteratorIsConsistentWithCompression
[info] Test Passed: testIteratorIsConsistentWithCompression
[info] Test Starting: testSizeInBytesWithCompression
[info] Test Passed: testSizeInBytesWithCompression
[info] Test Starting: testEqualsWithCompression
[info] Test Passed: testEqualsWithCompression
[info] == core-kafka / kafka.javaapi.message.ByteBufferMessageSetTest ==
[info] 
[info] == core-kafka / kafka.log.LogTest ==
[info] Test Starting: testTimeBasedLogRoll
[info] Test Passed: testTimeBasedLogRoll
[info] Test Starting: testSizeBasedLogRoll
[info] Test Passed: testSizeBasedLogRoll
[info] Test Starting: testLoadEmptyLog
[info] Test Passed: testLoadEmptyLog
[info] Test Starting: testLoadInvalidLogsFails
[info] Test Passed: testLoadInvalidLogsFails
[info] Test Starting: testAppendAndRead
[info] Test Passed: testAppendAndRead
[info] Test Starting: testReadOutOfRange
[info] Test Passed: testReadOutOfRange
[info] Test Starting: testLogRolls
[info] Test Passed: testLogRolls
[info] Test Starting: testFindSegment
[info] Test Passed: testFindSegment
[info] Test Starting: testEdgeLogRolls
[info] Test Passed: testEdgeLogRolls
[info] Test Starting: testMessageSizeCheck
[info] Test Passed: testMessageSizeCheck
[info] Test Starting: testTruncateTo
[info] Test Passed: testTruncateTo
[info] == core-kafka / kafka.log.LogTest ==
[info] 
[info] == core-kafka / kafka.log.LogManagerTest ==
[info] Test Starting: testCreateLog(kafka.log.LogManagerTest)
[info] Test Passed: testCreateLog(kafka.log.LogManagerTest)
[info] Test Starting: testGetLog(kafka.log.LogManagerTest)
[info] Test Passed: testGetLog(kafka.log.LogManagerTest)
[info] Test Starting: testCleanupExpiredSegments(kafka.log.LogManagerTest)
[info] Test Passed: testCleanupExpiredSegments(kafka.log.LogManagerTest)
[info] Test Starting: testCleanupSegmentsToMaintainSize(kafka.log.LogManagerTest)
[info] Test Passed: testCleanupSegmentsToMaintainSize(kafka.log.LogManagerTest)
[info] Test Starting: testTimeBasedFlush(kafka.log.LogManagerTest)
[info] Test Passed: testTimeBasedFlush(kafka.log.LogManagerTest)
[info] == core-kafka / kafka.log.LogManagerTest ==
[info] 
[info] == core-kafka / kafka.network.SocketServerTest ==
[info] Test Starting: simpleRequest
[info] Test Passed: simpleRequest
[info] Test Starting: tooBigRequestIsRejected
[info] Test Passed: tooBigRequestIsRejected
[info] == core-kafka / kafka.network.SocketServerTest ==
[info] 
[info] == core-kafka / kafka.message.MessageTest ==
[info] Test Starting: testFieldValues
[info] Test Passed: testFieldValues
[info] Test Starting: testChecksum
[info] Test Passed: testChecksum
[info] Test Starting: testEquality
[info] Test Passed: testEquality
[info] Test Starting: testIsHashable
[info] Test Passed: testIsHashable
[info] == core-kafka / kafka.message.MessageTest ==
[info] 
[info] == core-kafka / kafka.integration.AutoOffsetResetTest ==
[info] Test Starting: testResetToEarliestWhenOffsetTooHigh(kafka.integration.AutoOffsetResetTest)
[info] Test Passed: testResetToEarliestWhenOffsetTooHigh(kafka.integration.AutoOffsetResetTest)
[info] Test Starting: testResetToEarliestWhenOffsetTooLow(kafka.integration.AutoOffsetResetTest)
[info] Test Passed: testResetToEarliestWhenOffsetTooLow(kafka.integration.AutoOffsetResetTest)
[info] Test Starting: testResetToLatestWhenOffsetTooHigh(kafka.integration.AutoOffsetResetTest)
[info] Test Passed: testResetToLatestWhenOffsetTooHigh(kafka.integration.AutoOffsetResetTest)
[info] Test Starting: testResetToLatestWhenOffsetTooLow(kafka.integration.AutoOffsetResetTest)
[info] Test Passed: testResetToLatestWhenOffsetTooLow(kafka.integration.AutoOffsetResetTest)
[info] == core-kafka / kafka.integration.AutoOffsetResetTest ==
[info] 
[info] == core-kafka / kafka.utils.UtilsTest ==
[info] Test Starting: testSwallow
[info] Test Passed: testSwallow
[info] Test Starting: testCircularIterator
[info] Test Passed: testCircularIterator
[info] == core-kafka / kafka.utils.UtilsTest ==
[info] 
[info] == core-kafka / kafka.server.ServerShutdownTest ==
[info] Test Starting: testCleanShutdown(kafka.server.ServerShutdownTest)
[info] Test Passed: testCleanShutdown(kafka.server.ServerShutdownTest)
[info] == core-kafka / kafka.server.ServerShutdownTest ==
[info] 
[info] == core-kafka / kafka.zk.ZKEphemeralTest ==
[info] Test Starting: testEphemeralNodeCleanup(kafka.zk.ZKEphemeralTest)
[info] Test Passed: testEphemeralNodeCleanup(kafka.zk.ZKEphemeralTest)
[info] == core-kafka / kafka.zk.ZKEphemeralTest ==
[info] 
[info] == core-kafka / kafka.server.LogRecoveryTest ==
[info] Test Starting: testHWCheckpointNoFailuresSingleLogSegment(kafka.server.LogRecoveryTest)
[info] Test Passed: testHWCheckpointNoFailuresSingleLogSegment(kafka.server.LogRecoveryTest)
[info] Test Starting: testHWCheckpointWithFailuresSingleLogSegment(kafka.server.LogRecoveryTest)
[error] Test Failed: testHWCheckpointWithFailuresSingleLogSegment(kafka.server.LogRecoveryTest)
java.lang.AssertionError: expected:<60> but was:<30>
	at org.junit.Assert.fail(Assert.java:69)
	at org.junit.Assert.failNotEquals(Assert.java:314)
	at org.junit.Assert.assertEquals(Assert.java:94)
	at org.junit.Assert.assertEquals(Assert.java:104)
	at kafka.server.LogRecoveryTest.testHWCheckpointWithFailuresSingleLogSegment(LogRecoveryTest.scala:150)
	at sun.reflect.NativeMethodAccessorImpl.invoke0(Native Method)
	at sun.reflect.NativeMethodAccessorImpl.invoke(NativeMethodAccessorImpl.java:39)
	at sun.reflect.DelegatingMethodAccessorImpl.invoke(DelegatingMethodAccessorImpl.java:25)
	at java.lang.reflect.Method.invoke(Method.java:597)
	at junit.framework.TestCase.runTest(TestCase.java:164)
	at junit.framework.TestCase.runBare(TestCase.java:130)
	at junit.framework.TestResult$1.protect(TestResult.java:110)
	at junit.framework.TestResult.runProtected(TestResult.java:128)
	at junit.framework.TestResult.run(TestResult.java:113)
	at junit.framework.TestCase.run(TestCase.java:120)
	at junit.framework.TestSuite.runTest(TestSuite.java:228)
	at junit.framework.TestSuite.run(TestSuite.java:223)
	at junit.framework.TestSuite.runTest(TestSuite.java:228)
	at junit.framework.TestSuite.run(TestSuite.java:223)
	at org.scalatest.junit.JUnit3Suite.run(JUnit3Suite.scala:309)
	at org.scalatest.tools.ScalaTestFramework$ScalaTestRunner.run(ScalaTestFramework.scala:40)
	at sbt.TestRunner.run(TestFramework.scala:53)
	at sbt.TestRunner.runTest$1(TestFramework.scala:67)
	at sbt.TestRunner.run(TestFramework.scala:76)
	at sbt.TestFramework$$anonfun$10$$anonfun$apply$11.runTest$2(TestFramework.scala:194)
	at sbt.TestFramework$$anonfun$10$$anonfun$apply$11$$anonfun$apply$12.apply(TestFramework.scala:205)
	at sbt.TestFramework$$anonfun$10$$anonfun$apply$11$$anonfun$apply$12.apply(TestFramework.scala:205)
	at sbt.NamedTestTask.run(TestFramework.scala:92)
	at sbt.ScalaProject$$anonfun$sbt$ScalaProject$$toTask$1.apply(ScalaProject.scala:193)
	at sbt.ScalaProject$$anonfun$sbt$ScalaProject$$toTask$1.apply(ScalaProject.scala:193)
	at sbt.TaskManager$Task.invoke(TaskManager.scala:62)
	at sbt.impl.RunTask.doRun$1(RunTask.scala:77)
	at sbt.impl.RunTask.runTask(RunTask.scala:85)
	at sbt.impl.RunTask.sbt$impl$RunTask$$runIfNotRoot(RunTask.scala:60)
	at sbt.impl.RunTask$$anonfun$runTasksExceptRoot$2.apply(RunTask.scala:48)
	at sbt.impl.RunTask$$anonfun$runTasksExceptRoot$2.apply(RunTask.scala:48)
	at sbt.Distributor$Run$Worker$$anonfun$2.apply(ParallelRunner.scala:131)
	at sbt.Distributor$Run$Worker$$anonfun$2.apply(ParallelRunner.scala:131)
	at sbt.Control$.trapUnit(Control.scala:19)
	at sbt.Distributor$Run$Worker.run(ParallelRunner.scala:131)
[info] Test Starting: testHWCheckpointNoFailuresMultipleLogSegments(kafka.server.LogRecoveryTest)
[info] Test Passed: testHWCheckpointNoFailuresMultipleLogSegments(kafka.server.LogRecoveryTest)
[info] Test Starting: testHWCheckpointWithFailuresMultipleLogSegments(kafka.server.LogRecoveryTest)
[info] Test Passed: testHWCheckpointWithFailuresMultipleLogSegments(kafka.server.LogRecoveryTest)
[info] == core-kafka / kafka.server.LogRecoveryTest ==
[info] 
[info] == core-kafka / kafka.admin.AdminTest ==
[info] Test Starting: testReplicaAssignment(kafka.admin.AdminTest)
[info] Test Passed: testReplicaAssignment(kafka.admin.AdminTest)
[info] Test Starting: testManualReplicaAssignment(kafka.admin.AdminTest)
[info] Test Passed: testManualReplicaAssignment(kafka.admin.AdminTest)
[info] Test Starting: testTopicCreationInZK(kafka.admin.AdminTest)
[info] Test Passed: testTopicCreationInZK(kafka.admin.AdminTest)
[info] Test Starting: testGetTopicMetadata(kafka.admin.AdminTest)
[info] Test Passed: testGetTopicMetadata(kafka.admin.AdminTest)
[info] == core-kafka / kafka.admin.AdminTest ==
[info] 
[info] == core-kafka / unit.kafka.metrics.KafkaTimerTest ==
[info] Test Starting: testKafkaTimer(unit.kafka.metrics.KafkaTimerTest)
[info] Test Passed: testKafkaTimer(unit.kafka.metrics.KafkaTimerTest)
[info] == core-kafka / unit.kafka.metrics.KafkaTimerTest ==
[info] 
[info] == core-kafka / kafka.server.ReplicaFetchTest ==
[info] Test Starting: testReplicaFetcherThread(kafka.server.ReplicaFetchTest)
[info] Test Passed: testReplicaFetcherThread(kafka.server.ReplicaFetchTest)
[info] == core-kafka / kafka.server.ReplicaFetchTest ==
[info] 
[info] == core-kafka / test-finish ==
[error] Failed: : Total 136, Failed 3, Errors 0, Passed 133, Skipped 0
[info] == core-kafka / test-finish ==
[info] 
[info] == core-kafka / Test cleanup 1 ==
[info] Deleting directory /tmp/sbt_a74cfe6a
[info] == core-kafka / Test cleanup 1 ==
[info] 
[info] == core-kafka / test-cleanup ==
[info] == core-kafka / test-cleanup ==
[error] Error running kafka.consumer.FetcherTest: Test FAILED
[error] Error running kafka.consumer.ZookeeperConsumerConnectorTest: Test
FAILED
[error] Error running kafka.server.LogRecoveryTest: Test FAILED
[error] Error running test: One or more subtasks failed
[info] 
[info] Total time: 231 s, completed Sep 19, 2012 11:05:34 PM
[info] 
[info] Total session time: 232 s, completed Sep 19, 2012 11:05:34 PM
[error] Error during build.
Build step 'Execute shell' marked build as failure

Mime
View raw message