kafka-commits mailing list archives

Site index · List index
Message view « Date » · « Thread »
Top « Date » · « Thread »
From Apache Jenkins Server <jenk...@builds.apache.org>
Subject Build failed in Jenkins: Kafka-0.8 #17
Date Mon, 06 Aug 2012 18:10:09 GMT
See <https://builds.apache.org/job/Kafka-0.8/17/changes>

Changes:

[nehanarkhede] KAFKA-380 Enhance single_host_multi_brokers test with failure to trigger leader
re-election in replication; patched by John Fung; reviewed by Neha Narkhede, Jun Rao and Joel
Koshy

------------------------------------------
[...truncated 1987 lines...]
	at junit.framework.TestCase.runBare(TestCase.java:130)
	at junit.framework.TestResult$1.protect(TestResult.java:110)
	at junit.framework.TestResult.runProtected(TestResult.java:128)
	at junit.framework.TestResult.run(TestResult.java:113)
	at junit.framework.TestCase.run(TestCase.java:120)
	at junit.framework.TestSuite.runTest(TestSuite.java:228)
	at junit.framework.TestSuite.run(TestSuite.java:223)
	at junit.framework.TestSuite.runTest(TestSuite.java:228)
	at junit.framework.TestSuite.run(TestSuite.java:223)
	at org.scalatest.junit.JUnit3Suite.run(JUnit3Suite.scala:309)
	at org.scalatest.tools.ScalaTestFramework$ScalaTestRunner.run(ScalaTestFramework.scala:40)
	at sbt.TestRunner.run(TestFramework.scala:53)
	at sbt.TestRunner.runTest$1(TestFramework.scala:67)
	at sbt.TestRunner.run(TestFramework.scala:76)
	at sbt.TestFramework$$anonfun$10$$anonfun$apply$11.runTest$2(TestFramework.scala:194)
	at sbt.TestFramework$$anonfun$10$$anonfun$apply$11$$anonfun$apply$12.apply(TestFramework.scala:205)
	at sbt.TestFramework$$anonfun$10$$anonfun$apply$11$$anonfun$apply$12.apply(TestFramework.scala:205)
	at sbt.NamedTestTask.run(TestFramework.scala:92)
	at sbt.ScalaProject$$anonfun$sbt$ScalaProject$$toTask$1.apply(ScalaProject.scala:193)
	at sbt.ScalaProject$$anonfun$sbt$ScalaProject$$toTask$1.apply(ScalaProject.scala:193)
	at sbt.TaskManager$Task.invoke(TaskManager.scala:62)
	at sbt.impl.RunTask.doRun$1(RunTask.scala:77)
	at sbt.impl.RunTask.runTask(RunTask.scala:85)
	at sbt.impl.RunTask.sbt$impl$RunTask$$runIfNotRoot(RunTask.scala:60)
	at sbt.impl.RunTask$$anonfun$runTasksExceptRoot$2.apply(RunTask.scala:48)
	at sbt.impl.RunTask$$anonfun$runTasksExceptRoot$2.apply(RunTask.scala:48)
	at sbt.Distributor$Run$Worker$$anonfun$2.apply(ParallelRunner.scala:131)
	at sbt.Distributor$Run$Worker$$anonfun$2.apply(ParallelRunner.scala:131)
	at sbt.Control$.trapUnit(Control.scala:19)
	at sbt.Distributor$Run$Worker.run(ParallelRunner.scala:131)
[2012-08-06 18:09:51,684] WARN EndOfStreamException: Unable to read additional data from client
sessionid 0x138fd1f554f0008, likely client has closed socket (org.apache.zookeeper.server.NIOServerCnxn:634)
[info] Test Passed: testInvalidPartition(kafka.producer.AsyncProducerTest)
[info] Test Starting: testNoBroker(kafka.producer.AsyncProducerTest)
[2012-08-06 18:09:51,702] ERROR Failed to collate messages by topic, partition due to (kafka.producer.async.DefaultEventHandler:99)
kafka.common.NoBrokersForPartitionException: Partition = null
	at kafka.producer.async.DefaultEventHandler.kafka$producer$async$DefaultEventHandler$$getPartitionListForTopic(DefaultEventHandler.scala:145)
	at kafka.producer.async.DefaultEventHandler$$anonfun$partitionAndCollate$1.apply(DefaultEventHandler.scala:102)
	at kafka.producer.async.DefaultEventHandler$$anonfun$partitionAndCollate$1.apply(DefaultEventHandler.scala:101)
	at scala.collection.LinearSeqOptimized$class.foreach(LinearSeqOptimized.scala:61)
	at scala.collection.immutable.List.foreach(List.scala:45)
	at scala.collection.generic.TraversableForwarder$class.foreach(TraversableForwarder.scala:44)
	at scala.collection.mutable.ListBuffer.foreach(ListBuffer.scala:42)
	at kafka.producer.async.DefaultEventHandler.partitionAndCollate(DefaultEventHandler.scala:101)
	at kafka.producer.async.DefaultEventHandler.dispatchSerializedData(DefaultEventHandler.scala:66)
	at kafka.producer.async.DefaultEventHandler.handle(DefaultEventHandler.scala:49)
	at kafka.producer.AsyncProducerTest.testNoBroker(AsyncProducerTest.scala:296)
	at sun.reflect.NativeMethodAccessorImpl.invoke0(Native Method)
	at sun.reflect.NativeMethodAccessorImpl.invoke(NativeMethodAccessorImpl.java:39)
	at sun.reflect.DelegatingMethodAccessorImpl.invoke(DelegatingMethodAccessorImpl.java:25)
	at java.lang.reflect.Method.invoke(Method.java:597)
	at junit.framework.TestCase.runTest(TestCase.java:164)
	at junit.framework.TestCase.runBare(TestCase.java:130)
	at junit.framework.TestResult$1.protect(TestResult.java:110)
	at junit.framework.TestResult.runProtected(TestResult.java:128)
	at junit.framework.TestResult.run(TestResult.java:113)
	at junit.framework.TestCase.run(TestCase.java:120)
	at junit.framework.TestSuite.runTest(TestSuite.java:228)
	at junit.framework.TestSuite.run(TestSuite.java:223)
	at junit.framework.TestSuite.runTest(TestSuite.java:228)
	at junit.framework.TestSuite.run(TestSuite.java:223)
	at org.scalatest.junit.JUnit3Suite.run(JUnit3Suite.scala:309)
	at org.scalatest.tools.ScalaTestFramework$ScalaTestRunner.run(ScalaTestFramework.scala:40)
	at sbt.TestRunner.run(TestFramework.scala:53)
	at sbt.TestRunner.runTest$1(TestFramework.scala:67)
	at sbt.TestRunner.run(TestFramework.scala:76)
	at sbt.TestFramework$$anonfun$10$$anonfun$apply$11.runTest$2(TestFramework.scala:194)
	at sbt.TestFramework$$anonfun$10$$anonfun$apply$11$$anonfun$apply$12.apply(TestFramework.scala:205)
	at sbt.TestFramework$$anonfun$10$$anonfun$apply$11$$anonfun$apply$12.apply(TestFramework.scala:205)
	at sbt.NamedTestTask.run(TestFramework.scala:92)
	at sbt.ScalaProject$$anonfun$sbt$ScalaProject$$toTask$1.apply(ScalaProject.scala:193)
	at sbt.ScalaProject$$anonfun$sbt$ScalaProject$$toTask$1.apply(ScalaProject.scala:193)
	at sbt.TaskManager$Task.invoke(TaskManager.scala:62)
	at sbt.impl.RunTask.doRun$1(RunTask.scala:77)
	at sbt.impl.RunTask.runTask(RunTask.scala:85)
	at sbt.impl.RunTask.sbt$impl$RunTask$$runIfNotRoot(RunTask.scala:60)
	at sbt.impl.RunTask$$anonfun$runTasksExceptRoot$2.apply(RunTask.scala:48)
	at sbt.impl.RunTask$$anonfun$runTasksExceptRoot$2.apply(RunTask.scala:48)
	at sbt.Distributor$Run$Worker$$anonfun$2.apply(ParallelRunner.scala:131)
	at sbt.Distributor$Run$Worker$$anonfun$2.apply(ParallelRunner.scala:131)
	at sbt.Control$.trapUnit(Control.scala:19)
	at sbt.Distributor$Run$Worker.run(ParallelRunner.scala:131)
[info] Test Passed: testNoBroker(kafka.producer.AsyncProducerTest)
[info] Test Starting: testIncompatibleEncoder(kafka.producer.AsyncProducerTest)
[info] Test Passed: testIncompatibleEncoder(kafka.producer.AsyncProducerTest)
[info] Test Starting: testRandomPartitioner(kafka.producer.AsyncProducerTest)
[info] Test Passed: testRandomPartitioner(kafka.producer.AsyncProducerTest)
[info] Test Starting: testBrokerListAndAsync(kafka.producer.AsyncProducerTest)
[info] Test Passed: testBrokerListAndAsync(kafka.producer.AsyncProducerTest)
[info] Test Starting: testFailedSendRetryLogic(kafka.producer.AsyncProducerTest)
[info] Test Passed: testFailedSendRetryLogic(kafka.producer.AsyncProducerTest)
[info] Test Starting: testJavaProducer(kafka.producer.AsyncProducerTest)
[2012-08-06 18:09:51,994] WARN EndOfStreamException: Unable to read additional data from client
sessionid 0x138fd2090ce0011, likely client has closed socket (org.apache.zookeeper.server.NIOServerCnxn:634)
[info] Test Passed: testJavaProducer(kafka.producer.AsyncProducerTest)
[info] Test Starting: testInvalidConfiguration(kafka.producer.AsyncProducerTest)
[info] Test Passed: testInvalidConfiguration(kafka.producer.AsyncProducerTest)
[info] == core-kafka / kafka.producer.AsyncProducerTest ==
[info] 
[info] == core-kafka / kafka.javaapi.message.ByteBufferMessageSetTest ==
[info] Test Starting: testWrittenEqualsRead
[info] Test Passed: testWrittenEqualsRead
[info] Test Starting: testIteratorIsConsistent
[info] Test Passed: testIteratorIsConsistent
[info] Test Starting: testSizeInBytes
[info] Test Passed: testSizeInBytes
[info] Test Starting: testValidBytes
[info] Test Passed: testValidBytes
[info] Test Starting: testEquals
[info] Test Passed: testEquals
[info] Test Starting: testIteratorIsConsistentWithCompression
[info] Test Passed: testIteratorIsConsistentWithCompression
[info] Test Starting: testSizeInBytesWithCompression
[info] Test Passed: testSizeInBytesWithCompression
[info] Test Starting: testValidBytesWithCompression
[info] Test Passed: testValidBytesWithCompression
[info] Test Starting: testEqualsWithCompression
[info] Test Passed: testEqualsWithCompression
[info] == core-kafka / kafka.javaapi.message.ByteBufferMessageSetTest ==
[info] 
[info] == core-kafka / kafka.log4j.KafkaLog4jAppenderTest ==
[info] Test Starting: testKafkaLog4jConfigs(kafka.log4j.KafkaLog4jAppenderTest)
log4j:WARN No appenders could be found for logger (org.I0Itec.zkclient.ZkEventThread).
log4j:WARN Please initialize the log4j system properly.
[info] Test Passed: testKafkaLog4jConfigs(kafka.log4j.KafkaLog4jAppenderTest)
[info] Test Starting: testZkConnectLog4jAppends(kafka.log4j.KafkaLog4jAppenderTest)
[info] Test Passed: testZkConnectLog4jAppends(kafka.log4j.KafkaLog4jAppenderTest)
[info] == core-kafka / kafka.log4j.KafkaLog4jAppenderTest ==
[info] 
[info] == core-kafka / kafka.producer.ProducerTest ==
[info] Test Starting: testZKSendToNewTopic(kafka.producer.ProducerTest)
[info] Test Passed: testZKSendToNewTopic(kafka.producer.ProducerTest)
[info] Test Starting: testZKSendWithDeadBroker(kafka.producer.ProducerTest)
[info] Test Passed: testZKSendWithDeadBroker(kafka.producer.ProducerTest)
[info] Test Starting: testAsyncSendCanCorrectlyFailWithTimeout(kafka.producer.ProducerTest)
[info] Test Passed: testAsyncSendCanCorrectlyFailWithTimeout(kafka.producer.ProducerTest)
[info] == core-kafka / kafka.producer.ProducerTest ==
[info] 
[info] == core-kafka / kafka.admin.AdminTest ==
[info] Test Starting: testReplicaAssignment(kafka.admin.AdminTest)
[info] Test Passed: testReplicaAssignment(kafka.admin.AdminTest)
[info] Test Starting: testManualReplicaAssignment(kafka.admin.AdminTest)
[info] Test Passed: testManualReplicaAssignment(kafka.admin.AdminTest)
[info] Test Starting: testTopicCreationInZK(kafka.admin.AdminTest)
[info] Test Passed: testTopicCreationInZK(kafka.admin.AdminTest)
[info] Test Starting: testGetTopicMetadata(kafka.admin.AdminTest)
[info] Test Passed: testGetTopicMetadata(kafka.admin.AdminTest)
[info] == core-kafka / kafka.admin.AdminTest ==
[info] 
[info] == core-kafka / kafka.network.SocketServerTest ==
[info] Test Starting: simpleRequest
[info] Test Passed: simpleRequest
[info] Test Starting: tooBigRequestIsRejected
[info] Test Passed: tooBigRequestIsRejected
[info] == core-kafka / kafka.network.SocketServerTest ==
[info] 
[info] == core-kafka / kafka.message.MessageTest ==
[info] Test Starting: testFieldValues
[info] Test Passed: testFieldValues
[info] Test Starting: testChecksum
[info] Test Passed: testChecksum
[info] Test Starting: testEquality
[info] Test Passed: testEquality
[info] Test Starting: testIsHashable
[info] Test Passed: testIsHashable
[info] == core-kafka / kafka.message.MessageTest ==
[info] 
[info] == core-kafka / kafka.producer.SyncProducerTest ==
[info] Test Starting: testReachableServer(kafka.producer.SyncProducerTest)
[info] Test Passed: testReachableServer(kafka.producer.SyncProducerTest)
[info] Test Starting: testEmptyProduceRequest(kafka.producer.SyncProducerTest)
[info] Test Passed: testEmptyProduceRequest(kafka.producer.SyncProducerTest)
[info] Test Starting: testSingleMessageSizeTooLarge(kafka.producer.SyncProducerTest)
[info] Test Passed: testSingleMessageSizeTooLarge(kafka.producer.SyncProducerTest)
[info] Test Starting: testCompressedMessageSizeTooLarge(kafka.producer.SyncProducerTest)
[info] Test Passed: testCompressedMessageSizeTooLarge(kafka.producer.SyncProducerTest)
[info] Test Starting: testProduceCorrectlyReceivesResponse(kafka.producer.SyncProducerTest)
[info] Test Passed: testProduceCorrectlyReceivesResponse(kafka.producer.SyncProducerTest)
[info] Test Starting: testProducerCanTimeout(kafka.producer.SyncProducerTest)
[info] Test Passed: testProducerCanTimeout(kafka.producer.SyncProducerTest)
[info] Test Starting: testProduceRequestForUnknownTopic(kafka.producer.SyncProducerTest)
[info] Test Passed: testProduceRequestForUnknownTopic(kafka.producer.SyncProducerTest)
[info] == core-kafka / kafka.producer.SyncProducerTest ==
[info] 
[info] == core-kafka / kafka.controller.ControllerBasicTest ==
[info] Test Starting: testControllerFailOver(kafka.controller.ControllerBasicTest)
[info] Test Passed: testControllerFailOver(kafka.controller.ControllerBasicTest)
[info] Test Starting: testControllerCommandSend(kafka.controller.ControllerBasicTest)
[info] Test Passed: testControllerCommandSend(kafka.controller.ControllerBasicTest)
[info] == core-kafka / kafka.controller.ControllerBasicTest ==
[info] 
[info] == core-kafka / test-finish ==
[error] Failed: : Total 136, Failed 1, Errors 0, Passed 135, Skipped 0
[info] == core-kafka / test-finish ==
[info] 
[info] == core-kafka / Test cleanup 1 ==
[info] Deleting directory /var/tmp/sbt_efc390bd
[info] == core-kafka / Test cleanup 1 ==
[info] 
[info] == core-kafka / test-cleanup ==
[info] == core-kafka / test-cleanup ==
[info] 
[info] == hadoop producer / test-compile ==
[info]   Source analysis: 0 new/modified, 0 indirectly invalidated, 0 removed.
[info] Compiling test sources...
[info] Nothing to compile.
[info]   Post-analysis: 0 classes.
[info] == hadoop producer / test-compile ==
[info] 
[info] == java-examples / test-compile ==
[info]   Source analysis: 0 new/modified, 0 indirectly invalidated, 0 removed.
[info] Compiling test sources...
[info] Nothing to compile.
[info]   Post-analysis: 0 classes.
[info] == java-examples / test-compile ==
[info] 
[info] == hadoop producer / copy-resources ==
[info] == hadoop producer / copy-resources ==
[info] 
[info] == hadoop producer / copy-test-resources ==
[info] == hadoop producer / copy-test-resources ==
[info] 
[info] == hadoop consumer / copy-test-resources ==
[info] == hadoop consumer / copy-test-resources ==
[info] 
[info] == perf / copy-resources ==
[info] == perf / copy-resources ==
[info] 
[info] == java-examples / copy-test-resources ==
[info] == java-examples / copy-test-resources ==
[info] 
[info] == java-examples / copy-resources ==
[info] == java-examples / copy-resources ==
[info] 
[info] == hadoop consumer / test-compile ==
[info]   Source analysis: 0 new/modified, 0 indirectly invalidated, 0 removed.
[info] Compiling test sources...
[info] Nothing to compile.
[info]   Post-analysis: 0 classes.
[info] == hadoop consumer / test-compile ==
[info] 
[info] == hadoop consumer / copy-resources ==
[info] == hadoop consumer / copy-resources ==
[error] Error running kafka.message.CompressionUtilTest: Test FAILED
[error] Error running test: One or more subtasks failed
[info] 
[info] Total time: 495 s, completed Aug 6, 2012 6:10:16 PM
[info] 
[info] Total session time: 496 s, completed Aug 6, 2012 6:10:16 PM
[error] Error during build.
Build step 'Execute shell' marked build as failure

Mime
View raw message