kafka-commits mailing list archives

Site index · List index
Message view « Date » · « Thread »
Top « Date » · « Thread »
From Apache Jenkins Server <jenk...@builds.apache.org>
Subject Build failed in Jenkins: Kafka-0.8 #33
Date Tue, 28 Aug 2012 19:15:00 GMT
See <https://builds.apache.org/job/Kafka-0.8/33/changes>

Changes:

[junrao] Add constructor for message which takes both byte array offset and length; patched
by Graham Sanderson; reviewed by Jun Rao; KAFKA-393

------------------------------------------
[...truncated 1128 lines...]
	at sbt.Control$.trapUnit(Control.scala:19)
	at sbt.Distributor$Run$Worker.run(ParallelRunner.scala:131)
[info] Test Starting: testPartitionAndCollateEvents(kafka.producer.AsyncProducerTest)
[info] Test Passed: testPartitionAndCollateEvents(kafka.producer.AsyncProducerTest)
[info] Test Starting: testSerializeEvents(kafka.producer.AsyncProducerTest)
[info] Test Passed: testSerializeEvents(kafka.producer.AsyncProducerTest)
[info] Test Starting: testInvalidPartition(kafka.producer.AsyncProducerTest)
[info] Test Passed: testInvalidPartition(kafka.producer.AsyncProducerTest)
[info] Test Starting: testNoBroker(kafka.producer.AsyncProducerTest)
[info] Test Passed: testNoBroker(kafka.producer.AsyncProducerTest)
[info] Test Starting: testIncompatibleEncoder(kafka.producer.AsyncProducerTest)
[info] Test Passed: testIncompatibleEncoder(kafka.producer.AsyncProducerTest)
[info] Test Starting: testRandomPartitioner(kafka.producer.AsyncProducerTest)
[info] Test Passed: testRandomPartitioner(kafka.producer.AsyncProducerTest)
[info] Test Starting: testBrokerListAndAsync(kafka.producer.AsyncProducerTest)
[info] Test Passed: testBrokerListAndAsync(kafka.producer.AsyncProducerTest)
[info] Test Starting: testFailedSendRetryLogic(kafka.producer.AsyncProducerTest)
[info] Test Passed: testFailedSendRetryLogic(kafka.producer.AsyncProducerTest)
[info] Test Starting: testJavaProducer(kafka.producer.AsyncProducerTest)
[info] Test Passed: testJavaProducer(kafka.producer.AsyncProducerTest)
[info] Test Starting: testInvalidConfiguration(kafka.producer.AsyncProducerTest)
[info] Test Passed: testInvalidConfiguration(kafka.producer.AsyncProducerTest)
[info] == core-kafka / kafka.producer.AsyncProducerTest ==
[info] 
[info] == core-kafka / kafka.producer.ProducerTest ==
[info] Test Starting: testUpdateBrokerPartitionInfo(kafka.producer.ProducerTest)
[info] Test Passed: testUpdateBrokerPartitionInfo(kafka.producer.ProducerTest)
[info] Test Starting: testSendToNewTopic(kafka.producer.ProducerTest)
[info] Test Passed: testSendToNewTopic(kafka.producer.ProducerTest)
[info] Test Starting: testSendWithDeadBroker(kafka.producer.ProducerTest)
[info] Test Passed: testSendWithDeadBroker(kafka.producer.ProducerTest)
[info] Test Starting: testAsyncSendCanCorrectlyFailWithTimeout(kafka.producer.ProducerTest)
[info] Test Passed: testAsyncSendCanCorrectlyFailWithTimeout(kafka.producer.ProducerTest)
[info] == core-kafka / kafka.producer.ProducerTest ==
[info] 
[info] == core-kafka / kafka.javaapi.consumer.ZookeeperConsumerConnectorTest
==
[info] Test Starting: testBasic(kafka.javaapi.consumer.ZookeeperConsumerConnectorTest)
[info] Test Passed: testBasic(kafka.javaapi.consumer.ZookeeperConsumerConnectorTest)
[info] == core-kafka / kafka.javaapi.consumer.ZookeeperConsumerConnectorTest
==
[info] 
[info] == core-kafka / kafka.zk.ZKEphemeralTest ==
[info] Test Starting: testEphemeralNodeCleanup(kafka.zk.ZKEphemeralTest)
[info] Test Passed: testEphemeralNodeCleanup(kafka.zk.ZKEphemeralTest)
[info] == core-kafka / kafka.zk.ZKEphemeralTest ==
[info] 
[info] == core-kafka / kafka.javaapi.message.ByteBufferMessageSetTest ==
[info] Test Starting: testWrittenEqualsRead
[info] Test Passed: testWrittenEqualsRead
[info] Test Starting: testIteratorIsConsistent
[info] Test Passed: testIteratorIsConsistent
[info] Test Starting: testSizeInBytes
[info] Test Passed: testSizeInBytes
[info] Test Starting: testValidBytes
[info] Test Passed: testValidBytes
[info] Test Starting: testEquals
[info] Test Passed: testEquals
[info] Test Starting: testIteratorIsConsistentWithCompression
[info] Test Passed: testIteratorIsConsistentWithCompression
[info] Test Starting: testSizeInBytesWithCompression
[info] Test Passed: testSizeInBytesWithCompression
[info] Test Starting: testValidBytesWithCompression
[info] Test Passed: testValidBytesWithCompression
[info] Test Starting: testEqualsWithCompression
[info] Test Passed: testEqualsWithCompression
[info] == core-kafka / kafka.javaapi.message.ByteBufferMessageSetTest ==
[info] 
[info] == core-kafka / kafka.consumer.FetcherTest ==
[info] Test Starting: testFetcher(kafka.consumer.FetcherTest)
[info] Test Passed: testFetcher(kafka.consumer.FetcherTest)
[info] == core-kafka / kafka.consumer.FetcherTest ==
[info] 
[info] == core-kafka / kafka.network.SocketServerTest ==
[info] Test Starting: simpleRequest
[info] Test Passed: simpleRequest
[info] Test Starting: tooBigRequestIsRejected
[info] Test Passed: tooBigRequestIsRejected
[info] == core-kafka / kafka.network.SocketServerTest ==
[info] 
[info] == core-kafka / kafka.log.LogManagerTest ==
[info] Test Starting: testCreateLog(kafka.log.LogManagerTest)
[info] Test Passed: testCreateLog(kafka.log.LogManagerTest)
[info] Test Starting: testGetLog(kafka.log.LogManagerTest)
[info] Test Passed: testGetLog(kafka.log.LogManagerTest)
[info] Test Starting: testCleanupExpiredSegments(kafka.log.LogManagerTest)
[info] Test Passed: testCleanupExpiredSegments(kafka.log.LogManagerTest)
[info] Test Starting: testCleanupSegmentsToMaintainSize(kafka.log.LogManagerTest)
[info] Test Passed: testCleanupSegmentsToMaintainSize(kafka.log.LogManagerTest)
[info] Test Starting: testTimeBasedFlush(kafka.log.LogManagerTest)
[info] Test Passed: testTimeBasedFlush(kafka.log.LogManagerTest)
[info] Test Starting: testConfigurablePartitions(kafka.log.LogManagerTest)
[info] Test Passed: testConfigurablePartitions(kafka.log.LogManagerTest)
[info] == core-kafka / kafka.log.LogManagerTest ==
[info] 
[info] == core-kafka / kafka.log.LogCorruptionTest ==
[info] Test Starting: testMessageSizeTooLarge(kafka.log.LogCorruptionTest)
[info] Test Passed: testMessageSizeTooLarge(kafka.log.LogCorruptionTest)
[info] == core-kafka / kafka.log.LogCorruptionTest ==
[info] 
[info] == core-kafka / kafka.integration.TopicMetadataTest ==
[info] Test Starting: testTopicMetadataRequest(kafka.integration.TopicMetadataTest)
[info] Test Passed: testTopicMetadataRequest(kafka.integration.TopicMetadataTest)
[info] Test Starting: testBasicTopicMetadata(kafka.integration.TopicMetadataTest)
[info] Test Passed: testBasicTopicMetadata(kafka.integration.TopicMetadataTest)
[info] Test Starting: testAutoCreateTopic(kafka.integration.TopicMetadataTest)
[info] Test Passed: testAutoCreateTopic(kafka.integration.TopicMetadataTest)
[info] == core-kafka / kafka.integration.TopicMetadataTest ==
[info] 
[info] == core-kafka / kafka.server.ReplicaFetchTest ==
[info] Test Starting: testReplicaFetcherThread(kafka.server.ReplicaFetchTest)
[info] Test Passed: testReplicaFetcherThread(kafka.server.ReplicaFetchTest)
[info] == core-kafka / kafka.server.ReplicaFetchTest ==
[info] 
[info] == core-kafka / kafka.message.FileMessageSetTest ==
[info] Test Starting: testWrittenEqualsRead
[info] Test Passed: testWrittenEqualsRead
[info] Test Starting: testIteratorIsConsistent
[info] Test Passed: testIteratorIsConsistent
[info] Test Starting: testSizeInBytes
[info] Test Passed: testSizeInBytes
[info] Test Starting: testWriteTo
[info] Test Passed: testWriteTo
[info] Test Starting: testFileSize
[info] Test Passed: testFileSize
[info] Test Starting: testIterationOverPartialAndTruncation
[info] Test Passed: testIterationOverPartialAndTruncation
[info] Test Starting: testIterationDoesntChangePosition
[info] Test Passed: testIterationDoesntChangePosition
[info] Test Starting: testRead
[info] Test Passed: testRead
[info] == core-kafka / kafka.message.FileMessageSetTest ==
[info] 
[info] == core-kafka / unit.kafka.metrics.KafkaTimerTest ==
[info] Test Starting: testKafkaTimer(unit.kafka.metrics.KafkaTimerTest)
[info] Test Passed: testKafkaTimer(unit.kafka.metrics.KafkaTimerTest)
[info] == core-kafka / unit.kafka.metrics.KafkaTimerTest ==
[info] 
[info] == core-kafka / kafka.log.SegmentListTest ==
[info] Test Starting: testAppend
[info] Test Passed: testAppend
[info] Test Starting: testTrunc
[info] Test Passed: testTrunc
[info] Test Starting: testTruncLast
[info] Test Passed: testTruncLast
[info] Test Starting: testTruncBeyondList
[info] Test Passed: testTruncBeyondList
[info] == core-kafka / kafka.log.SegmentListTest ==
[info] 
[info] == core-kafka / kafka.consumer.TopicFilterTest ==
[info] Test Starting: testWhitelists
[info] Test Passed: testWhitelists
[info] Test Starting: testBlacklists
[info] Test Passed: testBlacklists
[info] == core-kafka / kafka.consumer.TopicFilterTest ==
[info] 
[info] == core-kafka / kafka.producer.SyncProducerTest ==
[info] Test Starting: testReachableServer(kafka.producer.SyncProducerTest)
[info] Test Passed: testReachableServer(kafka.producer.SyncProducerTest)
[info] Test Starting: testEmptyProduceRequest(kafka.producer.SyncProducerTest)
[info] Test Passed: testEmptyProduceRequest(kafka.producer.SyncProducerTest)
[info] Test Starting: testSingleMessageSizeTooLarge(kafka.producer.SyncProducerTest)
[info] Test Passed: testSingleMessageSizeTooLarge(kafka.producer.SyncProducerTest)
[info] Test Starting: testCompressedMessageSizeTooLarge(kafka.producer.SyncProducerTest)
[info] Test Passed: testCompressedMessageSizeTooLarge(kafka.producer.SyncProducerTest)
[info] Test Starting: testProduceCorrectlyReceivesResponse(kafka.producer.SyncProducerTest)
[info] Test Passed: testProduceCorrectlyReceivesResponse(kafka.producer.SyncProducerTest)
[info] Test Starting: testProducerCanTimeout(kafka.producer.SyncProducerTest)
[info] Test Passed: testProducerCanTimeout(kafka.producer.SyncProducerTest)
[info] == core-kafka / kafka.producer.SyncProducerTest ==
[info] 
[info] == core-kafka / kafka.admin.AdminTest ==
[info] Test Starting: testReplicaAssignment(kafka.admin.AdminTest)
[info] Test Passed: testReplicaAssignment(kafka.admin.AdminTest)
[info] Test Starting: testManualReplicaAssignment(kafka.admin.AdminTest)
[info] Test Passed: testManualReplicaAssignment(kafka.admin.AdminTest)
[info] Test Starting: testTopicCreationInZK(kafka.admin.AdminTest)
[info] Test Passed: testTopicCreationInZK(kafka.admin.AdminTest)
[info] Test Starting: testGetTopicMetadata(kafka.admin.AdminTest)
[info] Test Passed: testGetTopicMetadata(kafka.admin.AdminTest)
[info] == core-kafka / kafka.admin.AdminTest ==
[info] 
[info] == core-kafka / kafka.server.RequestPurgatoryTest ==
[info] Test Starting: testRequestSatisfaction(kafka.server.RequestPurgatoryTest)
[info] Test Passed: testRequestSatisfaction(kafka.server.RequestPurgatoryTest)
[info] Test Starting: testRequestExpirey(kafka.server.RequestPurgatoryTest)
20
[info] Test Passed: testRequestExpirey(kafka.server.RequestPurgatoryTest)
[info] == core-kafka / kafka.server.RequestPurgatoryTest ==
[info] 
[info] == core-kafka / kafka.network.RpcDataSerializationTest ==
[info] Test Starting: testSerializationAndDeserialization
[info] Test Passed: testSerializationAndDeserialization
[info] == core-kafka / kafka.network.RpcDataSerializationTest ==
[info] 
[info] == core-kafka / test-finish ==
[error] Failed: : Total 137, Failed 4, Errors 0, Passed 133, Skipped 0
[info] == core-kafka / test-finish ==
[info] 
[info] == core-kafka / Test cleanup 1 ==
[info] Deleting directory /var/tmp/sbt_eb7375fc
[info] == core-kafka / Test cleanup 1 ==
[info] 
[info] == core-kafka / test-cleanup ==
[info] == core-kafka / test-cleanup ==
[info] 
[info] == perf / copy-test-resources ==
[info] == perf / copy-test-resources ==
[info] 
[info] == perf / copy-resources ==
[info] == perf / copy-resources ==
[info] 
[info] == hadoop consumer / copy-test-resources ==
[info] == hadoop consumer / copy-test-resources ==
[info] 
[info] == hadoop consumer / test-compile ==
[info]   Source analysis: 0 new/modified, 0 indirectly invalidated, 0 removed.
[info] Compiling test sources...
[info] Nothing to compile.
[info]   Post-analysis: 0 classes.
[info] == hadoop consumer / test-compile ==
[info] 
[info] == perf / test-compile ==
[info]   Source analysis: 0 new/modified, 0 indirectly invalidated, 0 removed.
[info] Compiling test sources...
[info] Nothing to compile.
[info]   Post-analysis: 0 classes.
[info] == perf / test-compile ==
[info] 
[info] == java-examples / copy-resources ==
[info] == java-examples / copy-resources ==
[info] 
[info] == hadoop producer / copy-resources ==
[info] == hadoop producer / copy-resources ==
[info] 
[info] == hadoop producer / test-compile ==
[info]   Source analysis: 0 new/modified, 0 indirectly invalidated, 0 removed.
[info] Compiling test sources...
[info] Nothing to compile.
[info]   Post-analysis: 0 classes.
[info] == hadoop producer / test-compile ==
[error] Error running kafka.server.LogRecoveryTest: Test FAILED
[error] Error running kafka.message.CompressionUtilTest: Test FAILED
[error] Error running kafka.producer.AsyncProducerTest: Test FAILED
[error] Error running test: One or more subtasks failed
[info] 
[info] Total time: 754 s, completed Aug 28, 2012 7:15:22 PM
[info] 
[info] Total session time: 755 s, completed Aug 28, 2012 7:15:22 PM
[error] Error during build.
Build step 'Execute shell' marked build as failure

Mime
View raw message