kafka-commits mailing list archives

Site index · List index
Message view « Date » · « Thread »
Top « Date » · « Thread »
From Apache Jenkins Server <jenk...@builds.apache.org>
Subject Build failed in Jenkins: Kafka-0.8 #24
Date Sat, 18 Aug 2012 00:42:05 GMT
See <https://builds.apache.org/job/Kafka-0.8/24/changes>

Changes:

[junrao] KafkaController NPE in SessionExpireListener; patched by Yang Ye; reviewed by Jun
Rao, Neha Narkhede; KAFKA-464

------------------------------------------
[...truncated 5638 lines...]
	at junit.framework.TestSuite.runTest(TestSuite.java:228)
	at junit.framework.TestSuite.run(TestSuite.java:223)
	at org.scalatest.junit.JUnit3Suite.run(JUnit3Suite.scala:309)
	at org.scalatest.tools.ScalaTestFramework$ScalaTestRunner.run(ScalaTestFramework.scala:40)
	at sbt.TestRunner.run(TestFramework.scala:53)
	at sbt.TestRunner.runTest$1(TestFramework.scala:67)
	at sbt.TestRunner.run(TestFramework.scala:76)
	at sbt.TestFramework$$anonfun$10$$anonfun$apply$11.runTest$2(TestFramework.scala:194)
	at sbt.TestFramework$$anonfun$10$$anonfun$apply$11$$anonfun$apply$12.apply(TestFramework.scala:205)
	at sbt.TestFramework$$anonfun$10$$anonfun$apply$11$$anonfun$apply$12.apply(TestFramework.scala:205)
	at sbt.NamedTestTask.run(TestFramework.scala:92)
	at sbt.ScalaProject$$anonfun$sbt$ScalaProject$$toTask$1.apply(ScalaProject.scala:193)
	at sbt.ScalaProject$$anonfun$sbt$ScalaProject$$toTask$1.apply(ScalaProject.scala:193)
	at sbt.TaskManager$Task.invoke(TaskManager.scala:62)
	at sbt.impl.RunTask.doRun$1(RunTask.scala:77)
	at sbt.impl.RunTask.runTask(RunTask.scala:85)
	at sbt.impl.RunTask.sbt$impl$RunTask$$runIfNotRoot(RunTask.scala:60)
	at sbt.impl.RunTask$$anonfun$runTasksExceptRoot$2.apply(RunTask.scala:48)
	at sbt.impl.RunTask$$anonfun$runTasksExceptRoot$2.apply(RunTask.scala:48)
	at sbt.Distributor$Run$Worker$$anonfun$2.apply(ParallelRunner.scala:131)
	at sbt.Distributor$Run$Worker$$anonfun$2.apply(ParallelRunner.scala:131)
	at sbt.Control$.trapUnit(Control.scala:19)
	at sbt.Distributor$Run$Worker.run(ParallelRunner.scala:131)
[2012-08-18 00:41:51,849] WARN Session 0x139372cb9020003 for server null, unexpected error,
closing socket connection and attempting reconnect (org.apache.zookeeper.ClientCnxn:1188)
java.net.ConnectException: Connection refused
	at sun.nio.ch.Net.connect(Native Method)
	at sun.nio.ch.SocketChannelImpl.connect(SocketChannelImpl.java:507)
	at org.apache.zookeeper.ClientCnxn$SendThread.startConnect(ClientCnxn.java:1071)
	at org.apache.zookeeper.ClientCnxn$SendThread.run(ClientCnxn.java:1104)
[2012-08-18 00:41:51,849] WARN Session 0x139372d09690002 for server null, unexpected error,
closing socket connection and attempting reconnect (org.apache.zookeeper.ClientCnxn:1188)
java.net.ConnectException: Connection refused
	at sun.nio.ch.Net.connect(Native Method)
	at sun.nio.ch.SocketChannelImpl.connect(SocketChannelImpl.java:507)
	at org.apache.zookeeper.ClientCnxn$SendThread.startConnect(ClientCnxn.java:1071)
	at org.apache.zookeeper.ClientCnxn$SendThread.run(ClientCnxn.java:1104)
[2012-08-18 00:41:51,848] WARN Session 0x139372b1d270002 for server null, unexpected error,
closing socket connection and attempting reconnect (org.apache.zookeeper.ClientCnxn:1188)
java.net.ConnectException: Connection refused
	at sun.nio.ch.Net.connect(Native Method)
	at sun.nio.ch.SocketChannelImpl.connect(SocketChannelImpl.java:507)
	at org.apache.zookeeper.ClientCnxn$SendThread.startConnect(ClientCnxn.java:1071)
	at org.apache.zookeeper.ClientCnxn$SendThread.run(ClientCnxn.java:1104)
[2012-08-18 00:41:51,848] WARN Session 0x139372d123f0002 for server null, unexpected error,
closing socket connection and attempting reconnect (org.apache.zookeeper.ClientCnxn:1188)
java.net.ConnectException: Connection refused
	at sun.nio.ch.Net.connect(Native Method)
	at sun.nio.ch.SocketChannelImpl.connect(SocketChannelImpl.java:507)
	at org.apache.zookeeper.ClientCnxn$SendThread.startConnect(ClientCnxn.java:1071)
	at org.apache.zookeeper.ClientCnxn$SendThread.run(ClientCnxn.java:1104)
[2012-08-18 00:41:51,848] WARN Session 0x139372d08910002 for server null, unexpected error,
closing socket connection and attempting reconnect (org.apache.zookeeper.ClientCnxn:1188)
java.net.ConnectException: Connection refused
	at sun.nio.ch.Net.connect(Native Method)
	at sun.nio.ch.SocketChannelImpl.connect(SocketChannelImpl.java:507)
	at org.apache.zookeeper.ClientCnxn$SendThread.startConnect(ClientCnxn.java:1071)
	at org.apache.zookeeper.ClientCnxn$SendThread.run(ClientCnxn.java:1104)
[2012-08-18 00:41:51,868] ERROR Connection attempt to localhost:47213 failed, next attempt
in 100 ms (kafka.producer.SyncProducer:99)
java.net.ConnectException: Connection refused
	at sun.nio.ch.Net.connect(Native Method)
	at sun.nio.ch.SocketChannelImpl.connect(SocketChannelImpl.java:507)
	at kafka.network.BlockingChannel.connect(BlockingChannel.scala:57)
	at kafka.producer.SyncProducer.connect(SyncProducer.scala:161)
	at kafka.producer.SyncProducer.getOrMakeConnection(SyncProducer.scala:182)
	at kafka.producer.SyncProducer.doSend(SyncProducer.scala:74)
	at kafka.producer.SyncProducer.send(SyncProducer.scala:116)
	at kafka.producer.BrokerPartitionInfo.updateInfo(BrokerPartitionInfo.scala:86)
	at kafka.producer.async.DefaultEventHandler$$anonfun$handle$1.apply$mcV$sp(DefaultEventHandler.scala:53)
	at kafka.utils.Utils$.swallow(Utils.scala:415)
	at kafka.utils.Logging$class.swallowError(Logging.scala:102)
	at kafka.utils.Utils$.swallowError(Utils.scala:40)
	at kafka.producer.async.DefaultEventHandler.handle(DefaultEventHandler.scala:53)
	at kafka.producer.AsyncProducerTest.testFailedSendRetryLogic(AsyncProducerTest.scala:438)
	at sun.reflect.NativeMethodAccessorImpl.invoke0(Native Method)
	at sun.reflect.NativeMethodAccessorImpl.invoke(NativeMethodAccessorImpl.java:39)
	at sun.reflect.DelegatingMethodAccessorImpl.invoke(DelegatingMethodAccessorImpl.java:25)
	at java.lang.reflect.Method.invoke(Method.java:597)
	at junit.framework.TestCase.runTest(TestCase.java:164)
	at junit.framework.TestCase.runBare(TestCase.java:130)
	at junit.framework.TestResult$1.protect(TestResult.java:110)
	at junit.framework.TestResult.runProtected(TestResult.java:128)
	at junit.framework.TestResult.run(TestResult.java:113)
	at junit.framework.TestCase.run(TestCase.java:120)
	at junit.framework.TestSuite.runTest(TestSuite.java:228)
	at junit.framework.TestSuite.run(TestSuite.java:223)
	at junit.framework.TestSuite.runTest(TestSuite.java:228)
	at junit.framework.TestSuite.run(TestSuite.java:223)
	at org.scalatest.junit.JUnit3Suite.run(JUnit3Suite.scala:309)
	at org.scalatest.tools.ScalaTestFramework$ScalaTestRunner.run(ScalaTestFramework.scala:40)
	at sbt.TestRunner.run(TestFramework.scala:53)
	at sbt.TestRunner.runTest$1(TestFramework.scala:67)
	at sbt.TestRunner.run(TestFramework.scala:76)
	at sbt.TestFramework$$anonfun$10$$anonfun$apply$11.runTest$2(TestFramework.scala:194)
	at sbt.TestFramework$$anonfun$10$$anonfun$apply$11$$anonfun$apply$12.apply(TestFramework.scala:205)
	at sbt.TestFramework$$anonfun$10$$anonfun$apply$11$$anonfun$apply$12.apply(TestFramework.scala:205)
	at sbt.NamedTestTask.run(TestFramework.scala:92)
	at sbt.ScalaProject$$anonfun$sbt$ScalaProject$$toTask$1.apply(ScalaProject.scala:193)
	at sbt.ScalaProject$$anonfun$sbt$ScalaProject$$toTask$1.apply(ScalaProject.scala:193)
	at sbt.TaskManager$Task.invoke(TaskManager.scala:62)
	at sbt.impl.RunTask.doRun$1(RunTask.scala:77)
	at sbt.impl.RunTask.runTask(RunTask.scala:85)
	at sbt.impl.RunTask.sbt$impl$RunTask$$runIfNotRoot(RunTask.scala:60)
	at sbt.impl.RunTask$$anonfun$runTasksExceptRoot$2.apply(RunTask.scala:48)
	at sbt.impl.RunTask$$anonfun$runTasksExceptRoot$2.apply(RunTask.scala:48)
	at sbt.Distributor$Run$Worker$$anonfun$2.apply(ParallelRunner.scala:131)
	at sbt.Distributor$Run$Worker$$anonfun$2.apply(ParallelRunner.scala:131)
	at sbt.Control$.trapUnit(Control.scala:19)
	at sbt.Distributor$Run$Worker.run(ParallelRunner.scala:131)
[2012-08-18 00:41:51,978] ERROR Producer connection to localhost:47213 timing out after 5000
ms (kafka.producer.SyncProducer:99)
java.net.ConnectException: Connection refused
	at sun.nio.ch.Net.connect(Native Method)
	at sun.nio.ch.SocketChannelImpl.connect(SocketChannelImpl.java:507)
	at kafka.network.BlockingChannel.connect(BlockingChannel.scala:57)
	at kafka.producer.SyncProducer.connect(SyncProducer.scala:161)
	at kafka.producer.SyncProducer.getOrMakeConnection(SyncProducer.scala:182)
	at kafka.producer.SyncProducer.doSend(SyncProducer.scala:74)
	at kafka.producer.SyncProducer.send(SyncProducer.scala:116)
	at kafka.producer.BrokerPartitionInfo.updateInfo(BrokerPartitionInfo.scala:86)
	at kafka.producer.async.DefaultEventHandler$$anonfun$handle$1.apply$mcV$sp(DefaultEventHandler.scala:53)
	at kafka.utils.Utils$.swallow(Utils.scala:415)
	at kafka.utils.Logging$class.swallowError(Logging.scala:102)
	at kafka.utils.Utils$.swallowError(Utils.scala:40)
	at kafka.producer.async.DefaultEventHandler.handle(DefaultEventHandler.scala:53)
	at kafka.producer.AsyncProducerTest.testFailedSendRetryLogic(AsyncProducerTest.scala:438)
	at sun.reflect.NativeMethodAccessorImpl.invoke0(Native Method)
	at sun.reflect.NativeMethodAccessorImpl.invoke(NativeMethodAccessorImpl.java:39)
	at sun.reflect.DelegatingMethodAccessorImpl.invoke(DelegatingMethodAccessorImpl.java:25)
	at java.lang.reflect.Method.invoke(Method.java:597)
	at junit.framework.TestCase.runTest(TestCase.java:164)
	at junit.framework.TestCase.runBare(TestCase.java:130)
	at junit.framework.TestResult$1.protect(TestResult.java:110)
	at junit.framework.TestResult.runProtected(TestResult.java:128)
	at junit.framework.TestResult.run(TestResult.java:113)
	at junit.framework.TestCase.run(TestCase.java:120)
	at junit.framework.TestSuite.runTest(TestSuite.java:228)
	at junit.framework.TestSuite.run(TestSuite.java:223)
	at junit.framework.TestSuite.runTest(TestSuite.java:228)
	at junit.framework.TestSuite.run(TestSuite.java:223)
	at org.scalatest.junit.JUnit3Suite.run(JUnit3Suite.scala:309)
	at org.scalatest.tools.ScalaTestFramework$ScalaTestRunner.run(ScalaTestFramework.scala:40)
	at sbt.TestRunner.run(TestFramework.scala:53)
	at sbt.TestRunner.runTest$1(TestFramework.scala:67)
	at sbt.TestRunner.run(TestFramework.scala:76)
	at sbt.TestFramework$$anonfun$10$$anonfun$apply$11.runTest$2(TestFramework.scala:194)
	at sbt.TestFramework$$anonfun$10$$anonfun$apply$11$$anonfun$apply$12.apply(TestFramework.scala:205)
	at sbt.TestFramework$$anonfun$10$$anonfun$apply$11$$anonfun$apply$12.apply(TestFramework.scala:205)
	at sbt.NamedTestTask.run(TestFramework.scala:92)
	at sbt.ScalaProject$$anonfun$sbt$ScalaProject$$toTask$1.apply(ScalaProject.scala:193)
	at sbt.ScalaProject$$anonfun$sbt$ScalaProject$$toTask$1.apply(ScalaProject.scala:193)
	at sbt.TaskManager$Task.invoke(TaskManager.scala:62)
	at sbt.impl.RunTask.doRun$1(RunTask.scala:77)
	at sbt.impl.RunTask.runTask(RunTask.scala:85)
	at sbt.impl.RunTask.sbt$impl$RunTask$$runIfNotRoot(RunTask.scala:60)
	at sbt.impl.RunTask$$anonfun$runTasksExceptRoot$2.apply(RunTask.scala:48)
	at sbt.impl.RunTask$$anonfun$runTasksExceptRoot$2.apply(RunTask.scala:48)
	at sbt.Distributor$Run$Worker$$anonfun$2.apply(ParallelRunner.scala:131)
	at sbt.Distributor$Run$Worker$$anonfun$2.apply(ParallelRunner.scala:131)
	at sbt.Control$.trapUnit(Control.scala:19)
	at sbt.Distributor$Run$Worker.run(ParallelRunner.scala:131)
[2012-08-18 00:41:51,979] ERROR fetching broker partition metadata for topics [ListBuffer(topic1)]
from broker [ArrayBuffer(id:0,creatorId:localhost-1345250491862,host:localhost,port:47213)]
failed (kafka.utils.Utils$:102)
kafka.common.KafkaException: fetching broker partition metadata for topics [ListBuffer(topic1)]
from broker [ArrayBuffer(id:0,creatorId:localhost-1345250491862,host:localhost,port:47213)]
failed
	at kafka.producer.BrokerPartitionInfo.updateInfo(BrokerPartitionInfo.scala:112)
	at kafka.producer.async.DefaultEventHandler$$anonfun$handle$1.apply$mcV$sp(DefaultEventHandler.scala:53)
	at kafka.utils.Utils$.swallow(Utils.scala:415)
	at kafka.utils.Logging$class.swallowError(Logging.scala:102)
	at kafka.utils.Utils$.swallowError(Utils.scala:40)
	at kafka.producer.async.DefaultEventHandler.handle(DefaultEventHandler.scala:53)
	at kafka.producer.AsyncProducerTest.testFailedSendRetryLogic(AsyncProducerTest.scala:438)
	at sun.reflect.NativeMethodAccessorImpl.invoke0(Native Method)
	at sun.reflect.NativeMethodAccessorImpl.invoke(NativeMethodAccessorImpl.java:39)
	at sun.reflect.DelegatingMethodAccessorImpl.invoke(DelegatingMethodAccessorImpl.java:25)
	at java.lang.reflect.Method.invoke(Method.java:597)
	at junit.framework.TestCase.runTest(TestCase.java:164)
	at junit.framework.TestCase.runBare(TestCase.java:130)
	at junit.framework.TestResult$1.protect(TestResult.java:110)
	at junit.framework.TestResult.runProtected(TestResult.java:128)
	at junit.framework.TestResult.run(TestResult.java:113)
	at junit.framework.TestCase.run(TestCase.java:120)
	at junit.framework.TestSuite.runTest(TestSuite.java:228)
	at junit.framework.TestSuite.run(TestSuite.java:223)
	at junit.framework.TestSuite.runTest(TestSuite.java:228)
	at junit.framework.TestSuite.run(TestSuite.java:223)
	at org.scalatest.junit.JUnit3Suite.run(JUnit3Suite.scala:309)
	at org.scalatest.tools.ScalaTestFramework$ScalaTestRunner.run(ScalaTestFramework.scala:40)
	at sbt.TestRunner.run(TestFramework.scala:53)
	at sbt.TestRunner.runTest$1(TestFramework.scala:67)
	at sbt.TestRunner.run(TestFramework.scala:76)
	at sbt.TestFramework$$anonfun$10$$anonfun$apply$11.runTest$2(TestFramework.scala:194)
	at sbt.TestFramework$$anonfun$10$$anonfun$apply$11$$anonfun$apply$12.apply(TestFramework.scala:205)
	at sbt.TestFramework$$anonfun$10$$anonfun$apply$11$$anonfun$apply$12.apply(TestFramework.scala:205)
	at sbt.NamedTestTask.run(TestFramework.scala:92)
	at sbt.ScalaProject$$anonfun$sbt$ScalaProject$$toTask$1.apply(ScalaProject.scala:193)
	at sbt.ScalaProject$$anonfun$sbt$ScalaProject$$toTask$1.apply(ScalaProject.scala:193)
	at sbt.TaskManager$Task.invoke(TaskManager.scala:62)
	at sbt.impl.RunTask.doRun$1(RunTask.scala:77)
	at sbt.impl.RunTask.runTask(RunTask.scala:85)
	at sbt.impl.RunTask.sbt$impl$RunTask$$runIfNotRoot(RunTask.scala:60)
	at sbt.impl.RunTask$$anonfun$runTasksExceptRoot$2.apply(RunTask.scala:48)
	at sbt.impl.RunTask$$anonfun$runTasksExceptRoot$2.apply(RunTask.scala:48)
	at sbt.Distributor$Run$Worker$$anonfun$2.apply(ParallelRunner.scala:131)
	at sbt.Distributor$Run$Worker$$anonfun$2.apply(ParallelRunner.scala:131)
	at sbt.Control$.trapUnit(Control.scala:19)
	at sbt.Distributor$Run$Worker.run(ParallelRunner.scala:131)
Caused by: java.net.ConnectException: Connection refused
	at sun.nio.ch.Net.connect(Native Method)
	at sun.nio.ch.SocketChannelImpl.connect(SocketChannelImpl.java:507)
	at kafka.network.BlockingChannel.connect(BlockingChannel.scala:57)
	at kafka.producer.SyncProducer.connect(SyncProducer.scala:161)
	at kafka.producer.SyncProducer.getOrMakeConnection(SyncProducer.scala:182)
	at kafka.producer.SyncProducer.doSend(SyncProducer.scala:74)
	at kafka.producer.SyncProducer.send(SyncProducer.scala:116)
	at kafka.producer.BrokerPartitionInfo.updateInfo(BrokerPartitionInfo.scala:86)
	... 41 more
[info] Test Passed: testFailedSendRetryLogic(kafka.producer.AsyncProducerTest)
[info] Test Starting: testJavaProducer(kafka.producer.AsyncProducerTest)
[info] Test Passed: testJavaProducer(kafka.producer.AsyncProducerTest)
[info] Test Starting: testInvalidConfiguration(kafka.producer.AsyncProducerTest)
[info] Test Passed: testInvalidConfiguration(kafka.producer.AsyncProducerTest)
[info] == core-kafka / kafka.producer.AsyncProducerTest ==
[info] 
[info] == core-kafka / kafka.log4j.KafkaLog4jAppenderTest ==
[info] Test Starting: testKafkaLog4jConfigs(kafka.log4j.KafkaLog4jAppenderTest)
log4j:WARN No appenders could be found for logger (org.I0Itec.zkclient.ZkEventThread).
log4j:WARN Please initialize the log4j system properly.
[info] Test Passed: testKafkaLog4jConfigs(kafka.log4j.KafkaLog4jAppenderTest)
[info] Test Starting: testLog4jAppends(kafka.log4j.KafkaLog4jAppenderTest)
[info] Test Passed: testLog4jAppends(kafka.log4j.KafkaLog4jAppenderTest)
[info] == core-kafka / kafka.log4j.KafkaLog4jAppenderTest ==
[info] 
[info] == core-kafka / kafka.server.LeaderElectionTest ==
[info] Test Starting: testLeaderElectionAndEpoch(kafka.server.LeaderElectionTest)
[info] Test Passed: testLeaderElectionAndEpoch(kafka.server.LeaderElectionTest)
[info] == core-kafka / kafka.server.LeaderElectionTest ==
[info] 
[info] == core-kafka / Test cleanup 1 ==
[info] Deleting directory /var/tmp/sbt_f0ab0172
[info] == core-kafka / Test cleanup 1 ==
[info] 
[info] == core-kafka / test-finish ==
[error] Failed: : Total 140, Failed 2, Errors 0, Passed 138, Skipped 0
[info] == core-kafka / test-finish ==
[info] 
[info] == core-kafka / test-cleanup ==
[info] == core-kafka / test-cleanup ==
[error] Error running kafka.message.CompressionUtilTest: Test FAILED
[error] Error running kafka.producer.AsyncProducerTest: Test FAILED
[error] Error running test: One or more subtasks failed
[info] 
[info] Total time: 289 s, completed Aug 18, 2012 12:41:57 AM
[info] 
[info] Total session time: 290 s, completed Aug 18, 2012 12:41:57 AM
[error] Error during build.
Build step 'Execute shell' marked build as failure

Mime
View raw message