kafka-commits mailing list archives

Site index · List index
Message view « Date » · « Thread »
Top « Date » · « Thread »
From Apache Jenkins Server <jenk...@builds.apache.org>
Subject Build failed in Jenkins: Kafka-0.8 #23
Date Fri, 17 Aug 2012 22:08:42 GMT
See <https://builds.apache.org/job/Kafka-0.8/23/changes>

Changes:

[junrao] enforce broker.id to be a non-negative integer; patched by Swapnil Ghike; reviewed
by Jun Rao, Neha Narkhede; KAFKA-424

------------------------------------------
[...truncated 3791 lines...]
	at junit.framework.TestSuite.run(TestSuite.java:223)
	at org.scalatest.junit.JUnit3Suite.run(JUnit3Suite.scala:309)
	at org.scalatest.tools.ScalaTestFramework$ScalaTestRunner.run(ScalaTestFramework.scala:40)
	at sbt.TestRunner.run(TestFramework.scala:53)
	at sbt.TestRunner.runTest$1(TestFramework.scala:67)
	at sbt.TestRunner.run(TestFramework.scala:76)
	at sbt.TestFramework$$anonfun$10$$anonfun$apply$11.runTest$2(TestFramework.scala:194)
	at sbt.TestFramework$$anonfun$10$$anonfun$apply$11$$anonfun$apply$12.apply(TestFramework.scala:205)
	at sbt.TestFramework$$anonfun$10$$anonfun$apply$11$$anonfun$apply$12.apply(TestFramework.scala:205)
	at sbt.NamedTestTask.run(TestFramework.scala:92)
	at sbt.ScalaProject$$anonfun$sbt$ScalaProject$$toTask$1.apply(ScalaProject.scala:193)
	at sbt.ScalaProject$$anonfun$sbt$ScalaProject$$toTask$1.apply(ScalaProject.scala:193)
	at sbt.TaskManager$Task.invoke(TaskManager.scala:62)
	at sbt.impl.RunTask.doRun$1(RunTask.scala:77)
	at sbt.impl.RunTask.runTask(RunTask.scala:85)
	at sbt.impl.RunTask.sbt$impl$RunTask$$runIfNotRoot(RunTask.scala:60)
	at sbt.impl.RunTask$$anonfun$runTasksExceptRoot$2.apply(RunTask.scala:48)
	at sbt.impl.RunTask$$anonfun$runTasksExceptRoot$2.apply(RunTask.scala:48)
	at sbt.Distributor$Run$Worker$$anonfun$2.apply(ParallelRunner.scala:131)
	at sbt.Distributor$Run$Worker$$anonfun$2.apply(ParallelRunner.scala:131)
	at sbt.Control$.trapUnit(Control.scala:19)
	at sbt.Distributor$Run$Worker.run(ParallelRunner.scala:131)
[info] Test Starting: testMultiProduce(kafka.integration.LazyInitProducerTest)
[error] Test Failed: testMultiProduce(kafka.integration.LazyInitProducerTest)
java.net.BindException: Address already in use
	at sun.nio.ch.Net.bind(Native Method)
	at sun.nio.ch.ServerSocketChannelImpl.bind(ServerSocketChannelImpl.java:126)
	at sun.nio.ch.ServerSocketAdaptor.bind(ServerSocketAdaptor.java:59)
	at sun.nio.ch.ServerSocketAdaptor.bind(ServerSocketAdaptor.java:52)
	at org.apache.zookeeper.server.NIOServerCnxn$Factory.<init>(NIOServerCnxn.java:144)
	at org.apache.zookeeper.server.NIOServerCnxn$Factory.<init>(NIOServerCnxn.java:125)
	at kafka.zk.EmbeddedZookeeper.<init>(EmbeddedZookeeper.scala:32)
	at kafka.zk.ZooKeeperTestHarness$class.setUp(ZooKeeperTestHarness.scala:32)
	at kafka.integration.LazyInitProducerTest.kafka$integration$KafkaServerTestHarness$$super$setUp(LazyInitProducerTest.scala:33)
	at kafka.integration.KafkaServerTestHarness$class.setUp(KafkaServerTestHarness.scala:35)
	at kafka.integration.LazyInitProducerTest.kafka$integration$ProducerConsumerTestHarness$$super$setUp(LazyInitProducerTest.scala:33)
	at kafka.integration.ProducerConsumerTestHarness$class.setUp(ProducerConsumerTestHarness.scala:34)
	at kafka.integration.LazyInitProducerTest.setUp(LazyInitProducerTest.scala:42)
	at junit.framework.TestCase.runBare(TestCase.java:128)
	at junit.framework.TestResult$1.protect(TestResult.java:110)
	at junit.framework.TestResult.runProtected(TestResult.java:128)
	at junit.framework.TestResult.run(TestResult.java:113)
	at junit.framework.TestCase.run(TestCase.java:120)
	at junit.framework.TestSuite.runTest(TestSuite.java:228)
	at junit.framework.TestSuite.run(TestSuite.java:223)
	at junit.framework.TestSuite.runTest(TestSuite.java:228)
	at junit.framework.TestSuite.run(TestSuite.java:223)
	at org.scalatest.junit.JUnit3Suite.run(JUnit3Suite.scala:309)
	at org.scalatest.tools.ScalaTestFramework$ScalaTestRunner.run(ScalaTestFramework.scala:40)
	at sbt.TestRunner.run(TestFramework.scala:53)
	at sbt.TestRunner.runTest$1(TestFramework.scala:67)
	at sbt.TestRunner.run(TestFramework.scala:76)
	at sbt.TestFramework$$anonfun$10$$anonfun$apply$11.runTest$2(TestFramework.scala:194)
	at sbt.TestFramework$$anonfun$10$$anonfun$apply$11$$anonfun$apply$12.apply(TestFramework.scala:205)
	at sbt.TestFramework$$anonfun$10$$anonfun$apply$11$$anonfun$apply$12.apply(TestFramework.scala:205)
	at sbt.NamedTestTask.run(TestFramework.scala:92)
	at sbt.ScalaProject$$anonfun$sbt$ScalaProject$$toTask$1.apply(ScalaProject.scala:193)
	at sbt.ScalaProject$$anonfun$sbt$ScalaProject$$toTask$1.apply(ScalaProject.scala:193)
	at sbt.TaskManager$Task.invoke(TaskManager.scala:62)
	at sbt.impl.RunTask.doRun$1(RunTask.scala:77)
	at sbt.impl.RunTask.runTask(RunTask.scala:85)
	at sbt.impl.RunTask.sbt$impl$RunTask$$runIfNotRoot(RunTask.scala:60)
	at sbt.impl.RunTask$$anonfun$runTasksExceptRoot$2.apply(RunTask.scala:48)
	at sbt.impl.RunTask$$anonfun$runTasksExceptRoot$2.apply(RunTask.scala:48)
	at sbt.Distributor$Run$Worker$$anonfun$2.apply(ParallelRunner.scala:131)
	at sbt.Distributor$Run$Worker$$anonfun$2.apply(ParallelRunner.scala:131)
	at sbt.Control$.trapUnit(Control.scala:19)
	at sbt.Distributor$Run$Worker.run(ParallelRunner.scala:131)
[info] Test Starting: testProduceAndFetch(kafka.integration.LazyInitProducerTest)
[error] Test Failed: testProduceAndFetch(kafka.integration.LazyInitProducerTest)
java.net.BindException: Address already in use
	at sun.nio.ch.Net.bind(Native Method)
	at sun.nio.ch.ServerSocketChannelImpl.bind(ServerSocketChannelImpl.java:126)
	at sun.nio.ch.ServerSocketAdaptor.bind(ServerSocketAdaptor.java:59)
	at sun.nio.ch.ServerSocketAdaptor.bind(ServerSocketAdaptor.java:52)
	at org.apache.zookeeper.server.NIOServerCnxn$Factory.<init>(NIOServerCnxn.java:144)
	at org.apache.zookeeper.server.NIOServerCnxn$Factory.<init>(NIOServerCnxn.java:125)
	at kafka.zk.EmbeddedZookeeper.<init>(EmbeddedZookeeper.scala:32)
	at kafka.zk.ZooKeeperTestHarness$class.setUp(ZooKeeperTestHarness.scala:32)
	at kafka.integration.LazyInitProducerTest.kafka$integration$KafkaServerTestHarness$$super$setUp(LazyInitProducerTest.scala:33)
	at kafka.integration.KafkaServerTestHarness$class.setUp(KafkaServerTestHarness.scala:35)
	at kafka.integration.LazyInitProducerTest.kafka$integration$ProducerConsumerTestHarness$$super$setUp(LazyInitProducerTest.scala:33)
	at kafka.integration.ProducerConsumerTestHarness$class.setUp(ProducerConsumerTestHarness.scala:34)
	at kafka.integration.LazyInitProducerTest.setUp(LazyInitProducerTest.scala:42)
	at junit.framework.TestCase.runBare(TestCase.java:128)
	at junit.framework.TestResult$1.protect(TestResult.java:110)
	at junit.framework.TestResult.runProtected(TestResult.java:128)
	at junit.framework.TestResult.run(TestResult.java:113)
	at junit.framework.TestCase.run(TestCase.java:120)
	at junit.framework.TestSuite.runTest(TestSuite.java:228)
	at junit.framework.TestSuite.run(TestSuite.java:223)
	at junit.framework.TestSuite.runTest(TestSuite.java:228)
	at junit.framework.TestSuite.run(TestSuite.java:223)
	at org.scalatest.junit.JUnit3Suite.run(JUnit3Suite.scala:309)
	at org.scalatest.tools.ScalaTestFramework$ScalaTestRunner.run(ScalaTestFramework.scala:40)
	at sbt.TestRunner.run(TestFramework.scala:53)
	at sbt.TestRunner.runTest$1(TestFramework.scala:67)
	at sbt.TestRunner.run(TestFramework.scala:76)
	at sbt.TestFramework$$anonfun$10$$anonfun$apply$11.runTest$2(TestFramework.scala:194)
	at sbt.TestFramework$$anonfun$10$$anonfun$apply$11$$anonfun$apply$12.apply(TestFramework.scala:205)
	at sbt.TestFramework$$anonfun$10$$anonfun$apply$11$$anonfun$apply$12.apply(TestFramework.scala:205)
	at sbt.NamedTestTask.run(TestFramework.scala:92)
	at sbt.ScalaProject$$anonfun$sbt$ScalaProject$$toTask$1.apply(ScalaProject.scala:193)
	at sbt.ScalaProject$$anonfun$sbt$ScalaProject$$toTask$1.apply(ScalaProject.scala:193)
	at sbt.TaskManager$Task.invoke(TaskManager.scala:62)
	at sbt.impl.RunTask.doRun$1(RunTask.scala:77)
	at sbt.impl.RunTask.runTask(RunTask.scala:85)
	at sbt.impl.RunTask.sbt$impl$RunTask$$runIfNotRoot(RunTask.scala:60)
	at sbt.impl.RunTask$$anonfun$runTasksExceptRoot$2.apply(RunTask.scala:48)
	at sbt.impl.RunTask$$anonfun$runTasksExceptRoot$2.apply(RunTask.scala:48)
	at sbt.Distributor$Run$Worker$$anonfun$2.apply(ParallelRunner.scala:131)
	at sbt.Distributor$Run$Worker$$anonfun$2.apply(ParallelRunner.scala:131)
	at sbt.Control$.trapUnit(Control.scala:19)
	at sbt.Distributor$Run$Worker.run(ParallelRunner.scala:131)
[info] Test Starting: testMultiProduceResend(kafka.integration.LazyInitProducerTest)
[error] Test Failed: testMultiProduceResend(kafka.integration.LazyInitProducerTest)
java.net.BindException: Address already in use
	at sun.nio.ch.Net.bind(Native Method)
	at sun.nio.ch.ServerSocketChannelImpl.bind(ServerSocketChannelImpl.java:126)
	at sun.nio.ch.ServerSocketAdaptor.bind(ServerSocketAdaptor.java:59)
	at sun.nio.ch.ServerSocketAdaptor.bind(ServerSocketAdaptor.java:52)
	at org.apache.zookeeper.server.NIOServerCnxn$Factory.<init>(NIOServerCnxn.java:144)
	at org.apache.zookeeper.server.NIOServerCnxn$Factory.<init>(NIOServerCnxn.java:125)
	at kafka.zk.EmbeddedZookeeper.<init>(EmbeddedZookeeper.scala:32)
	at kafka.zk.ZooKeeperTestHarness$class.setUp(ZooKeeperTestHarness.scala:32)
	at kafka.integration.LazyInitProducerTest.kafka$integration$KafkaServerTestHarness$$super$setUp(LazyInitProducerTest.scala:33)
	at kafka.integration.KafkaServerTestHarness$class.setUp(KafkaServerTestHarness.scala:35)
	at kafka.integration.LazyInitProducerTest.kafka$integration$ProducerConsumerTestHarness$$super$setUp(LazyInitProducerTest.scala:33)
	at kafka.integration.ProducerConsumerTestHarness$class.setUp(ProducerConsumerTestHarness.scala:34)
	at kafka.integration.LazyInitProducerTest.setUp(LazyInitProducerTest.scala:42)
	at junit.framework.TestCase.runBare(TestCase.java:128)
	at junit.framework.TestResult$1.protect(TestResult.java:110)
	at junit.framework.TestResult.runProtected(TestResult.java:128)
	at junit.framework.TestResult.run(TestResult.java:113)
	at junit.framework.TestCase.run(TestCase.java:120)
	at junit.framework.TestSuite.runTest(TestSuite.java:228)
	at junit.framework.TestSuite.run(TestSuite.java:223)
	at junit.framework.TestSuite.runTest(TestSuite.java:228)
	at junit.framework.TestSuite.run(TestSuite.java:223)
	at org.scalatest.junit.JUnit3Suite.run(JUnit3Suite.scala:309)
	at org.scalatest.tools.ScalaTestFramework$ScalaTestRunner.run(ScalaTestFramework.scala:40)
	at sbt.TestRunner.run(TestFramework.scala:53)
	at sbt.TestRunner.runTest$1(TestFramework.scala:67)
	at sbt.TestRunner.run(TestFramework.scala:76)
	at sbt.TestFramework$$anonfun$10$$anonfun$apply$11.runTest$2(TestFramework.scala:194)
	at sbt.TestFramework$$anonfun$10$$anonfun$apply$11$$anonfun$apply$12.apply(TestFramework.scala:205)
	at sbt.TestFramework$$anonfun$10$$anonfun$apply$11$$anonfun$apply$12.apply(TestFramework.scala:205)
	at sbt.NamedTestTask.run(TestFramework.scala:92)
	at sbt.ScalaProject$$anonfun$sbt$ScalaProject$$toTask$1.apply(ScalaProject.scala:193)
	at sbt.ScalaProject$$anonfun$sbt$ScalaProject$$toTask$1.apply(ScalaProject.scala:193)
	at sbt.TaskManager$Task.invoke(TaskManager.scala:62)
	at sbt.impl.RunTask.doRun$1(RunTask.scala:77)
	at sbt.impl.RunTask.runTask(RunTask.scala:85)
	at sbt.impl.RunTask.sbt$impl$RunTask$$runIfNotRoot(RunTask.scala:60)
	at sbt.impl.RunTask$$anonfun$runTasksExceptRoot$2.apply(RunTask.scala:48)
	at sbt.impl.RunTask$$anonfun$runTasksExceptRoot$2.apply(RunTask.scala:48)
	at sbt.Distributor$Run$Worker$$anonfun$2.apply(ParallelRunner.scala:131)
	at sbt.Distributor$Run$Worker$$anonfun$2.apply(ParallelRunner.scala:131)
	at sbt.Control$.trapUnit(Control.scala:19)
	at sbt.Distributor$Run$Worker.run(ParallelRunner.scala:131)
[info] == core-kafka / kafka.integration.LazyInitProducerTest ==
[info] 
[info] == core-kafka / kafka.server.LeaderElectionTest ==
[info] Test Starting: testLeaderElectionAndEpoch(kafka.server.LeaderElectionTest)
[error] Test Failed: testLeaderElectionAndEpoch(kafka.server.LeaderElectionTest)
java.net.BindException: Address already in use
	at sun.nio.ch.Net.bind(Native Method)
	at sun.nio.ch.ServerSocketChannelImpl.bind(ServerSocketChannelImpl.java:126)
	at sun.nio.ch.ServerSocketAdaptor.bind(ServerSocketAdaptor.java:59)
	at sun.nio.ch.ServerSocketAdaptor.bind(ServerSocketAdaptor.java:52)
	at org.apache.zookeeper.server.NIOServerCnxn$Factory.<init>(NIOServerCnxn.java:144)
	at org.apache.zookeeper.server.NIOServerCnxn$Factory.<init>(NIOServerCnxn.java:125)
	at kafka.zk.EmbeddedZookeeper.<init>(EmbeddedZookeeper.scala:32)
	at kafka.zk.ZooKeeperTestHarness$class.setUp(ZooKeeperTestHarness.scala:32)
	at kafka.server.LeaderElectionTest.setUp(LeaderElectionTest.scala:39)
	at junit.framework.TestCase.runBare(TestCase.java:128)
	at junit.framework.TestResult$1.protect(TestResult.java:110)
	at junit.framework.TestResult.runProtected(TestResult.java:128)
	at junit.framework.TestResult.run(TestResult.java:113)
	at junit.framework.TestCase.run(TestCase.java:120)
	at junit.framework.TestSuite.runTest(TestSuite.java:228)
	at junit.framework.TestSuite.run(TestSuite.java:223)
	at junit.framework.TestSuite.runTest(TestSuite.java:228)
	at junit.framework.TestSuite.run(TestSuite.java:223)
	at org.scalatest.junit.JUnit3Suite.run(JUnit3Suite.scala:309)
	at org.scalatest.tools.ScalaTestFramework$ScalaTestRunner.run(ScalaTestFramework.scala:40)
	at sbt.TestRunner.run(TestFramework.scala:53)
	at sbt.TestRunner.runTest$1(TestFramework.scala:67)
	at sbt.TestRunner.run(TestFramework.scala:76)
	at sbt.TestFramework$$anonfun$10$$anonfun$apply$11.runTest$2(TestFramework.scala:194)
	at sbt.TestFramework$$anonfun$10$$anonfun$apply$11$$anonfun$apply$12.apply(TestFramework.scala:205)
	at sbt.TestFramework$$anonfun$10$$anonfun$apply$11$$anonfun$apply$12.apply(TestFramework.scala:205)
	at sbt.NamedTestTask.run(TestFramework.scala:92)
	at sbt.ScalaProject$$anonfun$sbt$ScalaProject$$toTask$1.apply(ScalaProject.scala:193)
	at sbt.ScalaProject$$anonfun$sbt$ScalaProject$$toTask$1.apply(ScalaProject.scala:193)
	at sbt.TaskManager$Task.invoke(TaskManager.scala:62)
	at sbt.impl.RunTask.doRun$1(RunTask.scala:77)
	at sbt.impl.RunTask.runTask(RunTask.scala:85)
	at sbt.impl.RunTask.sbt$impl$RunTask$$runIfNotRoot(RunTask.scala:60)
	at sbt.impl.RunTask$$anonfun$runTasksExceptRoot$2.apply(RunTask.scala:48)
	at sbt.impl.RunTask$$anonfun$runTasksExceptRoot$2.apply(RunTask.scala:48)
	at sbt.Distributor$Run$Worker$$anonfun$2.apply(ParallelRunner.scala:131)
	at sbt.Distributor$Run$Worker$$anonfun$2.apply(ParallelRunner.scala:131)
	at sbt.Control$.trapUnit(Control.scala:19)
	at sbt.Distributor$Run$Worker.run(ParallelRunner.scala:131)
[info] == core-kafka / kafka.server.LeaderElectionTest ==
[info] 
[info] == core-kafka / kafka.network.SocketServerTest ==
[info] Test Starting: simpleRequest
[info] Test Passed: simpleRequest
[info] Test Starting: tooBigRequestIsRejected
[info] Test Passed: tooBigRequestIsRejected
[info] == core-kafka / kafka.network.SocketServerTest ==
[info] 
[info] == core-kafka / test-finish ==
[error] Failed: : Total 140, Failed 61, Errors 0, Passed 79, Skipped 0
[info] == core-kafka / test-finish ==
[info] 
[info] == core-kafka / Test cleanup 1 ==
[info] Deleting directory /tmp/sbt_c45e98f8
[info] == core-kafka / Test cleanup 1 ==
[info] 
[info] == core-kafka / test-cleanup ==
[info] == core-kafka / test-cleanup ==
[error] Error running kafka.zk.ZKEphemeralTest: Test FAILED
[error] Error running kafka.server.ReplicaFetchTest: Test FAILED
[error] Error running kafka.server.LeaderElectionTest: Test FAILED
[error] Error running kafka.javaapi.consumer.ZookeeperConsumerConnectorTest:
Test FAILED
[error] Error running kafka.server.ServerShutdownTest: Test FAILED
[error] Error running kafka.producer.SyncProducerTest: Test FAILED
[error] Error running test: One or more subtasks failed
[error] Error running kafka.server.LogRecoveryTest: Test FAILED
[error] Error running kafka.integration.LazyInitProducerTest: Test FAILED
[error] Error running kafka.integration.AutoOffsetResetTest: Test FAILED
[error] Error running kafka.admin.AdminTest: Test FAILED
[error] Error running kafka.log.LogOffsetTest: Test FAILED
[error] Error running kafka.log.LogCorruptionTest: Test FAILED
[error] Error running kafka.integration.TopicMetadataTest: Test FAILED
[error] Error running kafka.log.LogManagerTest: Test FAILED
[error] Error running kafka.consumer.ZookeeperConsumerConnectorTest: Test
FAILED
[error] Error running kafka.integration.BackwardsCompatibilityTest: Test
FAILED
[error] Error running kafka.controller.ControllerBasicTest: Test FAILED
[error] Error running kafka.integration.PrimitiveApiTest: Test FAILED
[info] 
[info] Total time: 109 s, completed Aug 17, 2012 10:08:41 PM
[info] 
[info] Total session time: 109 s, completed Aug 17, 2012 10:08:41 PM
[error] Error during build.
Build step 'Execute shell' marked build as failure

Mime
View raw message