kafka-commits mailing list archives

Site index · List index
Message view « Date » · « Thread »
Top « Date » · « Thread »
From Apache Jenkins Server <jenk...@builds.apache.org>
Subject Build failed in Jenkins: Kafka-0.8 #11
Date Thu, 26 Jul 2012 20:14:15 GMT
See <https://builds.apache.org/job/Kafka-0.8/11/changes>

Changes:

[junrao] single_host_multi_brokers system test fails on laptop; patched by John Fung; reviewed
by Jun Rao; kafka-413

------------------------------------------
[...truncated 2995 lines...]
	at sun.reflect.DelegatingConstructorAccessorImpl.newInstance(DelegatingConstructorAccessorImpl.java:27)
	at java.lang.reflect.Constructor.newInstance(Constructor.java:513)
	at java.lang.Class.newInstance0(Class.java:355)
	at java.lang.Class.newInstance(Class.java:308)
	at kafka.common.ErrorMapping$.maybeThrowException(ErrorMapping.scala:66)
	at kafka.producer.BrokerPartitionInfo$$anonfun$updateInfo$1$$anonfun$apply$5$$anonfun$apply$6.apply(BrokerPartitionInfo.scala:85)
	at kafka.producer.BrokerPartitionInfo$$anonfun$updateInfo$1$$anonfun$apply$5$$anonfun$apply$6.apply(BrokerPartitionInfo.scala:85)
	at scala.collection.LinearSeqOptimized$class.foreach(LinearSeqOptimized.scala:61)
	at scala.collection.immutable.List.foreach(List.scala:45)
	at scala.collection.generic.TraversableForwarder$class.foreach(TraversableForwarder.scala:44)
	at scala.collection.mutable.ListBuffer.foreach(ListBuffer.scala:42)
	at kafka.producer.BrokerPartitionInfo$$anonfun$updateInfo$1$$anonfun$apply$5.apply(BrokerPartitionInfo.scala:85)
	at kafka.producer.BrokerPartitionInfo$$anonfun$updateInfo$1$$anonfun$apply$5.apply(BrokerPartitionInfo.scala:84)
	at scala.collection.IndexedSeqOptimized$class.foreach(IndexedSeqOptimized.scala:34)
	at scala.collection.mutable.WrappedArray.foreach(WrappedArray.scala:32)
	at kafka.producer.BrokerPartitionInfo$$anonfun$updateInfo$1.apply(BrokerPartitionInfo.scala:84)
	at kafka.producer.BrokerPartitionInfo$$anonfun$updateInfo$1.apply(BrokerPartitionInfo.scala:75)
	at scala.collection.LinearSeqOptimized$class.foreach(LinearSeqOptimized.scala:61)
	at scala.collection.immutable.List.foreach(List.scala:45)
	at kafka.producer.BrokerPartitionInfo.updateInfo(BrokerPartitionInfo.scala:75)
	at kafka.producer.async.DefaultEventHandler$$anonfun$handle$1.apply$mcV$sp(DefaultEventHandler.scala:54)
	at kafka.utils.Utils$.swallow(Utils.scala:428)
	at kafka.utils.Logging$class.swallowError(Logging.scala:102)
	at kafka.utils.Utils$.swallowError(Utils.scala:39)
	at kafka.producer.async.DefaultEventHandler.handle(DefaultEventHandler.scala:54)
	at kafka.producer.Producer.send(Producer.scala:70)
	at kafka.integration.LazyInitProducerTest.testMultiProduceResend(LazyInitProducerTest.scala:165)
	at sun.reflect.NativeMethodAccessorImpl.invoke0(Native Method)
	at sun.reflect.NativeMethodAccessorImpl.invoke(NativeMethodAccessorImpl.java:39)
	at sun.reflect.DelegatingMethodAccessorImpl.invoke(DelegatingMethodAccessorImpl.java:25)
	at java.lang.reflect.Method.invoke(Method.java:597)
	at junit.framework.TestCase.runTest(TestCase.java:164)
	at junit.framework.TestCase.runBare(TestCase.java:130)
	at junit.framework.TestResult$1.protect(TestResult.java:110)
	at junit.framework.TestResult.runProtected(TestResult.java:128)
	at junit.framework.TestResult.run(TestResult.java:113)
	at junit.framework.TestCase.run(TestCase.java:120)
	at junit.framework.TestSuite.runTest(TestSuite.java:228)
	at junit.framework.TestSuite.run(TestSuite.java:223)
	at junit.framework.TestSuite.runTest(TestSuite.java:228)
	at junit.framework.TestSuite.run(TestSuite.java:223)
	at org.scalatest.junit.JUnit3Suite.run(JUnit3Suite.scala:309)
	at org.scalatest.tools.ScalaTestFramework$ScalaTestRunner.run(ScalaTestFramework.scala:40)
	at sbt.TestRunner.run(TestFramework.scala:53)
	at sbt.TestRunner.runTest$1(TestFramework.scala:67)
	at sbt.TestRunner.run(TestFramework.scala:76)
	at sbt.TestFramework$$anonfun$10$$anonfun$apply$11.runTest$2(TestFramework.scala:194)
	at sbt.TestFramework$$anonfun$10$$anonfun$apply$11$$anonfun$apply$12.apply(TestFramework.scala:205)
	at sbt.TestFramework$$anonfun$10$$anonfun$apply$11$$anonfun$apply$12.apply(TestFramework.scala:205)
	at sbt.NamedTestTask.run(TestFramework.scala:92)
	at sbt.ScalaProject$$anonfun$sbt$ScalaProject$$toTask$1.apply(ScalaProject.scala:193)
	at sbt.ScalaProject$$anonfun$sbt$ScalaProject$$toTask$1.apply(ScalaProject.scala:193)
	at sbt.TaskManager$Task.invoke(TaskManager.scala:62)
	at sbt.impl.RunTask.doRun$1(RunTask.scala:77)
	at sbt.impl.RunTask.runTask(RunTask.scala:85)
	at sbt.impl.RunTask.sbt$impl$RunTask$$runIfNotRoot(RunTask.scala:60)
	at sbt.impl.RunTask$$anonfun$runTasksExceptRoot$2.apply(RunTask.scala:48)
	at sbt.impl.RunTask$$anonfun$runTasksExceptRoot$2.apply(RunTask.scala:48)
	at sbt.Distributor$Run$Worker$$anonfun$2.apply(ParallelRunner.scala:131)
	at sbt.Distributor$Run$Worker$$anonfun$2.apply(ParallelRunner.scala:131)
	at sbt.Control$.trapUnit(Control.scala:19)
	at sbt.Distributor$Run$Worker.run(ParallelRunner.scala:131)
[info] Test Passed: testMultiProduceResend(kafka.integration.LazyInitProducerTest)
[info] == core-kafka / kafka.integration.LazyInitProducerTest ==
[info] 
[info] == core-kafka / kafka.consumer.TopicFilterTest ==
[info] Test Starting: testWhitelists
[info] Test Passed: testWhitelists
[info] Test Starting: testBlacklists
[info] Test Passed: testBlacklists
[info] == core-kafka / kafka.consumer.TopicFilterTest ==
[info] 
[info] == core-kafka / kafka.server.ServerShutdownTest ==
[info] Test Starting: testCleanShutdown(kafka.server.ServerShutdownTest)
[info] Test Passed: testCleanShutdown(kafka.server.ServerShutdownTest)
[info] == core-kafka / kafka.server.ServerShutdownTest ==
[info] 
[info] == core-kafka / kafka.javaapi.message.ByteBufferMessageSetTest ==
[info] Test Starting: testWrittenEqualsRead
[2012-07-26 20:13:17,638] WARN Session 0x138c4eb58740013 for server null, unexpected error,
closing socket connection and attempting reconnect (org.apache.zookeeper.ClientCnxn:1188)
java.net.ConnectException: Connection refused
	at sun.nio.ch.SocketChannelImpl.checkConnect(Native Method)
	at sun.nio.ch.SocketChannelImpl.finishConnect(SocketChannelImpl.java:567)
	at org.apache.zookeeper.ClientCnxn$SendThread.run(ClientCnxn.java:1146)
[info] Test Passed: testWrittenEqualsRead
[info] Test Starting: testIteratorIsConsistent
[info] Test Passed: testIteratorIsConsistent
[info] Test Starting: testSizeInBytes
[info] Test Passed: testSizeInBytes
[info] Test Starting: testValidBytes
[info] Test Passed: testValidBytes
[info] Test Starting: testEquals
[info] Test Passed: testEquals
[info] Test Starting: testIteratorIsConsistentWithCompression
[info] Test Passed: testIteratorIsConsistentWithCompression
[info] Test Starting: testSizeInBytesWithCompression
[info] Test Passed: testSizeInBytesWithCompression
[info] Test Starting: testValidBytesWithCompression
[info] Test Passed: testValidBytesWithCompression
[info] Test Starting: testEqualsWithCompression
[info] Test Passed: testEqualsWithCompression
[info] == core-kafka / kafka.javaapi.message.ByteBufferMessageSetTest ==
[info] 
[info] == core-kafka / kafka.log4j.KafkaLog4jAppenderTest ==
[info] Test Starting: testKafkaLog4jConfigs(kafka.log4j.KafkaLog4jAppenderTest)
log4j:WARN No appenders could be found for logger (org.I0Itec.zkclient.ZkEventThread).
log4j:WARN Please initialize the log4j system properly.
[info] Test Passed: testKafkaLog4jConfigs(kafka.log4j.KafkaLog4jAppenderTest)
[info] Test Starting: testZkConnectLog4jAppends(kafka.log4j.KafkaLog4jAppenderTest)
[info] Test Passed: testZkConnectLog4jAppends(kafka.log4j.KafkaLog4jAppenderTest)
[info] == core-kafka / kafka.log4j.KafkaLog4jAppenderTest ==
[info] 
[info] == core-kafka / kafka.message.CompressionUtilTest ==
[info] Test Starting: testSimpleCompressDecompress
[info] Test Passed: testSimpleCompressDecompress
[info] Test Starting: testComplexCompressDecompress
[info] Test Passed: testComplexCompressDecompress
[info] Test Starting: testSnappyCompressDecompressExplicit
[info] Test Passed: testSnappyCompressDecompressExplicit
[info] == core-kafka / kafka.message.CompressionUtilTest ==
[info] 
[info] == core-kafka / kafka.javaapi.consumer.ZookeeperConsumerConnectorTest
==
[info] Test Starting: testBasic(kafka.javaapi.consumer.ZookeeperConsumerConnectorTest)
[info] Test Passed: testBasic(kafka.javaapi.consumer.ZookeeperConsumerConnectorTest)
[info] == core-kafka / kafka.javaapi.consumer.ZookeeperConsumerConnectorTest
==
[info] 
[info] == core-kafka / kafka.producer.AsyncProducerTest ==
[info] Test Starting: testProducerQueueSize(kafka.producer.AsyncProducerTest)
[info] Test Passed: testProducerQueueSize(kafka.producer.AsyncProducerTest)
[info] Test Starting: testProduceAfterClosed(kafka.producer.AsyncProducerTest)
[info] Test Passed: testProduceAfterClosed(kafka.producer.AsyncProducerTest)
[info] Test Starting: testBatchSize(kafka.producer.AsyncProducerTest)
[info] Test Passed: testBatchSize(kafka.producer.AsyncProducerTest)
[info] Test Starting: testQueueTimeExpired(kafka.producer.AsyncProducerTest)
[info] Test Passed: testQueueTimeExpired(kafka.producer.AsyncProducerTest)
[info] Test Starting: testPartitionAndCollateEvents(kafka.producer.AsyncProducerTest)
[info] Test Passed: testPartitionAndCollateEvents(kafka.producer.AsyncProducerTest)
[info] Test Starting: testSerializeEvents(kafka.producer.AsyncProducerTest)
[info] Test Passed: testSerializeEvents(kafka.producer.AsyncProducerTest)
[info] Test Starting: testInvalidPartition(kafka.producer.AsyncProducerTest)
[info] Test Passed: testInvalidPartition(kafka.producer.AsyncProducerTest)
[info] Test Starting: testNoBroker(kafka.producer.AsyncProducerTest)
[info] Test Passed: testNoBroker(kafka.producer.AsyncProducerTest)
[info] Test Starting: testIncompatibleEncoder(kafka.producer.AsyncProducerTest)
[info] Test Passed: testIncompatibleEncoder(kafka.producer.AsyncProducerTest)
[info] Test Starting: testRandomPartitioner(kafka.producer.AsyncProducerTest)
[info] Test Passed: testRandomPartitioner(kafka.producer.AsyncProducerTest)
[info] Test Starting: testBrokerListAndAsync(kafka.producer.AsyncProducerTest)
[info] Test Passed: testBrokerListAndAsync(kafka.producer.AsyncProducerTest)
[info] Test Starting: testFailedSendRetryLogic(kafka.producer.AsyncProducerTest)
[info] Test Passed: testFailedSendRetryLogic(kafka.producer.AsyncProducerTest)
[info] Test Starting: testJavaProducer(kafka.producer.AsyncProducerTest)
[info] Test Passed: testJavaProducer(kafka.producer.AsyncProducerTest)
[info] Test Starting: testInvalidConfiguration(kafka.producer.AsyncProducerTest)
[info] Test Passed: testInvalidConfiguration(kafka.producer.AsyncProducerTest)
[info] == core-kafka / kafka.producer.AsyncProducerTest ==
[info] 
[info] == core-kafka / kafka.controller.ControllerToBrokerRequestTest ==
[info] Test Starting: testLeaderAndISRRequest(kafka.controller.ControllerToBrokerRequestTest)
[info] Test Passed: testLeaderAndISRRequest(kafka.controller.ControllerToBrokerRequestTest)
[info] Test Starting: testLeaderAndISRResponse(kafka.controller.ControllerToBrokerRequestTest)
[info] Test Passed: testLeaderAndISRResponse(kafka.controller.ControllerToBrokerRequestTest)
[info] Test Starting: testStopReplicaRequest(kafka.controller.ControllerToBrokerRequestTest)
[info] Test Passed: testStopReplicaRequest(kafka.controller.ControllerToBrokerRequestTest)
[info] Test Starting: testStopReplicaResponse(kafka.controller.ControllerToBrokerRequestTest)
[info] Test Passed: testStopReplicaResponse(kafka.controller.ControllerToBrokerRequestTest)
[info] Test Starting: testEndToEndLeaderAndISRRequest(kafka.controller.ControllerToBrokerRequestTest)
[info] Test Passed: testEndToEndLeaderAndISRRequest(kafka.controller.ControllerToBrokerRequestTest)
[info] Test Starting: testEndToEndStopReplicaRequest(kafka.controller.ControllerToBrokerRequestTest)
[info] Test Passed: testEndToEndStopReplicaRequest(kafka.controller.ControllerToBrokerRequestTest)
[info] == core-kafka / kafka.controller.ControllerToBrokerRequestTest ==
[info] 
[info] == core-kafka / kafka.log.LogCorruptionTest ==
[info] Test Starting: testMessageSizeTooLarge(kafka.log.LogCorruptionTest)
This is good
[info] Test Passed: testMessageSizeTooLarge(kafka.log.LogCorruptionTest)
[info] == core-kafka / kafka.log.LogCorruptionTest ==
[info] 
[info] == core-kafka / kafka.server.LogRecoveryTest ==
[info] Test Starting: testHWCheckpointNoFailuresSingleLogSegment(kafka.server.LogRecoveryTest)
[info] Test Passed: testHWCheckpointNoFailuresSingleLogSegment(kafka.server.LogRecoveryTest)
[info] Test Starting: testHWCheckpointWithFailuresSingleLogSegment(kafka.server.LogRecoveryTest)
[info] Test Passed: testHWCheckpointWithFailuresSingleLogSegment(kafka.server.LogRecoveryTest)
[info] Test Starting: testHWCheckpointNoFailuresMultipleLogSegments(kafka.server.LogRecoveryTest)
[info] Test Passed: testHWCheckpointNoFailuresMultipleLogSegments(kafka.server.LogRecoveryTest)
[info] Test Starting: testHWCheckpointWithFailuresMultipleLogSegments(kafka.server.LogRecoveryTest)
[error] Test Failed: testHWCheckpointWithFailuresMultipleLogSegments(kafka.server.LogRecoveryTest)
java.lang.AssertionError: expected:<120> but was:<150>
	at org.junit.Assert.fail(Assert.java:69)
	at org.junit.Assert.failNotEquals(Assert.java:314)
	at org.junit.Assert.assertEquals(Assert.java:94)
	at org.junit.Assert.assertEquals(Assert.java:104)
	at kafka.server.LogRecoveryTest.testHWCheckpointWithFailuresMultipleLogSegments(LogRecoveryTest.scala:239)
	at sun.reflect.NativeMethodAccessorImpl.invoke0(Native Method)
	at sun.reflect.NativeMethodAccessorImpl.invoke(NativeMethodAccessorImpl.java:39)
	at sun.reflect.DelegatingMethodAccessorImpl.invoke(DelegatingMethodAccessorImpl.java:25)
	at java.lang.reflect.Method.invoke(Method.java:597)
	at junit.framework.TestCase.runTest(TestCase.java:164)
	at junit.framework.TestCase.runBare(TestCase.java:130)
	at junit.framework.TestResult$1.protect(TestResult.java:110)
	at junit.framework.TestResult.runProtected(TestResult.java:128)
	at junit.framework.TestResult.run(TestResult.java:113)
	at junit.framework.TestCase.run(TestCase.java:120)
	at junit.framework.TestSuite.runTest(TestSuite.java:228)
	at junit.framework.TestSuite.run(TestSuite.java:223)
	at junit.framework.TestSuite.runTest(TestSuite.java:228)
	at junit.framework.TestSuite.run(TestSuite.java:223)
	at org.scalatest.junit.JUnit3Suite.run(JUnit3Suite.scala:309)
	at org.scalatest.tools.ScalaTestFramework$ScalaTestRunner.run(ScalaTestFramework.scala:40)
	at sbt.TestRunner.run(TestFramework.scala:53)
	at sbt.TestRunner.runTest$1(TestFramework.scala:67)
	at sbt.TestRunner.run(TestFramework.scala:76)
	at sbt.TestFramework$$anonfun$10$$anonfun$apply$11.runTest$2(TestFramework.scala:194)
	at sbt.TestFramework$$anonfun$10$$anonfun$apply$11$$anonfun$apply$12.apply(TestFramework.scala:205)
	at sbt.TestFramework$$anonfun$10$$anonfun$apply$11$$anonfun$apply$12.apply(TestFramework.scala:205)
	at sbt.NamedTestTask.run(TestFramework.scala:92)
	at sbt.ScalaProject$$anonfun$sbt$ScalaProject$$toTask$1.apply(ScalaProject.scala:193)
	at sbt.ScalaProject$$anonfun$sbt$ScalaProject$$toTask$1.apply(ScalaProject.scala:193)
	at sbt.TaskManager$Task.invoke(TaskManager.scala:62)
	at sbt.impl.RunTask.doRun$1(RunTask.scala:77)
	at sbt.impl.RunTask.runTask(RunTask.scala:85)
	at sbt.impl.RunTask.sbt$impl$RunTask$$runIfNotRoot(RunTask.scala:60)
	at sbt.impl.RunTask$$anonfun$runTasksExceptRoot$2.apply(RunTask.scala:48)
	at sbt.impl.RunTask$$anonfun$runTasksExceptRoot$2.apply(RunTask.scala:48)
	at sbt.Distributor$Run$Worker$$anonfun$2.apply(ParallelRunner.scala:131)
	at sbt.Distributor$Run$Worker$$anonfun$2.apply(ParallelRunner.scala:131)
	at sbt.Control$.trapUnit(Control.scala:19)
	at sbt.Distributor$Run$Worker.run(ParallelRunner.scala:131)
[info] == core-kafka / kafka.server.LogRecoveryTest ==
[info] 
[info] == core-kafka / test-finish ==
[error] Failed: : Total 145, Failed 2, Errors 0, Passed 143, Skipped 0
[info] == core-kafka / test-finish ==
[info] 
[info] == core-kafka / Test cleanup 1 ==
[info] Deleting directory /tmp/sbt_3327170
[info] == core-kafka / Test cleanup 1 ==
[info] 
[info] == core-kafka / test-cleanup ==
[info] == core-kafka / test-cleanup ==
[error] Error running kafka.integration.LazyInitProducerTest: Test FAILED
[error] Error running kafka.server.LogRecoveryTest: Test FAILED
[error] Error running test: One or more subtasks failed
[info] 
[info] Total time: 245 s, completed Jul 26, 2012 8:14:13 PM
[info] 
[info] Total session time: 276 s, completed Jul 26, 2012 8:14:13 PM
[error] Error during build.
Build step 'Execute shell' marked build as failure

Mime
View raw message