juneau-dev mailing list archives

Site index · List index
Message view « Date » · « Thread »
Top « Date » · « Thread »
From Apache Jenkins Server <jenk...@builds.apache.org>
Subject Build failed in Jenkins: Juneau-Java-1.8 #1798
Date Sun, 12 Jul 2020 16:45:39 GMT
See <https://builds.apache.org/job/Juneau-Java-1.8/1798/display/redirect?page=changes>

Changes:

[JamesBognar] org.apache.juneau.http tests.


------------------------------------------
[...truncated 504.55 KB...]
[INFO] 
[INFO] --- maven-bundle-plugin:3.2.0:deploy (default-deploy) @ juneau-rest-server-utest ---
[INFO] Remote OBR update disabled (enable with -DremoteOBR)
[INFO]                                                                         
[INFO] ------------------------------------------------------------------------
[INFO] Building juneau/rest/rest-client-utest 8.1.4-SNAPSHOT
[INFO] ------------------------------------------------------------------------
[INFO] 
[INFO] --- maven-clean-plugin:3.1.0:clean (default-clean) @ juneau-rest-client-utest ---
[INFO] Deleting <https://builds.apache.org/job/Juneau-Java-1.8/ws/juneau-rest/juneau-rest-client-utest/target>
[INFO] 
[INFO] --- maven-enforcer-plugin:1.4.1:enforce (enforce-maven-version) @ juneau-rest-client-utest
---
[INFO] 
[INFO] --- maven-enforcer-plugin:1.4.1:enforce (enforce-maven) @ juneau-rest-client-utest
---
[INFO] 
[INFO] --- jacoco-maven-plugin:0.8.2:prepare-agent (default-prepare-agent) @ juneau-rest-client-utest
---
[INFO] argLine set to -javaagent:/home/jenkins/.m2/repository/org/jacoco/org.jacoco.agent/0.8.2/org.jacoco.agent-0.8.2-runtime.jar=destfile=<https://builds.apache.org/job/Juneau-Java-1.8/ws/juneau-rest/juneau-rest-client-utest/target/jacoco.exec>
[INFO] 
[INFO] --- maven-remote-resources-plugin:1.5:process (process-resource-bundles) @ juneau-rest-client-utest
---
[INFO] 
[INFO] --- maven-resources-plugin:3.1.0:resources (default-resources) @ juneau-rest-client-utest
---
[INFO] Using 'UTF-8' encoding to copy filtered resources.
[INFO] skip non existing resourceDirectory <https://builds.apache.org/job/Juneau-Java-1.8/ws/juneau-rest/juneau-rest-client-utest/src/main/resources>
[INFO] Copying 3 resources
[INFO] 
[INFO] --- maven-compiler-plugin:3.7.0:compile (default-compile) @ juneau-rest-client-utest
---
[INFO] Nothing to compile - all classes are up to date
[INFO] 
[INFO] --- maven-resources-plugin:3.1.0:testResources (default-testResources) @ juneau-rest-client-utest
---
[INFO] Using 'UTF-8' encoding to copy filtered resources.
[INFO] skip non existing resourceDirectory <https://builds.apache.org/job/Juneau-Java-1.8/ws/juneau-rest/juneau-rest-client-utest/src/test/resources>
[INFO] Copying 3 resources
[INFO] 
[INFO] --- maven-compiler-plugin:3.7.0:testCompile (default-testCompile) @ juneau-rest-client-utest
---
[INFO] Changes detected - recompiling the module!
[INFO] Compiling 46 source files to <https://builds.apache.org/job/Juneau-Java-1.8/ws/juneau-rest/juneau-rest-client-utest/target/test-classes>
[INFO] 
[INFO] --- maven-surefire-plugin:2.22.0:test (default-test) @ juneau-rest-client-utest ---
[INFO] 
[INFO] -------------------------------------------------------
[INFO]  T E S T S
[INFO] -------------------------------------------------------
[INFO] Running org.apache.juneau.http.BasicNameValuePair_Test
[INFO] Tests run: 6, Failures: 0, Errors: 0, Skipped: 0, Time elapsed: 1.002 s - in org.apache.juneau.http.BasicNameValuePair_Test
[INFO] Running org.apache.juneau.http.BasicHttpResource_Test
[INFO] Tests run: 1, Failures: 0, Errors: 0, Skipped: 0, Time elapsed: 0.043 s - in org.apache.juneau.http.BasicHttpResource_Test
[INFO] Running org.apache.juneau.http.HeaderSupplier_Test
[INFO] Tests run: 4, Failures: 0, Errors: 0, Skipped: 0, Time elapsed: 0.234 s - in org.apache.juneau.http.HeaderSupplier_Test
[INFO] Running org.apache.juneau.http.BasicHttpEntity_Test
[INFO] Tests run: 1, Failures: 0, Errors: 0, Skipped: 0, Time elapsed: 0.007 s - in org.apache.juneau.http.BasicHttpEntity_Test
[INFO] Running org.apache.juneau.http.BasicHeader_Test
[INFO] Tests run: 7, Failures: 0, Errors: 0, Skipped: 0, Time elapsed: 0.028 s - in org.apache.juneau.http.BasicHeader_Test
[INFO] Running org.apache.juneau.http.HttpHeader_Test
[INFO] Tests run: 1, Failures: 0, Errors: 0, Skipped: 0, Time elapsed: 0 s - in org.apache.juneau.http.HttpHeader_Test
[INFO] Running org.apache.juneau.http.NameValuePairSupplier_Test
[INFO] Tests run: 4, Failures: 0, Errors: 0, Skipped: 0, Time elapsed: 0.014 s - in org.apache.juneau.http.NameValuePairSupplier_Test
[INFO] Running org.apache.juneau.http.header.AcceptExtensionsTest
[INFO] Tests run: 2, Failures: 0, Errors: 0, Skipped: 0, Time elapsed: 0.036 s - in org.apache.juneau.http.header.AcceptExtensionsTest
[INFO] Running org.apache.juneau.http.header.MediaRangeTest
[INFO] Tests run: 17, Failures: 0, Errors: 0, Skipped: 0, Time elapsed: 0.037 s - in org.apache.juneau.http.header.MediaRangeTest
[INFO] Running org.apache.juneau.http.header.ContentTypeTest
[INFO] Tests run: 2, Failures: 0, Errors: 0, Skipped: 0, Time elapsed: 0.001 s - in org.apache.juneau.http.header.ContentTypeTest
[INFO] Running org.apache.juneau.http.header.ContentType2Test
[INFO] Tests run: 21, Failures: 0, Errors: 0, Skipped: 0, Time elapsed: 0.052 s - in org.apache.juneau.http.header.ContentType2Test
[INFO] Running org.apache.juneau.http.header.AcceptTest
[INFO] Tests run: 146, Failures: 0, Errors: 0, Skipped: 0, Time elapsed: 0.122 s - in org.apache.juneau.http.header.AcceptTest
[INFO] Running org.apache.juneau.rest.client2.RestClient_Config_Parser_Test
[INFO] Tests run: 3, Failures: 0, Errors: 0, Skipped: 0, Time elapsed: 1.952 s - in org.apache.juneau.rest.client2.RestClient_Config_Parser_Test
[INFO] Running org.apache.juneau.rest.client2.RestClient_Response_Test
[INFO] Tests run: 16, Failures: 0, Errors: 0, Skipped: 0, Time elapsed: 0.51 s - in org.apache.juneau.rest.client2.RestClient_Response_Test
[INFO] Running org.apache.juneau.rest.client2.Remote_CommonInterfaces_Test
[INFO] Tests run: 9, Failures: 0, Errors: 0, Skipped: 0, Time elapsed: 1.169 s - in org.apache.juneau.rest.client2.Remote_CommonInterfaces_Test
[INFO] Running org.apache.juneau.rest.client2.Remote_ResponseAnnotation_Test
[INFO] Tests run: 3, Failures: 0, Errors: 0, Skipped: 0, Time elapsed: 0.078 s - in org.apache.juneau.rest.client2.Remote_ResponseAnnotation_Test
[INFO] Running org.apache.juneau.rest.client2.RestClient_Query_Test
[INFO] Tests run: 12, Failures: 0, Errors: 0, Skipped: 0, Time elapsed: 0.298 s - in org.apache.juneau.rest.client2.RestClient_Query_Test
[INFO] Running org.apache.juneau.rest.client2.Remote_PathAnnotation_Test
[INFO] Tests run: 12, Failures: 0, Errors: 0, Skipped: 0, Time elapsed: 0.789 s - in org.apache.juneau.rest.client2.Remote_PathAnnotation_Test
[INFO] Running org.apache.juneau.rest.client2.Remote_QueryAnnotation_Test
[INFO] Tests run: 16, Failures: 0, Errors: 0, Skipped: 0, Time elapsed: 0.756 s - in org.apache.juneau.rest.client2.Remote_QueryAnnotation_Test
[INFO] Running org.apache.juneau.rest.client2.Remote_RequestAnnotation_Test
[INFO] Tests run: 5, Failures: 0, Errors: 0, Skipped: 0, Time elapsed: 0.161 s - in org.apache.juneau.rest.client2.Remote_RequestAnnotation_Test
[INFO] Running org.apache.juneau.rest.client2.RestClient_CallbackStrings_Test
[INFO] Tests run: 2, Failures: 0, Errors: 0, Skipped: 0, Time elapsed: 0.033 s - in org.apache.juneau.rest.client2.RestClient_CallbackStrings_Test
[INFO] Running org.apache.juneau.rest.client2.RestCallException_Test
[INFO] Tests run: 1, Failures: 0, Errors: 0, Skipped: 0, Time elapsed: 0.073 s - in org.apache.juneau.rest.client2.RestCallException_Test
[INFO] Running org.apache.juneau.rest.client2.Remote_RemoteMethodAnnotation_Test
[INFO] Tests run: 6, Failures: 0, Errors: 0, Skipped: 0, Time elapsed: 0.228 s - in org.apache.juneau.rest.client2.Remote_RemoteMethodAnnotation_Test
[INFO] Running org.apache.juneau.rest.client2.RestClient_Body_Test
Jul 12, 2020 4:45:15 PM org.apache.juneau.rest.BasicRestCallLogger log
WARNING: 
=== HTTP Call (incoming) ======================================================
[200] HTTP POST /
	Request length: 0 bytes
	Response code: 200
	Response length: 0 bytes
	Exec time: 5ms
---Request Headers---
	Accept: application/json+simple
	Accept-Encoding: gzip,deflate
	Connection: Keep-Alive
	Host: localhost
	Transfer-Encoding: chunked
	User-Agent: Apache-HttpClient/4.5.6 (Java/1.8.0_252)
	X-Debug: true
---Response Headers---
	X-Accept: application/json+simple
	X-Accept-Encoding: gzip,deflate
	X-Connection: Keep-Alive
	X-Host: localhost
	X-Transfer-Encoding: chunked
	X-User-Agent: Apache-HttpClient/4.5.6 (Java/1.8.0_252)
	X-X-Debug: true
=== END ======================================================================
[INFO] Tests run: 2, Failures: 0, Errors: 0, Skipped: 0, Time elapsed: 0.213 s - in org.apache.juneau.rest.client2.RestClient_Body_Test
[INFO] Running org.apache.juneau.rest.client2.RestClient_Logging_Test
[ERROR] Tests run: 3, Failures: 1, Errors: 0, Skipped: 0, Time elapsed: 0.154 s <<<
FAILURE! - in org.apache.juneau.rest.client2.RestClient_Logging_Test
[ERROR] a02_logTo(org.apache.juneau.rest.client2.RestClient_Logging_Test)  Time elapsed: 0.032
s  <<< FAILURE!
org.apache.juneau.BasicAssertionError: 
Unexpected value.
	Expected=[WARNING: HTTP POST http://localhost/bean, HTTP/1.1 200 
]
	Actual=[Jul 12, 2020 4:45:15 PM org.apache.juneau.rest.client2.RestClient log
WARNING: HTTP POST http://localhost/bean, HTTP/1.1 200 
]
	at org.apache.juneau.rest.client2.RestClient_Logging_Test.a02_logTo(RestClient_Logging_Test.java:152)

[INFO] Running org.apache.juneau.rest.client2.RestClient_FormData_Test
[INFO] Tests run: 12, Failures: 0, Errors: 0, Skipped: 0, Time elapsed: 0.27 s - in org.apache.juneau.rest.client2.RestClient_FormData_Test
[INFO] Running org.apache.juneau.rest.client2.RestClient_Headers_Test
[INFO] Tests run: 18, Failures: 0, Errors: 0, Skipped: 0, Time elapsed: 0.61 s - in org.apache.juneau.rest.client2.RestClient_Headers_Test
[INFO] Running org.apache.juneau.rest.client2.RestClient_Marshalls_Test
[INFO] Tests run: 7, Failures: 0, Errors: 0, Skipped: 0, Time elapsed: 0.549 s - in org.apache.juneau.rest.client2.RestClient_Marshalls_Test
[INFO] Running org.apache.juneau.rest.client2.Remote_FormDataAnnotation_Test
[INFO] Tests run: 16, Failures: 0, Errors: 0, Skipped: 0, Time elapsed: 0.579 s - in org.apache.juneau.rest.client2.Remote_FormDataAnnotation_Test
[INFO] Running org.apache.juneau.rest.client2.ext.BasicHttpRequestRetryHandler_Test
[INFO] Tests run: 1, Failures: 0, Errors: 0, Skipped: 0, Time elapsed: 0.045 s - in org.apache.juneau.rest.client2.ext.BasicHttpRequestRetryHandler_Test
[INFO] Running org.apache.juneau.rest.client2.RestClient_Config_BeanContext_Test
[INFO] Tests run: 39, Failures: 0, Errors: 0, Skipped: 0, Time elapsed: 0.893 s - in org.apache.juneau.rest.client2.RestClient_Config_BeanContext_Test
[INFO] Running org.apache.juneau.rest.client2.Remote_Test
[INFO] Tests run: 26, Failures: 0, Errors: 0, Skipped: 0, Time elapsed: 0.4 s - in org.apache.juneau.rest.client2.Remote_Test
[INFO] Running org.apache.juneau.rest.client2.RestClient_Test
[INFO] Tests run: 39, Failures: 0, Errors: 0, Skipped: 0, Time elapsed: 2.347 s - in org.apache.juneau.rest.client2.RestClient_Test
[INFO] Running org.apache.juneau.rest.client2.RestClient_Config_OpenApi_Test
[INFO] Tests run: 3, Failures: 0, Errors: 0, Skipped: 0, Time elapsed: 0.075 s - in org.apache.juneau.rest.client2.RestClient_Config_OpenApi_Test
[INFO] Running org.apache.juneau.rest.client2.RestClient_Response_Body_Test
[INFO] Tests run: 9, Failures: 0, Errors: 0, Skipped: 0, Time elapsed: 0.286 s - in org.apache.juneau.rest.client2.RestClient_Response_Body_Test
[INFO] Running org.apache.juneau.rest.client2.RestClient_BasicCalls_Test
[INFO] Tests run: 30, Failures: 0, Errors: 0, Skipped: 0, Time elapsed: 0.434 s - in org.apache.juneau.rest.client2.RestClient_BasicCalls_Test
[INFO] Running org.apache.juneau.rest.client2.RestClient_Config_Serializer_Test
[INFO] Tests run: 17, Failures: 0, Errors: 0, Skipped: 0, Time elapsed: 0.231 s - in org.apache.juneau.rest.client2.RestClient_Config_Serializer_Test
[INFO] Running org.apache.juneau.rest.client2.RestClient_Config_Context_Test
[INFO] Tests run: 11, Failures: 0, Errors: 0, Skipped: 0, Time elapsed: 0.164 s - in org.apache.juneau.rest.client2.RestClient_Config_Context_Test
[INFO] Running org.apache.juneau.rest.client2.RestClient_Config_RestClient_Test
[INFO] Tests run: 16, Failures: 0, Errors: 0, Skipped: 0, Time elapsed: 0.461 s - in org.apache.juneau.rest.client2.RestClient_Config_RestClient_Test
[INFO] Running org.apache.juneau.rest.client2.RestClient_Paths_Test
[INFO] Tests run: 5, Failures: 0, Errors: 0, Skipped: 0, Time elapsed: 0.089 s - in org.apache.juneau.rest.client2.RestClient_Paths_Test
[INFO] Running org.apache.juneau.rest.client2.RrpcInterfaceTest
SLF4J: Failed to load class "org.slf4j.impl.StaticLoggerBinder".
SLF4J: Defaulting to no-operation (NOP) logger implementation
SLF4J: See http://www.slf4j.org/codes.html#StaticLoggerBinder for further details.
[INFO] Tests run: 872, Failures: 0, Errors: 0, Skipped: 0, Time elapsed: 3.94 s - in org.apache.juneau.rest.client2.RrpcInterfaceTest
[INFO] Running org.apache.juneau.rest.client2.RestClient_Response_Headers_Test
[INFO] Tests run: 7, Failures: 0, Errors: 0, Skipped: 0, Time elapsed: 0.166 s - in org.apache.juneau.rest.client2.RestClient_Response_Headers_Test
[INFO] Running org.apache.juneau.rest.client2.Remote_BodyAnnotation_Test
[INFO] Tests run: 3, Failures: 0, Errors: 0, Skipped: 0, Time elapsed: 0.167 s - in org.apache.juneau.rest.client2.Remote_BodyAnnotation_Test
[INFO] Running org.apache.juneau.rest.client2.Remote_HeaderAnnotation_Test
[INFO] Tests run: 14, Failures: 0, Errors: 0, Skipped: 0, Time elapsed: 0.44 s - in org.apache.juneau.rest.client2.Remote_HeaderAnnotation_Test
[INFO] 
[INFO] Results:
[INFO] 
[ERROR] Failures: 
[ERROR]   RestClient_Logging_Test.a02_logTo:152 Unexpected value.
	Expected=[WARNING: HTTP POST http://localhost/bean, HTTP/1.1 200 
]
	Actual=[Jul 12, 2020 4:45:15 PM org.apache.juneau.rest.client2.RestClient log
WARNING: HTTP POST http://localhost/bean, HTTP/1.1 200 
]
[INFO] 
[ERROR] Tests run: 1447, Failures: 1, Errors: 0, Skipped: 0
[INFO] 
[INFO]                                                                         
[INFO] ------------------------------------------------------------------------
[INFO] Skipping juneau
[INFO] This project has been banned from the build due to previous failures.
[INFO] ------------------------------------------------------------------------
[INFO] ------------------------------------------------------------------------
[INFO] Reactor Summary:
[INFO] 
[INFO] juneau ............................................. SUCCESS [  8.709 s]
[INFO] juneau/core ........................................ SUCCESS [  2.956 s]
[INFO] juneau/core/marshall ............................... SUCCESS [01:22 min]
[INFO] juneau/core/marshall-rdf ........................... SUCCESS [ 10.356 s]
[INFO] juneau/core/dto .................................... SUCCESS [ 15.342 s]
[INFO] juneau/core/config ................................. SUCCESS [ 13.225 s]
[INFO] juneau/core/core-utest ............................. SUCCESS [01:14 min]
[INFO] juneau/rest ........................................ SUCCESS [  2.804 s]
[INFO] juneau/rest/rest-server ............................ SUCCESS [ 28.726 s]
[INFO] juneau/rest/rest-server-jaxrs ...................... SUCCESS [  7.719 s]
[INFO] juneau/rest/rest-server-rdf ........................ SUCCESS [ 11.542 s]
[INFO] juneau/rest/rest-server-springboot ................. SUCCESS [ 12.314 s]
[INFO] juneau/rest/rest-client ............................ SUCCESS [ 13.790 s]
[INFO] juneau/rest/rest-mock .............................. SUCCESS [  8.844 s]
[INFO] juneau/rest/rest-mock-utest ........................ SUCCESS [ 11.974 s]
[INFO] juneau/rest/rest-server-utest ...................... SUCCESS [ 41.850 s]
[INFO] juneau/rest/rest-client-utest ...................... FAILURE [ 25.816 s]
[INFO] juneau/microservice ................................ SKIPPED
[INFO] juneau/microservice/microservice-core .............. SKIPPED
[INFO] juneau/microservice/microservice-jetty ............. SKIPPED
[INFO] juneau/microservice/my-jetty-microservice .......... SKIPPED
[INFO] juneau/examples .................................... SKIPPED
[INFO] juneau/examples/rest ............................... SKIPPED
[INFO] juneau/microservice/microservice-ftest ............. SKIPPED
[INFO] juneau/microservice/my-springboot-microservice ..... SKIPPED
[INFO] juneau/sc .......................................... SKIPPED
[INFO] juneau/sc/sc-server ................................ SKIPPED
[INFO] juneau/sc/sc-client ................................ SKIPPED
[INFO] juneau/examples/examples-core ...................... SKIPPED
[INFO] juneau/examples/examples-rest-jetty ................ SKIPPED
[INFO] juneau/examples/examples-rest-springboot ........... SKIPPED
[INFO] juneau/examples/examples-rest-jetty-ftest .......... SKIPPED
[INFO] juneau/doc ......................................... SKIPPED
[INFO] juneau/releng ...................................... SKIPPED
[INFO] juneau/releng/all .................................. SKIPPED
[INFO] juneau/releng/distrib .............................. SKIPPED
[INFO] ------------------------------------------------------------------------
[INFO] BUILD FAILURE
[INFO] ------------------------------------------------------------------------
[INFO] Total time: 06:15 min
[INFO] Finished at: 2020-07-12T16:45:28+00:00
[INFO] Final Memory: 125M/3794M
[INFO] ------------------------------------------------------------------------
[ERROR] Failed to execute goal org.apache.maven.plugins:maven-surefire-plugin:2.22.0:test
(default-test) on project juneau-rest-client-utest: There are test failures.
[ERROR] 
[ERROR] Please refer to <https://builds.apache.org/job/Juneau-Java-1.8/ws/juneau-rest/juneau-rest-client-utest/target/surefire-reports>
for the individual test results.
[ERROR] Please refer to dump files (if any exist) [date]-jvmRun[N].dump, [date].dumpstream
and [date]-jvmRun[N].dumpstream.
[ERROR] -> [Help 1]
[ERROR] 
[ERROR] To see the full stack trace of the errors, re-run Maven with the -e switch.
[ERROR] Re-run Maven using the -X switch to enable full debug logging.
[ERROR] 
[ERROR] For more information about the errors and possible solutions, please read the following
articles:
[ERROR] [Help 1] http://cwiki.apache.org/confluence/display/MAVEN/MojoFailureException
[ERROR] 
[ERROR] After correcting the problems, you can resume the build with the command
[ERROR]   mvn <goals> -rf :juneau-rest-client-utest
Build step 'Invoke top-level Maven targets' marked build as failure
Recording test results
[TASKS] Skipping publisher since build result is FAILURE

Mime
View raw message