juneau-dev mailing list archives

Site index · List index
Message view « Date » · « Thread »
Top « Date » · « Thread »
From Apache Jenkins Server <jenk...@builds.apache.org>
Subject Build failed in Jenkins: Juneau-Java-1.8 #1802
Date Mon, 13 Jul 2020 14:25:39 GMT
See <https://builds.apache.org/job/Juneau-Java-1.8/1802/display/redirect?page=changes>

Changes:

[JamesBognar] org.apache.juneau.http tests.


------------------------------------------
[...truncated 501.98 KB...]
2/9 KB   4/9 KB   6/9 KB   8/9 KB   9/9 KB            Uploaded: https://repository.apache.org/content/repositories/snapshots/org/apache/juneau/juneau-rest-server-utest/8.1.4-SNAPSHOT/juneau-rest-server-utest-8.1.4-20200713.142455-628-sources.jar
(9 KB at 16.5 KB/sec)
Uploading: https://repository.apache.org/content/repositories/snapshots/org/apache/juneau/juneau-rest-server-utest/8.1.4-SNAPSHOT/maven-metadata.xml
2/2 KB            Uploaded: https://repository.apache.org/content/repositories/snapshots/org/apache/juneau/juneau-rest-server-utest/8.1.4-SNAPSHOT/maven-metadata.xml
(2 KB at 2.4 KB/sec)
[INFO] 
[INFO] --- maven-bundle-plugin:3.2.0:deploy (default-deploy) @ juneau-rest-server-utest ---
[INFO] Remote OBR update disabled (enable with -DremoteOBR)
[INFO]                                                                         
[INFO] ------------------------------------------------------------------------
[INFO] Building juneau/rest/rest-client-utest 8.1.4-SNAPSHOT
[INFO] ------------------------------------------------------------------------
[INFO] 
[INFO] --- maven-clean-plugin:3.1.0:clean (default-clean) @ juneau-rest-client-utest ---
[INFO] Deleting <https://builds.apache.org/job/Juneau-Java-1.8/ws/juneau-rest/juneau-rest-client-utest/target>
[INFO] 
[INFO] --- maven-enforcer-plugin:1.4.1:enforce (enforce-maven-version) @ juneau-rest-client-utest
---
[INFO] 
[INFO] --- maven-enforcer-plugin:1.4.1:enforce (enforce-maven) @ juneau-rest-client-utest
---
[INFO] 
[INFO] --- jacoco-maven-plugin:0.8.2:prepare-agent (default-prepare-agent) @ juneau-rest-client-utest
---
[INFO] argLine set to -javaagent:/home/jenkins/.m2/repository/org/jacoco/org.jacoco.agent/0.8.2/org.jacoco.agent-0.8.2-runtime.jar=destfile=<https://builds.apache.org/job/Juneau-Java-1.8/ws/juneau-rest/juneau-rest-client-utest/target/jacoco.exec>
[INFO] 
[INFO] --- maven-remote-resources-plugin:1.5:process (process-resource-bundles) @ juneau-rest-client-utest
---
[INFO] 
[INFO] --- maven-resources-plugin:3.1.0:resources (default-resources) @ juneau-rest-client-utest
---
[INFO] Using 'UTF-8' encoding to copy filtered resources.
[INFO] skip non existing resourceDirectory <https://builds.apache.org/job/Juneau-Java-1.8/ws/juneau-rest/juneau-rest-client-utest/src/main/resources>
[INFO] Copying 3 resources
[INFO] 
[INFO] --- maven-compiler-plugin:3.7.0:compile (default-compile) @ juneau-rest-client-utest
---
[INFO] Nothing to compile - all classes are up to date
[INFO] 
[INFO] --- maven-resources-plugin:3.1.0:testResources (default-testResources) @ juneau-rest-client-utest
---
[INFO] Using 'UTF-8' encoding to copy filtered resources.
[INFO] skip non existing resourceDirectory <https://builds.apache.org/job/Juneau-Java-1.8/ws/juneau-rest/juneau-rest-client-utest/src/test/resources>
[INFO] Copying 3 resources
[INFO] 
[INFO] --- maven-compiler-plugin:3.7.0:testCompile (default-testCompile) @ juneau-rest-client-utest
---
[INFO] Changes detected - recompiling the module!
[INFO] Compiling 46 source files to <https://builds.apache.org/job/Juneau-Java-1.8/ws/juneau-rest/juneau-rest-client-utest/target/test-classes>
[INFO] 
[INFO] --- maven-surefire-plugin:2.22.0:test (default-test) @ juneau-rest-client-utest ---
[INFO] 
[INFO] -------------------------------------------------------
[INFO]  T E S T S
[INFO] -------------------------------------------------------
[INFO] Running org.apache.juneau.http.BasicNameValuePair_Test
[INFO] Tests run: 5, Failures: 0, Errors: 0, Skipped: 0, Time elapsed: 0.909 s - in org.apache.juneau.http.BasicNameValuePair_Test
[INFO] Running org.apache.juneau.http.BasicHttpResource_Test
[INFO] Tests run: 1, Failures: 0, Errors: 0, Skipped: 0, Time elapsed: 0.039 s - in org.apache.juneau.http.BasicHttpResource_Test
[INFO] Running org.apache.juneau.http.HeaderSupplier_Test
[INFO] Tests run: 4, Failures: 0, Errors: 0, Skipped: 0, Time elapsed: 0.225 s - in org.apache.juneau.http.HeaderSupplier_Test
[INFO] Running org.apache.juneau.http.BasicHttpEntity_Test
[INFO] Tests run: 1, Failures: 0, Errors: 0, Skipped: 0, Time elapsed: 0.006 s - in org.apache.juneau.http.BasicHttpEntity_Test
[INFO] Running org.apache.juneau.http.BasicHeader_Test
[INFO] Tests run: 6, Failures: 0, Errors: 0, Skipped: 0, Time elapsed: 0.021 s - in org.apache.juneau.http.BasicHeader_Test
[INFO] Running org.apache.juneau.http.HttpHeader_Test
[INFO] Tests run: 1, Failures: 0, Errors: 0, Skipped: 0, Time elapsed: 0 s - in org.apache.juneau.http.HttpHeader_Test
[INFO] Running org.apache.juneau.http.NameValuePairSupplier_Test
[INFO] Tests run: 4, Failures: 0, Errors: 0, Skipped: 0, Time elapsed: 0.011 s - in org.apache.juneau.http.NameValuePairSupplier_Test
[INFO] Running org.apache.juneau.http.header.AcceptExtensionsTest
[INFO] Tests run: 2, Failures: 0, Errors: 0, Skipped: 0, Time elapsed: 0.03 s - in org.apache.juneau.http.header.AcceptExtensionsTest
[INFO] Running org.apache.juneau.http.header.MediaRangeTest
[INFO] Tests run: 17, Failures: 0, Errors: 0, Skipped: 0, Time elapsed: 0.04 s - in org.apache.juneau.http.header.MediaRangeTest
[INFO] Running org.apache.juneau.http.header.ContentTypeTest
[INFO] Tests run: 2, Failures: 0, Errors: 0, Skipped: 0, Time elapsed: 0.001 s - in org.apache.juneau.http.header.ContentTypeTest
[INFO] Running org.apache.juneau.http.header.ContentType2Test
[INFO] Tests run: 21, Failures: 0, Errors: 0, Skipped: 0, Time elapsed: 0.047 s - in org.apache.juneau.http.header.ContentType2Test
[INFO] Running org.apache.juneau.http.header.AcceptTest
[INFO] Tests run: 146, Failures: 0, Errors: 0, Skipped: 0, Time elapsed: 0.125 s - in org.apache.juneau.http.header.AcceptTest
[INFO] Running org.apache.juneau.rest.client2.RestClient_Config_Parser_Test
[INFO] Tests run: 3, Failures: 0, Errors: 0, Skipped: 0, Time elapsed: 1.913 s - in org.apache.juneau.rest.client2.RestClient_Config_Parser_Test
[INFO] Running org.apache.juneau.rest.client2.RestClient_Response_Test
[INFO] Tests run: 16, Failures: 0, Errors: 0, Skipped: 0, Time elapsed: 0.522 s - in org.apache.juneau.rest.client2.RestClient_Response_Test
[INFO] Running org.apache.juneau.rest.client2.Remote_CommonInterfaces_Test
[INFO] Tests run: 9, Failures: 0, Errors: 0, Skipped: 0, Time elapsed: 1.203 s - in org.apache.juneau.rest.client2.Remote_CommonInterfaces_Test
[INFO] Running org.apache.juneau.rest.client2.Remote_ResponseAnnotation_Test
[INFO] Tests run: 3, Failures: 0, Errors: 0, Skipped: 0, Time elapsed: 0.079 s - in org.apache.juneau.rest.client2.Remote_ResponseAnnotation_Test
[INFO] Running org.apache.juneau.rest.client2.RestClient_Query_Test
[INFO] Tests run: 12, Failures: 0, Errors: 0, Skipped: 0, Time elapsed: 0.305 s - in org.apache.juneau.rest.client2.RestClient_Query_Test
[INFO] Running org.apache.juneau.rest.client2.Remote_PathAnnotation_Test
[INFO] Tests run: 12, Failures: 0, Errors: 0, Skipped: 0, Time elapsed: 0.808 s - in org.apache.juneau.rest.client2.Remote_PathAnnotation_Test
[INFO] Running org.apache.juneau.rest.client2.Remote_QueryAnnotation_Test
[INFO] Tests run: 16, Failures: 0, Errors: 0, Skipped: 0, Time elapsed: 0.772 s - in org.apache.juneau.rest.client2.Remote_QueryAnnotation_Test
[INFO] Running org.apache.juneau.rest.client2.Remote_RequestAnnotation_Test
[INFO] Tests run: 5, Failures: 0, Errors: 0, Skipped: 0, Time elapsed: 0.156 s - in org.apache.juneau.rest.client2.Remote_RequestAnnotation_Test
[INFO] Running org.apache.juneau.rest.client2.RestClient_CallbackStrings_Test
[INFO] Tests run: 2, Failures: 0, Errors: 0, Skipped: 0, Time elapsed: 0.036 s - in org.apache.juneau.rest.client2.RestClient_CallbackStrings_Test
[INFO] Running org.apache.juneau.rest.client2.RestCallException_Test
[INFO] Tests run: 1, Failures: 0, Errors: 0, Skipped: 0, Time elapsed: 0.08 s - in org.apache.juneau.rest.client2.RestCallException_Test
[INFO] Running org.apache.juneau.rest.client2.Remote_RemoteMethodAnnotation_Test
[INFO] Tests run: 6, Failures: 0, Errors: 0, Skipped: 0, Time elapsed: 0.212 s - in org.apache.juneau.rest.client2.Remote_RemoteMethodAnnotation_Test
[INFO] Running org.apache.juneau.rest.client2.RestClient_Body_Test
Jul 13, 2020 2:25:15 PM org.apache.juneau.rest.BasicRestCallLogger log
WARNING: 
=== HTTP Call (incoming) ======================================================
[200] HTTP POST /
	Request length: 0 bytes
	Response code: 200
	Response length: 0 bytes
	Exec time: 5ms
---Request Headers---
	Accept: application/json+simple
	Accept-Encoding: gzip,deflate
	Connection: Keep-Alive
	Host: localhost
	Transfer-Encoding: chunked
	User-Agent: Apache-HttpClient/4.5.6 (Java/1.8.0_252)
	X-Debug: true
---Response Headers---
	X-Accept: application/json+simple
	X-Accept-Encoding: gzip,deflate
	X-Connection: Keep-Alive
	X-Host: localhost
	X-Transfer-Encoding: chunked
	X-User-Agent: Apache-HttpClient/4.5.6 (Java/1.8.0_252)
	X-X-Debug: true
=== END ======================================================================
[INFO] Tests run: 3, Failures: 0, Errors: 0, Skipped: 0, Time elapsed: 0.238 s - in org.apache.juneau.rest.client2.RestClient_Body_Test
[INFO] Running org.apache.juneau.rest.client2.RestClient_Logging_Test
Text differed at position 0.
	Expected=[WARNING: \n=== HTTP Call (outgoing) ======================================================\n===
REQUEST ===\nPOST http://localhost/bean\n---request headers---\n\tAccept: application/json+simple\n---request
entity---\n\tContent-Type: application/json+simple\n---request content---\n{f:1}\n=== RESPONSE
===\nHTTP/1.1 200 \n---response headers---\n\tContent-Type: application/json\n---response
content---\n{f:1}\n=== END =======================================================================\n]
	Actual=[Jul 13, 2020 2:25:15 PM org.apache.juneau.rest.client2.RestClient log\nWARNING: \n===
HTTP Call (outgoing) ======================================================\n=== REQUEST ===\nPOST
http://localhost/bean\n---request headers---\n\tAccept: application/json+simple\n---request
entity---\n\tContent-Type: application/json+simple\n---request content---\n{f:1}\n=== RESPONSE
===\nHTTP/1.1 200 \n---response headers---\n\tContent-Type: application/json\n---response
content---\n{f:1}\n=== END =======================================================================\n]
[ERROR] Tests run: 3, Failures: 1, Errors: 0, Skipped: 0, Time elapsed: 0.159 s <<<
FAILURE! - in org.apache.juneau.rest.client2.RestClient_Logging_Test
[ERROR] a02_logTo(org.apache.juneau.rest.client2.RestClient_Logging_Test)  Time elapsed: 0.035
s  <<< FAILURE!
org.apache.juneau.BasicAssertionError: 
Text differed at position 0.
	Expected=[WARNING: \n=== HTTP Call (outgoing) ======================================================\n===
REQUEST ===\nPOST http://localhost/bean\n---request headers---\n\tAccept: application/json+simple\n---request
entity---\n\tContent-Type: application/json+simple\n---request content---\n{f:1}\n=== RESPONSE
===\nHTTP/1.1 200 \n---response headers---\n\tContent-Type: application/json\n---response
content---\n{f:1}\n=== END =======================================================================\n]
	Actual=[Jul 13, 2020 2:25:15 PM org.apache.juneau.rest.client2.RestClient log\nWARNING: \n===
HTTP Call (outgoing) ======================================================\n=== REQUEST ===\nPOST
http://localhost/bean\n---request headers---\n\tAccept: application/json+simple\n---request
entity---\n\tContent-Type: application/json+simple\n---request content---\n{f:1}\n=== RESPONSE
===\nHTTP/1.1 200 \n---response headers---\n\tContent-Type: application/json\n---response
content---\n{f:1}\n=== END =======================================================================\n]
	at org.apache.juneau.rest.client2.RestClient_Logging_Test.a02_logTo(RestClient_Logging_Test.java:176)

[INFO] Running org.apache.juneau.rest.client2.RestClient_FormData_Test
[INFO] Tests run: 12, Failures: 0, Errors: 0, Skipped: 0, Time elapsed: 0.292 s - in org.apache.juneau.rest.client2.RestClient_FormData_Test
[INFO] Running org.apache.juneau.rest.client2.RestClient_Headers_Test
[INFO] Tests run: 18, Failures: 0, Errors: 0, Skipped: 0, Time elapsed: 0.626 s - in org.apache.juneau.rest.client2.RestClient_Headers_Test
[INFO] Running org.apache.juneau.rest.client2.RestClient_Marshalls_Test
[INFO] Tests run: 7, Failures: 0, Errors: 0, Skipped: 0, Time elapsed: 0.608 s - in org.apache.juneau.rest.client2.RestClient_Marshalls_Test
[INFO] Running org.apache.juneau.rest.client2.Remote_FormDataAnnotation_Test
[INFO] Tests run: 16, Failures: 0, Errors: 0, Skipped: 0, Time elapsed: 0.586 s - in org.apache.juneau.rest.client2.Remote_FormDataAnnotation_Test
[INFO] Running org.apache.juneau.rest.client2.ext.BasicHttpRequestRetryHandler_Test
[INFO] Tests run: 1, Failures: 0, Errors: 0, Skipped: 0, Time elapsed: 0.039 s - in org.apache.juneau.rest.client2.ext.BasicHttpRequestRetryHandler_Test
[INFO] Running org.apache.juneau.rest.client2.RestClient_Config_BeanContext_Test
[INFO] Tests run: 39, Failures: 0, Errors: 0, Skipped: 0, Time elapsed: 0.912 s - in org.apache.juneau.rest.client2.RestClient_Config_BeanContext_Test
[INFO] Running org.apache.juneau.rest.client2.Remote_Test
[INFO] Tests run: 26, Failures: 0, Errors: 0, Skipped: 0, Time elapsed: 0.442 s - in org.apache.juneau.rest.client2.Remote_Test
[INFO] Running org.apache.juneau.rest.client2.RestClient_Test
[INFO] Tests run: 39, Failures: 0, Errors: 0, Skipped: 0, Time elapsed: 2.002 s - in org.apache.juneau.rest.client2.RestClient_Test
[INFO] Running org.apache.juneau.rest.client2.RestClient_Config_OpenApi_Test
[INFO] Tests run: 3, Failures: 0, Errors: 0, Skipped: 0, Time elapsed: 0.055 s - in org.apache.juneau.rest.client2.RestClient_Config_OpenApi_Test
[INFO] Running org.apache.juneau.rest.client2.RestClient_Response_Body_Test
[INFO] Tests run: 9, Failures: 0, Errors: 0, Skipped: 0, Time elapsed: 0.253 s - in org.apache.juneau.rest.client2.RestClient_Response_Body_Test
[INFO] Running org.apache.juneau.rest.client2.RestClient_BasicCalls_Test
[INFO] Tests run: 30, Failures: 0, Errors: 0, Skipped: 0, Time elapsed: 0.342 s - in org.apache.juneau.rest.client2.RestClient_BasicCalls_Test
[INFO] Running org.apache.juneau.rest.client2.RestClient_Config_Serializer_Test
[INFO] Tests run: 17, Failures: 0, Errors: 0, Skipped: 0, Time elapsed: 0.132 s - in org.apache.juneau.rest.client2.RestClient_Config_Serializer_Test
[INFO] Running org.apache.juneau.rest.client2.RestClient_Config_Context_Test
[INFO] Tests run: 11, Failures: 0, Errors: 0, Skipped: 0, Time elapsed: 0.112 s - in org.apache.juneau.rest.client2.RestClient_Config_Context_Test
[INFO] Running org.apache.juneau.rest.client2.RestClient_Config_RestClient_Test
[INFO] Tests run: 16, Failures: 0, Errors: 0, Skipped: 0, Time elapsed: 0.435 s - in org.apache.juneau.rest.client2.RestClient_Config_RestClient_Test
[INFO] Running org.apache.juneau.rest.client2.RestClient_Paths_Test
[INFO] Tests run: 5, Failures: 0, Errors: 0, Skipped: 0, Time elapsed: 0.096 s - in org.apache.juneau.rest.client2.RestClient_Paths_Test
[INFO] Running org.apache.juneau.rest.client2.RrpcInterfaceTest
SLF4J: Failed to load class "org.slf4j.impl.StaticLoggerBinder".
SLF4J: Defaulting to no-operation (NOP) logger implementation
SLF4J: See http://www.slf4j.org/codes.html#StaticLoggerBinder for further details.
[INFO] Tests run: 872, Failures: 0, Errors: 0, Skipped: 0, Time elapsed: 4.338 s - in org.apache.juneau.rest.client2.RrpcInterfaceTest
[INFO] Running org.apache.juneau.rest.client2.RestClient_Response_Headers_Test
[INFO] Tests run: 7, Failures: 0, Errors: 0, Skipped: 0, Time elapsed: 0.185 s - in org.apache.juneau.rest.client2.RestClient_Response_Headers_Test
[INFO] Running org.apache.juneau.rest.client2.Remote_BodyAnnotation_Test
[INFO] Tests run: 3, Failures: 0, Errors: 0, Skipped: 0, Time elapsed: 0.177 s - in org.apache.juneau.rest.client2.Remote_BodyAnnotation_Test
[INFO] Running org.apache.juneau.rest.client2.Remote_HeaderAnnotation_Test
[INFO] Tests run: 14, Failures: 0, Errors: 0, Skipped: 0, Time elapsed: 0.488 s - in org.apache.juneau.rest.client2.Remote_HeaderAnnotation_Test
[INFO] 
[INFO] Results:
[INFO] 
[ERROR] Failures: 
[ERROR]   RestClient_Logging_Test.a02_logTo:176 Text differed at position 0.
	Expected=[WARNING: \n=== HTTP Call (outgoing) ======================================================\n===
REQUEST ===\nPOST http://localhost/bean\n---request headers---\n\tAccept: application/json+simple\n---request
entity---\n\tContent-Type: application/json+simple\n---request content---\n{f:1}\n=== RESPONSE
===\nHTTP/1.1 200 \n---response headers---\n\tContent-Type: application/json\n---response
content---\n{f:1}\n=== END =======================================================================\n]
	Actual=[Jul 13, 2020 2:25:15 PM org.apache.juneau.rest.client2.RestClient log\nWARNING: \n===
HTTP Call (outgoing) ======================================================\n=== REQUEST ===\nPOST
http://localhost/bean\n---request headers---\n\tAccept: application/json+simple\n---request
entity---\n\tContent-Type: application/json+simple\n---request content---\n{f:1}\n=== RESPONSE
===\nHTTP/1.1 200 \n---response headers---\n\tContent-Type: application/json\n---response
content---\n{f:1}\n=== END =======================================================================\n]
[INFO] 
[ERROR] Tests run: 1446, Failures: 1, Errors: 0, Skipped: 0
[INFO] 
[INFO]                                                                         
[INFO] ------------------------------------------------------------------------
[INFO] Skipping juneau
[INFO] This project has been banned from the build due to previous failures.
[INFO] ------------------------------------------------------------------------
[INFO] ------------------------------------------------------------------------
[INFO] Reactor Summary:
[INFO] 
[INFO] juneau ............................................. SUCCESS [  7.989 s]
[INFO] juneau/core ........................................ SUCCESS [  2.645 s]
[INFO] juneau/core/marshall ............................... SUCCESS [01:20 min]
[INFO] juneau/core/marshall-rdf ........................... SUCCESS [ 10.567 s]
[INFO] juneau/core/dto .................................... SUCCESS [ 17.412 s]
[INFO] juneau/core/config ................................. SUCCESS [  8.829 s]
[INFO] juneau/core/core-utest ............................. SUCCESS [01:14 min]
[INFO] juneau/rest ........................................ SUCCESS [  2.484 s]
[INFO] juneau/rest/rest-server ............................ SUCCESS [ 21.698 s]
[INFO] juneau/rest/rest-server-jaxrs ...................... SUCCESS [  7.235 s]
[INFO] juneau/rest/rest-server-rdf ........................ SUCCESS [ 11.251 s]
[INFO] juneau/rest/rest-server-springboot ................. SUCCESS [ 18.613 s]
[INFO] juneau/rest/rest-client ............................ SUCCESS [ 13.552 s]
[INFO] juneau/rest/rest-mock .............................. SUCCESS [ 15.802 s]
[INFO] juneau/rest/rest-mock-utest ........................ SUCCESS [ 11.689 s]
[INFO] juneau/rest/rest-server-utest ...................... SUCCESS [ 40.788 s]
[INFO] juneau/rest/rest-client-utest ...................... FAILURE [ 25.537 s]
[INFO] juneau/microservice ................................ SKIPPED
[INFO] juneau/microservice/microservice-core .............. SKIPPED
[INFO] juneau/microservice/microservice-jetty ............. SKIPPED
[INFO] juneau/microservice/my-jetty-microservice .......... SKIPPED
[INFO] juneau/examples .................................... SKIPPED
[INFO] juneau/examples/rest ............................... SKIPPED
[INFO] juneau/microservice/microservice-ftest ............. SKIPPED
[INFO] juneau/microservice/my-springboot-microservice ..... SKIPPED
[INFO] juneau/sc .......................................... SKIPPED
[INFO] juneau/sc/sc-server ................................ SKIPPED
[INFO] juneau/sc/sc-client ................................ SKIPPED
[INFO] juneau/examples/examples-core ...................... SKIPPED
[INFO] juneau/examples/examples-rest-jetty ................ SKIPPED
[INFO] juneau/examples/examples-rest-springboot ........... SKIPPED
[INFO] juneau/examples/examples-rest-jetty-ftest .......... SKIPPED
[INFO] juneau/doc ......................................... SKIPPED
[INFO] juneau/releng ...................................... SKIPPED
[INFO] juneau/releng/all .................................. SKIPPED
[INFO] juneau/releng/distrib .............................. SKIPPED
[INFO] ------------------------------------------------------------------------
[INFO] BUILD FAILURE
[INFO] ------------------------------------------------------------------------
[INFO] Total time: 06:12 min
[INFO] Finished at: 2020-07-13T14:25:28+00:00
[INFO] Final Memory: 124M/4039M
[INFO] ------------------------------------------------------------------------
[ERROR] Failed to execute goal org.apache.maven.plugins:maven-surefire-plugin:2.22.0:test
(default-test) on project juneau-rest-client-utest: There are test failures.
[ERROR] 
[ERROR] Please refer to <https://builds.apache.org/job/Juneau-Java-1.8/ws/juneau-rest/juneau-rest-client-utest/target/surefire-reports>
for the individual test results.
[ERROR] Please refer to dump files (if any exist) [date]-jvmRun[N].dump, [date].dumpstream
and [date]-jvmRun[N].dumpstream.
[ERROR] -> [Help 1]
[ERROR] 
[ERROR] To see the full stack trace of the errors, re-run Maven with the -e switch.
[ERROR] Re-run Maven using the -X switch to enable full debug logging.
[ERROR] 
[ERROR] For more information about the errors and possible solutions, please read the following
articles:
[ERROR] [Help 1] http://cwiki.apache.org/confluence/display/MAVEN/MojoFailureException
[ERROR] 
[ERROR] After correcting the problems, you can resume the build with the command
[ERROR]   mvn <goals> -rf :juneau-rest-client-utest
Build step 'Invoke top-level Maven targets' marked build as failure
Recording test results
[TASKS] Skipping publisher since build result is FAILURE

Mime
View raw message