juneau-dev mailing list archives

Site index · List index
Message view « Date » · « Thread »
Top « Date » · « Thread »
From Apache Jenkins Server <jenk...@builds.apache.org>
Subject Build failed in Jenkins: Juneau-Java-1.8 #1795
Date Sat, 11 Jul 2020 14:48:29 GMT
See <https://builds.apache.org/job/Juneau-Java-1.8/1795/display/redirect?page=changes>

Changes:

[JamesBognar] org.apache.juneau.http tests.


------------------------------------------
[...truncated 487.79 KB...]
[INFO] Writing OBR metadata
[INFO] 
[INFO] --- maven-deploy-plugin:2.8.2:deploy (default-deploy) @ juneau-rest-server-utest ---
Downloading: https://repository.apache.org/content/repositories/snapshots/org/apache/juneau/juneau-rest-server-utest/8.1.4-SNAPSHOT/maven-metadata.xml
2/2 KB            Downloaded: https://repository.apache.org/content/repositories/snapshots/org/apache/juneau/juneau-rest-server-utest/8.1.4-SNAPSHOT/maven-metadata.xml
(2 KB at 1.9 KB/sec)
Uploading: https://repository.apache.org/content/repositories/snapshots/org/apache/juneau/juneau-rest-server-utest/8.1.4-SNAPSHOT/juneau-rest-server-utest-8.1.4-20200711.144759-614.jar
2/9 KB   4/9 KB   6/9 KB   8/9 KB   9/9 KB            Uploaded: https://repository.apache.org/content/repositories/snapshots/org/apache/juneau/juneau-rest-server-utest/8.1.4-SNAPSHOT/juneau-rest-server-utest-8.1.4-20200711.144759-614.jar
(9 KB at 17.1 KB/sec)
Uploading: https://repository.apache.org/content/repositories/snapshots/org/apache/juneau/juneau-rest-server-utest/8.1.4-SNAPSHOT/juneau-rest-server-utest-8.1.4-20200711.144759-614.pom
2/6 KB   4/6 KB   6/6 KB            Uploaded: https://repository.apache.org/content/repositories/snapshots/org/apache/juneau/juneau-rest-server-utest/8.1.4-SNAPSHOT/juneau-rest-server-utest-8.1.4-20200711.144759-614.pom
(6 KB at 10.1 KB/sec)
Downloading: https://repository.apache.org/content/repositories/snapshots/org/apache/juneau/juneau-rest-server-utest/maven-metadata.xml
401/401 B               Downloaded: https://repository.apache.org/content/repositories/snapshots/org/apache/juneau/juneau-rest-server-utest/maven-metadata.xml
(401 B at 1.2 KB/sec)
Uploading: https://repository.apache.org/content/repositories/snapshots/org/apache/juneau/juneau-rest-server-utest/8.1.4-SNAPSHOT/maven-metadata.xml
2/2 KB               Uploaded: https://repository.apache.org/content/repositories/snapshots/org/apache/juneau/juneau-rest-server-utest/8.1.4-SNAPSHOT/maven-metadata.xml
(2 KB at 2.4 KB/sec)
Uploading: https://repository.apache.org/content/repositories/snapshots/org/apache/juneau/juneau-rest-server-utest/maven-metadata.xml
401/401 B               Uploaded: https://repository.apache.org/content/repositories/snapshots/org/apache/juneau/juneau-rest-server-utest/maven-metadata.xml
(401 B at 0.8 KB/sec)
Uploading: https://repository.apache.org/content/repositories/snapshots/org/apache/juneau/juneau-rest-server-utest/8.1.4-SNAPSHOT/juneau-rest-server-utest-8.1.4-20200711.144759-614-tests.jar
2/704 KB    4/704 KB   6/704 KB   8/704 KB   10/704 KB   12/704 KB   14/704 KB   16/704 KB
  18/704 KB   20/704 KB   22/704 KB   24/704 KB   26/704 KB   28/704 KB   30/704 KB   32/704
KB   34/704 KB   36/704 KB   38/704 KB   40/704 KB   42/704 KB   44/704 KB   46/704 KB   48/704
KB   50/704 KB   52/704 KB   54/704 KB   56/704 KB   58/704 KB   60/704 KB   62/704 KB   64/704
KB   66/704 KB   68/704 KB   70/704 KB   72/704 KB   74/704 KB   76/704 KB   78/704 KB   80/704
KB   82/704 KB   84/704 KB   86/704 KB   88/704 KB   90/704 KB   92/704 KB   94/704 KB   96/704
KB   98/704 KB   100/704 KB   102/704 KB   104/704 KB   106/704 KB   108/704 KB   110/704
KB   112/704 KB   114/704 KB   116/704 KB   118/704 KB   120/704 KB   122/704 KB   124/704
KB   126/704 KB   128/704 KB   130/704 KB   132/704 KB   134/704 KB   136/704 KB   138/704
KB   140/704 KB   142/704 KB   144/704 KB   146/704 KB   148/704 KB   150/704 KB   152/704
KB   154/704 KB   156/704 KB   158/704 KB   160/704 KB   162/704 KB   164/704 KB   166/704
KB   168/704 KB   170/704 KB   172/704 KB   174/704 KB   176/704 KB   178/704 KB   180/704
KB   182/704 KB   184/704 KB   186/704 KB   188/704 KB   190/704 KB   192/704 KB   194/704
KB   196/704 KB   198/704 KB   200/704 KB   202/704 KB   204/704 KB   206/704 KB   208/704
KB   210/704 KB   212/704 KB   214/704 KB   216/704 KB   218/704 KB   220/704 KB   222/704
KB   224/704 KB   226/704 KB   228/704 KB   230/704 KB   232/704 KB   234/704 KB   236/704
KB   238/704 KB   240/704 KB   242/704 KB   244/704 KB   246/704 KB   248/704 KB   250/704
KB   252/704 KB   254/704 KB   256/704 KB   258/704 KB   260/704 KB   262/704 KB   264/704
KB   266/704 KB   268/704 KB   270/704 KB   272/704 KB   274/704 KB   276/704 KB   278/704
KB   280/704 KB   282/704 KB   284/704 KB   286/704 KB   288/704 KB   290/704 KB   292/704
KB   294/704 KB   296/704 KB   298/704 KB   300/704 KB   302/704 KB   304/704 KB   306/704
KB   308/704 KB   310/704 KB   312/704 KB   314/704 KB   316/704 KB   318/704 KB   320/704
KB   322/704 KB   324/704 KB   326/704 KB   328/704 KB   330/704 KB   332/704 KB   334/704
KB   336/704 KB   338/704 KB   340/704 KB   342/704 KB   344/704 KB   346/704 KB   348/704
KB   350/704 KB   352/704 KB   354/704 KB   356/704 KB   358/704 KB   360/704 KB   362/704
KB   364/704 KB   366/704 KB   368/704 KB   370/704 KB   372/704 KB   374/704 KB   376/704
KB   378/704 KB   380/704 KB   382/704 KB   384/704 KB   386/704 KB   388/704 KB   390/704
KB   392/704 KB   394/704 KB   396/704 KB   398/704 KB   400/704 KB   402/704 KB   404/704
KB   406/704 KB   408/704 KB   410/704 KB   412/704 KB   414/704 KB   416/704 KB   418/704
KB   420/704 KB   422/704 KB   424/704 KB   426/704 KB   428/704 KB   430/704 KB   432/704
KB   434/704 KB   436/704 KB   438/704 KB   440/704 KB   442/704 KB   444/704 KB   446/704
KB   448/704 KB   450/704 KB   452/704 KB   454/704 KB   456/704 KB   458/704 KB   460/704
KB   462/704 KB   464/704 KB   466/704 KB   468/704 KB   470/704 KB   472/704 KB   474/704
KB   476/704 KB   478/704 KB   480/704 KB   482/704 KB   484/704 KB   486/704 KB   488/704
KB   490/704 KB   492/704 KB   494/704 KB   496/704 KB   498/704 KB   500/704 KB   502/704
KB   504/704 KB   506/704 KB   508/704 KB   510/704 KB   512/704 KB   514/704 KB   516/704
KB   518/704 KB   520/704 KB   522/704 KB   524/704 KB   526/704 KB   528/704 KB   530/704
KB   532/704 KB   534/704 KB   536/704 KB   538/704 KB   540/704 KB   542/704 KB   544/704
KB   546/704 KB   548/704 KB   550/704 KB   552/704 KB   554/704 KB   556/704 KB   558/704
KB   560/704 KB   562/704 KB   564/704 KB   566/704 KB   568/704 KB   570/704 KB   572/704
KB   574/704 KB   576/704 KB   578/704 KB   580/704 KB   582/704 KB   584/704 KB   586/704
KB   588/704 KB   590/704 KB   592/704 KB   594/704 KB   596/704 KB   598/704 KB   600/704
KB   602/704 KB   604/704 KB   606/704 KB   608/704 KB   610/704 KB   612/704 KB   614/704
KB   616/704 KB   618/704 KB   620/704 KB   622/704 KB   624/704 KB   626/704 KB   628/704
KB   630/704 KB   632/704 KB   634/704 KB   636/704 KB   638/704 KB   640/704 KB   642/704
KB   644/704 KB   646/704 KB   648/704 KB   650/704 KB   652/704 KB   654/704 KB   656/704
KB   658/704 KB   660/704 KB   662/704 KB   664/704 KB   666/704 KB   668/704 KB   670/704
KB   672/704 KB   674/704 KB   676/704 KB   678/704 KB   680/704 KB   682/704 KB   684/704
KB   686/704 KB   688/704 KB   690/704 KB   692/704 KB   694/704 KB   696/704 KB   698/704
KB   700/704 KB   702/704 KB   704/704 KB                Uploaded: https://repository.apache.org/content/repositories/snapshots/org/apache/juneau/juneau-rest-server-utest/8.1.4-SNAPSHOT/juneau-rest-server-utest-8.1.4-20200711.144759-614-tests.jar
(704 KB at 553.7 KB/sec)
Uploading: https://repository.apache.org/content/repositories/snapshots/org/apache/juneau/juneau-rest-server-utest/8.1.4-SNAPSHOT/maven-metadata.xml
2/2 KB                Uploaded: https://repository.apache.org/content/repositories/snapshots/org/apache/juneau/juneau-rest-server-utest/8.1.4-SNAPSHOT/maven-metadata.xml
(2 KB at 2.5 KB/sec)
Uploading: https://repository.apache.org/content/repositories/snapshots/org/apache/juneau/juneau-rest-server-utest/8.1.4-SNAPSHOT/juneau-rest-server-utest-8.1.4-20200711.144759-614-sources.jar
2/9 KB   4/9 KB   6/9 KB   8/9 KB   9/9 KB            Uploaded: https://repository.apache.org/content/repositories/snapshots/org/apache/juneau/juneau-rest-server-utest/8.1.4-SNAPSHOT/juneau-rest-server-utest-8.1.4-20200711.144759-614-sources.jar
(9 KB at 16.5 KB/sec)
Uploading: https://repository.apache.org/content/repositories/snapshots/org/apache/juneau/juneau-rest-server-utest/8.1.4-SNAPSHOT/maven-metadata.xml
2/2 KB            Uploaded: https://repository.apache.org/content/repositories/snapshots/org/apache/juneau/juneau-rest-server-utest/8.1.4-SNAPSHOT/maven-metadata.xml
(2 KB at 2.5 KB/sec)
Uploading: https://repository.apache.org/content/repositories/snapshots/org/apache/juneau/juneau-rest-server-utest/8.1.4-SNAPSHOT/juneau-rest-server-utest-8.1.4-20200711.144759-614-tests.jar
2/704 KB   4/704 KB   6/704 KB   8/704 KB   10/704 KB   12/704 KB   14/704 KB   16/704 KB
  18/704 KB   20/704 KB   22/704 KB   24/704 KB   26/704 KB   28/704 KB   30/704 KB   32/704
KB   34/704 KB   36/704 KB   38/704 KB   40/704 KB   42/704 KB   44/704 KB   46/704 KB   48/704
KB   50/704 KB   52/704 KB   54/704 KB   56/704 KB   58/704 KB   60/704 KB   62/704 KB   64/704
KB   66/704 KB   68/704 KB   70/704 KB   72/704 KB   74/704 KB   76/704 KB   78/704 KB   80/704
KB   82/704 KB   84/704 KB   86/704 KB   88/704 KB   90/704 KB   92/704 KB   94/704 KB   96/704
KB   98/704 KB   100/704 KB   102/704 KB   104/704 KB   106/704 KB   108/704 KB   110/704
KB   112/704 KB   114/704 KB   116/704 KB   118/704 KB   120/704 KB   122/704 KB   124/704
KB   126/704 KB   128/704 KB   130/704 KB   132/704 KB   134/704 KB   136/704 KB   138/704
KB   140/704 KB   142/704 KB   144/704 KB   146/704 KB   148/704 KB   150/704 KB   152/704
KB   154/704 KB   156/704 KB   158/704 KB   160/704 KB   162/704 KB   164/704 KB   166/704
KB   168/704 KB   170/704 KB   172/704 KB   174/704 KB   176/704 KB   178/704 KB   180/704
KB   182/704 KB   184/704 KB   186/704 KB   188/704 KB   190/704 KB   192/704 KB   194/704
KB   196/704 KB   198/704 KB   200/704 KB   202/704 KB   204/704 KB   206/704 KB   208/704
KB   210/704 KB   212/704 KB   214/704 KB   216/704 KB   218/704 KB   220/704 KB   222/704
KB   224/704 KB   226/704 KB   228/704 KB   230/704 KB   232/704 KB   234/704 KB   236/704
KB   238/704 KB   240/704 KB   242/704 KB   244/704 KB   246/704 KB   248/704 KB   250/704
KB   252/704 KB   254/704 KB   256/704 KB   258/704 KB   260/704 KB   262/704 KB   264/704
KB   266/704 KB   268/704 KB   270/704 KB   272/704 KB   274/704 KB   276/704 KB   278/704
KB   280/704 KB   282/704 KB   284/704 KB   286/704 KB   288/704 KB   290/704 KB   292/704
KB   294/704 KB   296/704 KB   298/704 KB   300/704 KB   302/704 KB   304/704 KB   306/704
KB   308/704 KB   310/704 KB   312/704 KB   314/704 KB   316/704 KB   318/704 KB   320/704
KB   322/704 KB   324/704 KB   326/704 KB   328/704 KB   330/704 KB   332/704 KB   334/704
KB   336/704 KB   338/704 KB   340/704 KB   342/704 KB   344/704 KB   346/704 KB   348/704
KB   350/704 KB   352/704 KB   354/704 KB   356/704 KB   358/704 KB   360/704 KB   362/704
KB   364/704 KB   366/704 KB   368/704 KB   370/704 KB   372/704 KB   374/704 KB   376/704
KB   378/704 KB   380/704 KB   382/704 KB   384/704 KB   386/704 KB   388/704 KB   390/704
KB   392/704 KB   394/704 KB   396/704 KB   398/704 KB   400/704 KB   402/704 KB   404/704
KB   406/704 KB   408/704 KB   410/704 KB   412/704 KB   414/704 KB   416/704 KB   418/704
KB   420/704 KB   422/704 KB   424/704 KB   426/704 KB   428/704 KB   430/704 KB   432/704
KB   434/704 KB   436/704 KB   438/704 KB   440/704 KB   442/704 KB   444/704 KB   446/704
KB   448/704 KB   450/704 KB   452/704 KB   454/704 KB   456/704 KB   458/704 KB   460/704
KB   462/704 KB   464/704 KB   466/704 KB   468/704 KB   470/704 KB   472/704 KB   474/704
KB   476/704 KB   478/704 KB   480/704 KB   482/704 KB   484/704 KB   486/704 KB   488/704
KB   490/704 KB   492/704 KB   494/704 KB   496/704 KB   498/704 KB   500/704 KB   502/704
KB   504/704 KB   506/704 KB   508/704 KB   510/704 KB   512/704 KB   514/704 KB   516/704
KB   518/704 KB   520/704 KB   522/704 KB   524/704 KB   526/704 KB   528/704 KB   530/704
KB   532/704 KB   534/704 KB   536/704 KB   538/704 KB   540/704 KB   542/704 KB   544/704
KB   546/704 KB   548/704 KB   550/704 KB   552/704 KB   554/704 KB   556/704 KB   558/704
KB   560/704 KB   562/704 KB   564/704 KB   566/704 KB   568/704 KB   570/704 KB   572/704
KB   574/704 KB   576/704 KB   578/704 KB   580/704 KB   582/704 KB   584/704 KB   586/704
KB   588/704 KB   590/704 KB   592/704 KB   594/704 KB   596/704 KB   598/704 KB   600/704
KB   602/704 KB   604/704 KB   606/704 KB   608/704 KB   610/704 KB   612/704 KB   614/704
KB   616/704 KB   618/704 KB   620/704 KB   622/704 KB   624/704 KB   626/704 KB   628/704
KB   630/704 KB   632/704 KB   634/704 KB   636/704 KB   638/704 KB   640/704 KB   642/704
KB   644/704 KB   646/704 KB   648/704 KB   650/704 KB   652/704 KB   654/704 KB   656/704
KB   658/704 KB   660/704 KB   662/704 KB   664/704 KB   666/704 KB   668/704 KB   670/704
KB   672/704 KB   674/704 KB   676/704 KB   678/704 KB   680/704 KB   682/704 KB   684/704
KB   686/704 KB   688/704 KB   690/704 KB   692/704 KB   694/704 KB   696/704 KB   698/704
KB   700/704 KB   702/704 KB   704/704 KB                Uploaded: https://repository.apache.org/content/repositories/snapshots/org/apache/juneau/juneau-rest-server-utest/8.1.4-SNAPSHOT/juneau-rest-server-utest-8.1.4-20200711.144759-614-tests.jar
(704 KB at 1066.3 KB/sec)
Uploading: https://repository.apache.org/content/repositories/snapshots/org/apache/juneau/juneau-rest-server-utest/8.1.4-SNAPSHOT/maven-metadata.xml
2/2 KB                Uploaded: https://repository.apache.org/content/repositories/snapshots/org/apache/juneau/juneau-rest-server-utest/8.1.4-SNAPSHOT/maven-metadata.xml
(2 KB at 2.5 KB/sec)
Uploading: https://repository.apache.org/content/repositories/snapshots/org/apache/juneau/juneau-rest-server-utest/8.1.4-SNAPSHOT/juneau-rest-server-utest-8.1.4-20200711.144759-614-sources.jar
2/9 KB   4/9 KB   6/9 KB   8/9 KB   9/9 KB            Uploaded: https://repository.apache.org/content/repositories/snapshots/org/apache/juneau/juneau-rest-server-utest/8.1.4-SNAPSHOT/juneau-rest-server-utest-8.1.4-20200711.144759-614-sources.jar
(9 KB at 15.6 KB/sec)
Uploading: https://repository.apache.org/content/repositories/snapshots/org/apache/juneau/juneau-rest-server-utest/8.1.4-SNAPSHOT/maven-metadata.xml
2/2 KB            Uploaded: https://repository.apache.org/content/repositories/snapshots/org/apache/juneau/juneau-rest-server-utest/8.1.4-SNAPSHOT/maven-metadata.xml
(2 KB at 2.4 KB/sec)
[INFO] 
[INFO] --- maven-bundle-plugin:3.2.0:deploy (default-deploy) @ juneau-rest-server-utest ---
[INFO] Remote OBR update disabled (enable with -DremoteOBR)
[INFO]                                                                         
[INFO] ------------------------------------------------------------------------
[INFO] Building juneau/rest/rest-client-utest 8.1.4-SNAPSHOT
[INFO] ------------------------------------------------------------------------
[INFO] 
[INFO] --- maven-clean-plugin:3.1.0:clean (default-clean) @ juneau-rest-client-utest ---
[INFO] Deleting <https://builds.apache.org/job/Juneau-Java-1.8/ws/juneau-rest/juneau-rest-client-utest/target>
[INFO] 
[INFO] --- maven-enforcer-plugin:1.4.1:enforce (enforce-maven-version) @ juneau-rest-client-utest
---
[INFO] 
[INFO] --- maven-enforcer-plugin:1.4.1:enforce (enforce-maven) @ juneau-rest-client-utest
---
[INFO] 
[INFO] --- jacoco-maven-plugin:0.8.2:prepare-agent (default-prepare-agent) @ juneau-rest-client-utest
---
[INFO] argLine set to -javaagent:/home/jenkins/.m2/repository/org/jacoco/org.jacoco.agent/0.8.2/org.jacoco.agent-0.8.2-runtime.jar=destfile=<https://builds.apache.org/job/Juneau-Java-1.8/ws/juneau-rest/juneau-rest-client-utest/target/jacoco.exec>
[INFO] 
[INFO] --- maven-remote-resources-plugin:1.5:process (process-resource-bundles) @ juneau-rest-client-utest
---
[INFO] 
[INFO] --- maven-resources-plugin:3.1.0:resources (default-resources) @ juneau-rest-client-utest
---
[INFO] Using 'UTF-8' encoding to copy filtered resources.
[INFO] skip non existing resourceDirectory <https://builds.apache.org/job/Juneau-Java-1.8/ws/juneau-rest/juneau-rest-client-utest/src/main/resources>
[INFO] Copying 3 resources
[INFO] 
[INFO] --- maven-compiler-plugin:3.7.0:compile (default-compile) @ juneau-rest-client-utest
---
[INFO] Nothing to compile - all classes are up to date
[INFO] 
[INFO] --- maven-resources-plugin:3.1.0:testResources (default-testResources) @ juneau-rest-client-utest
---
[INFO] Using 'UTF-8' encoding to copy filtered resources.
[INFO] skip non existing resourceDirectory <https://builds.apache.org/job/Juneau-Java-1.8/ws/juneau-rest/juneau-rest-client-utest/src/test/resources>
[INFO] Copying 3 resources
[INFO] 
[INFO] --- maven-compiler-plugin:3.7.0:testCompile (default-testCompile) @ juneau-rest-client-utest
---
[INFO] Changes detected - recompiling the module!
[INFO] Compiling 46 source files to <https://builds.apache.org/job/Juneau-Java-1.8/ws/juneau-rest/juneau-rest-client-utest/target/test-classes>
[INFO] 
[INFO] --- maven-surefire-plugin:2.22.0:test (default-test) @ juneau-rest-client-utest ---
[INFO] 
[INFO] -------------------------------------------------------
[INFO]  T E S T S
[INFO] -------------------------------------------------------
[INFO] Running org.apache.juneau.http.BasicHeader_Test
[INFO] Tests run: 7, Failures: 0, Errors: 0, Skipped: 0, Time elapsed: 0.587 s - in org.apache.juneau.http.BasicHeader_Test
[INFO] Running org.apache.juneau.http.BasicNameValuePair_Test
[INFO] Tests run: 6, Failures: 0, Errors: 0, Skipped: 0, Time elapsed: 0.015 s - in org.apache.juneau.http.BasicNameValuePair_Test
[INFO] Running org.apache.juneau.http.NameValuePairSupplier_Test
[INFO] Tests run: 4, Failures: 0, Errors: 0, Skipped: 0, Time elapsed: 0.084 s - in org.apache.juneau.http.NameValuePairSupplier_Test
[INFO] Running org.apache.juneau.http.ReaderResource_Test
[INFO] Tests run: 1, Failures: 0, Errors: 0, Skipped: 0, Time elapsed: 0.032 s - in org.apache.juneau.http.ReaderResource_Test
[INFO] Running org.apache.juneau.http.BasicHttpResource_Test
[INFO] Tests run: 1, Failures: 0, Errors: 0, Skipped: 0, Time elapsed: 0 s - in org.apache.juneau.http.BasicHttpResource_Test
[INFO] Running org.apache.juneau.http.header.ContentType2Test
[INFO] Tests run: 21, Failures: 0, Errors: 0, Skipped: 0, Time elapsed: 0.067 s - in org.apache.juneau.http.header.ContentType2Test
[INFO] Running org.apache.juneau.http.header.ContentTypeTest
[INFO] Tests run: 2, Failures: 0, Errors: 0, Skipped: 0, Time elapsed: 0 s - in org.apache.juneau.http.header.ContentTypeTest
[INFO] Running org.apache.juneau.http.header.AcceptExtensionsTest
[INFO] Tests run: 2, Failures: 0, Errors: 0, Skipped: 0, Time elapsed: 0.017 s - in org.apache.juneau.http.header.AcceptExtensionsTest
[INFO] Running org.apache.juneau.http.header.AcceptTest
[INFO] Tests run: 146, Failures: 0, Errors: 0, Skipped: 0, Time elapsed: 0.105 s - in org.apache.juneau.http.header.AcceptTest
[INFO] Running org.apache.juneau.http.header.MediaRangeTest
[INFO] Tests run: 17, Failures: 0, Errors: 0, Skipped: 0, Time elapsed: 0.027 s - in org.apache.juneau.http.header.MediaRangeTest
[INFO] Running org.apache.juneau.http.StreamResource_Test
[INFO] Tests run: 1, Failures: 0, Errors: 0, Skipped: 0, Time elapsed: 0.002 s - in org.apache.juneau.http.StreamResource_Test
[INFO] Running org.apache.juneau.http.HeaderSupplier_Test
[ERROR] Tests run: 4, Failures: 1, Errors: 0, Skipped: 0, Time elapsed: 0.049 s <<<
FAILURE! - in org.apache.juneau.http.HeaderSupplier_Test
[ERROR] a01_basic(org.apache.juneau.http.HeaderSupplier_Test)  Time elapsed: 0.043 s  <<<
FAILURE!
org.apache.juneau.BasicAssertionError: 
Unexpected value.
	Expected=[[]]
	Actual=['[]']
	at org.apache.juneau.http.HeaderSupplier_Test.a01_basic(HeaderSupplier_Test.java:49)

[INFO] Running org.apache.juneau.rest.client2.Remote_CommonInterfaces_Test
[INFO] Tests run: 9, Failures: 0, Errors: 0, Skipped: 0, Time elapsed: 1.986 s - in org.apache.juneau.rest.client2.Remote_CommonInterfaces_Test
[INFO] Running org.apache.juneau.rest.client2.Remote_HeaderAnnotation_Test
[INFO] Tests run: 14, Failures: 0, Errors: 0, Skipped: 0, Time elapsed: 0.621 s - in org.apache.juneau.rest.client2.Remote_HeaderAnnotation_Test
[INFO] Running org.apache.juneau.rest.client2.Remote_BodyAnnotation_Test
[INFO] Tests run: 3, Failures: 0, Errors: 0, Skipped: 0, Time elapsed: 0.166 s - in org.apache.juneau.rest.client2.Remote_BodyAnnotation_Test
[INFO] Running org.apache.juneau.rest.client2.RestClient_Response_Headers_Test
[INFO] Tests run: 7, Failures: 0, Errors: 0, Skipped: 0, Time elapsed: 0.395 s - in org.apache.juneau.rest.client2.RestClient_Response_Headers_Test
[INFO] Running org.apache.juneau.rest.client2.RrpcInterfaceTest
SLF4J: Failed to load class "org.slf4j.impl.StaticLoggerBinder".
SLF4J: Defaulting to no-operation (NOP) logger implementation
SLF4J: See http://www.slf4j.org/codes.html#StaticLoggerBinder for further details.
[INFO] Tests run: 872, Failures: 0, Errors: 0, Skipped: 0, Time elapsed: 3.14 s - in org.apache.juneau.rest.client2.RrpcInterfaceTest
[INFO] Running org.apache.juneau.rest.client2.RestClient_Logging_Test
[INFO] Tests run: 3, Failures: 0, Errors: 0, Skipped: 0, Time elapsed: 0.076 s - in org.apache.juneau.rest.client2.RestClient_Logging_Test
[INFO] Running org.apache.juneau.rest.client2.RestClient_Config_BeanContext_Test
[INFO] Tests run: 39, Failures: 0, Errors: 0, Skipped: 0, Time elapsed: 0.523 s - in org.apache.juneau.rest.client2.RestClient_Config_BeanContext_Test
[INFO] Running org.apache.juneau.rest.client2.RestClient_Body_Test
[INFO] Tests run: 2, Failures: 0, Errors: 0, Skipped: 0, Time elapsed: 0.081 s - in org.apache.juneau.rest.client2.RestClient_Body_Test
[INFO] Running org.apache.juneau.rest.client2.RestClient_Test
[INFO] Tests run: 39, Failures: 0, Errors: 0, Skipped: 0, Time elapsed: 1.258 s - in org.apache.juneau.rest.client2.RestClient_Test
[INFO] Running org.apache.juneau.rest.client2.Remote_Test
[INFO] Tests run: 26, Failures: 0, Errors: 0, Skipped: 0, Time elapsed: 0.243 s - in org.apache.juneau.rest.client2.Remote_Test
[INFO] Running org.apache.juneau.rest.client2.RestClient_Config_OpenApi_Test
[INFO] Tests run: 3, Failures: 0, Errors: 0, Skipped: 0, Time elapsed: 0.035 s - in org.apache.juneau.rest.client2.RestClient_Config_OpenApi_Test
[INFO] Running org.apache.juneau.rest.client2.Remote_RemoteMethodAnnotation_Test
[INFO] Tests run: 6, Failures: 0, Errors: 0, Skipped: 0, Time elapsed: 0.088 s - in org.apache.juneau.rest.client2.Remote_RemoteMethodAnnotation_Test
[INFO] Running org.apache.juneau.rest.client2.RestClient_Config_Parser_Test
[INFO] Tests run: 3, Failures: 0, Errors: 0, Skipped: 0, Time elapsed: 0.033 s - in org.apache.juneau.rest.client2.RestClient_Config_Parser_Test
[INFO] Running org.apache.juneau.rest.client2.Remote_ResponseAnnotation_Test
[INFO] Tests run: 3, Failures: 0, Errors: 0, Skipped: 0, Time elapsed: 0.033 s - in org.apache.juneau.rest.client2.Remote_ResponseAnnotation_Test
[INFO] Running org.apache.juneau.rest.client2.Remote_RequestAnnotation_Test
[INFO] Tests run: 5, Failures: 0, Errors: 0, Skipped: 0, Time elapsed: 0.09 s - in org.apache.juneau.rest.client2.Remote_RequestAnnotation_Test
[INFO] Running org.apache.juneau.rest.client2.RestClient_Marshalls_Test
[INFO] Tests run: 7, Failures: 0, Errors: 0, Skipped: 0, Time elapsed: 0.146 s - in org.apache.juneau.rest.client2.RestClient_Marshalls_Test
[INFO] Running org.apache.juneau.rest.client2.RestClient_Headers_Test
[INFO] Tests run: 17, Failures: 0, Errors: 0, Skipped: 0, Time elapsed: 0.312 s - in org.apache.juneau.rest.client2.RestClient_Headers_Test
[INFO] Running org.apache.juneau.rest.client2.RestClient_Response_Body_Test
[INFO] Tests run: 9, Failures: 0, Errors: 0, Skipped: 0, Time elapsed: 0.163 s - in org.apache.juneau.rest.client2.RestClient_Response_Body_Test
[INFO] Running org.apache.juneau.rest.client2.RestClient_Response_Test
[INFO] Tests run: 16, Failures: 0, Errors: 0, Skipped: 0, Time elapsed: 0.125 s - in org.apache.juneau.rest.client2.RestClient_Response_Test
[INFO] Running org.apache.juneau.rest.client2.Remote_PathAnnotation_Test
[INFO] Tests run: 12, Failures: 0, Errors: 0, Skipped: 0, Time elapsed: 0.278 s - in org.apache.juneau.rest.client2.Remote_PathAnnotation_Test
[INFO] Running org.apache.juneau.rest.client2.RestClient_CallbackStrings_Test
[INFO] Tests run: 2, Failures: 0, Errors: 0, Skipped: 0, Time elapsed: 0.015 s - in org.apache.juneau.rest.client2.RestClient_CallbackStrings_Test
[INFO] Running org.apache.juneau.rest.client2.RestClient_Query_Test
[INFO] Tests run: 12, Failures: 0, Errors: 0, Skipped: 0, Time elapsed: 0.121 s - in org.apache.juneau.rest.client2.RestClient_Query_Test
[INFO] Running org.apache.juneau.rest.client2.RestClient_FormData_Test
[INFO] Tests run: 11, Failures: 0, Errors: 0, Skipped: 0, Time elapsed: 0.12 s - in org.apache.juneau.rest.client2.RestClient_FormData_Test
[INFO] Running org.apache.juneau.rest.client2.RestClient_Config_Context_Test
[INFO] Tests run: 11, Failures: 0, Errors: 0, Skipped: 0, Time elapsed: 0.083 s - in org.apache.juneau.rest.client2.RestClient_Config_Context_Test
[INFO] Running org.apache.juneau.rest.client2.RestClient_Paths_Test
[INFO] Tests run: 5, Failures: 0, Errors: 0, Skipped: 0, Time elapsed: 0.045 s - in org.apache.juneau.rest.client2.RestClient_Paths_Test
[INFO] Running org.apache.juneau.rest.client2.Remote_QueryAnnotation_Test
[INFO] Tests run: 16, Failures: 0, Errors: 0, Skipped: 0, Time elapsed: 0.323 s - in org.apache.juneau.rest.client2.Remote_QueryAnnotation_Test
[INFO] Running org.apache.juneau.rest.client2.ext.BasicHttpRequestRetryHandler_Test
[INFO] Tests run: 1, Failures: 0, Errors: 0, Skipped: 0, Time elapsed: 0.035 s - in org.apache.juneau.rest.client2.ext.BasicHttpRequestRetryHandler_Test
[INFO] Running org.apache.juneau.rest.client2.RestClient_BasicCalls_Test
[INFO] Tests run: 30, Failures: 0, Errors: 0, Skipped: 0, Time elapsed: 0.234 s - in org.apache.juneau.rest.client2.RestClient_BasicCalls_Test
[INFO] Running org.apache.juneau.rest.client2.RestClient_Config_Serializer_Test
[INFO] Tests run: 17, Failures: 0, Errors: 0, Skipped: 0, Time elapsed: 0.107 s - in org.apache.juneau.rest.client2.RestClient_Config_Serializer_Test
[INFO] Running org.apache.juneau.rest.client2.RestClient_Config_RestClient_Test
[INFO] Tests run: 16, Failures: 0, Errors: 0, Skipped: 0, Time elapsed: 0.254 s - in org.apache.juneau.rest.client2.RestClient_Config_RestClient_Test
[INFO] Running org.apache.juneau.rest.client2.RestCallException_Test
[INFO] Tests run: 1, Failures: 0, Errors: 0, Skipped: 0, Time elapsed: 0.03 s - in org.apache.juneau.rest.client2.RestCallException_Test
[INFO] Running org.apache.juneau.rest.client2.Remote_FormDataAnnotation_Test
[INFO] Tests run: 16, Failures: 0, Errors: 0, Skipped: 0, Time elapsed: 0.366 s - in org.apache.juneau.rest.client2.Remote_FormDataAnnotation_Test
[INFO] 
[INFO] Results:
[INFO] 
[ERROR] Failures: 
[ERROR]   HeaderSupplier_Test.a01_basic:49 Unexpected value.
	Expected=[[]]
	Actual=['[]']
[INFO] 
[ERROR] Tests run: 1445, Failures: 1, Errors: 0, Skipped: 0
[INFO] 
[INFO]                                                                         
[INFO] ------------------------------------------------------------------------
[INFO] Skipping juneau
[INFO] This project has been banned from the build due to previous failures.
[INFO] ------------------------------------------------------------------------
[INFO] ------------------------------------------------------------------------
[INFO] Reactor Summary:
[INFO] 
[INFO] juneau ............................................. SUCCESS [  5.886 s]
[INFO] juneau/core ........................................ SUCCESS [  2.479 s]
[INFO] juneau/core/marshall ............................... SUCCESS [ 44.274 s]
[INFO] juneau/core/marshall-rdf ........................... SUCCESS [  8.361 s]
[INFO] juneau/core/dto .................................... SUCCESS [ 10.874 s]
[INFO] juneau/core/config ................................. SUCCESS [  9.150 s]
[INFO] juneau/core/core-utest ............................. SUCCESS [ 49.660 s]
[INFO] juneau/rest ........................................ SUCCESS [  2.313 s]
[INFO] juneau/rest/rest-server ............................ SUCCESS [ 15.698 s]
[INFO] juneau/rest/rest-server-jaxrs ...................... SUCCESS [  6.940 s]
[INFO] juneau/rest/rest-server-rdf ........................ SUCCESS [  9.778 s]
[INFO] juneau/rest/rest-server-springboot ................. SUCCESS [  9.701 s]
[INFO] juneau/rest/rest-client ............................ SUCCESS [ 10.394 s]
[INFO] juneau/rest/rest-mock .............................. SUCCESS [  7.665 s]
[INFO] juneau/rest/rest-mock-utest ........................ SUCCESS [  9.923 s]
[INFO] juneau/rest/rest-server-utest ...................... SUCCESS [ 27.625 s]
[INFO] juneau/rest/rest-client-utest ...................... FAILURE [ 16.062 s]
[INFO] juneau/microservice ................................ SKIPPED
[INFO] juneau/microservice/microservice-core .............. SKIPPED
[INFO] juneau/microservice/microservice-jetty ............. SKIPPED
[INFO] juneau/microservice/my-jetty-microservice .......... SKIPPED
[INFO] juneau/examples .................................... SKIPPED
[INFO] juneau/examples/rest ............................... SKIPPED
[INFO] juneau/microservice/microservice-ftest ............. SKIPPED
[INFO] juneau/microservice/my-springboot-microservice ..... SKIPPED
[INFO] juneau/sc .......................................... SKIPPED
[INFO] juneau/sc/sc-server ................................ SKIPPED
[INFO] juneau/sc/sc-client ................................ SKIPPED
[INFO] juneau/examples/examples-core ...................... SKIPPED
[INFO] juneau/examples/examples-rest-jetty ................ SKIPPED
[INFO] juneau/examples/examples-rest-springboot ........... SKIPPED
[INFO] juneau/examples/examples-rest-jetty-ftest .......... SKIPPED
[INFO] juneau/doc ......................................... SKIPPED
[INFO] juneau/releng ...................................... SKIPPED
[INFO] juneau/releng/all .................................. SKIPPED
[INFO] juneau/releng/distrib .............................. SKIPPED
[INFO] ------------------------------------------------------------------------
[INFO] BUILD FAILURE
[INFO] ------------------------------------------------------------------------
[INFO] Total time: 04:08 min
[INFO] Finished at: 2020-07-11T14:48:22+00:00
[INFO] Final Memory: 137M/4498M
[INFO] ------------------------------------------------------------------------
[ERROR] Failed to execute goal org.apache.maven.plugins:maven-surefire-plugin:2.22.0:test
(default-test) on project juneau-rest-client-utest: There are test failures.
[ERROR] 
[ERROR] Please refer to <https://builds.apache.org/job/Juneau-Java-1.8/ws/juneau-rest/juneau-rest-client-utest/target/surefire-reports>
for the individual test results.
[ERROR] Please refer to dump files (if any exist) [date]-jvmRun[N].dump, [date].dumpstream
and [date]-jvmRun[N].dumpstream.
[ERROR] -> [Help 1]
[ERROR] 
[ERROR] To see the full stack trace of the errors, re-run Maven with the -e switch.
[ERROR] Re-run Maven using the -X switch to enable full debug logging.
[ERROR] 
[ERROR] For more information about the errors and possible solutions, please read the following
articles:
[ERROR] [Help 1] http://cwiki.apache.org/confluence/display/MAVEN/MojoFailureException
[ERROR] 
[ERROR] After correcting the problems, you can resume the build with the command
[ERROR]   mvn <goals> -rf :juneau-rest-client-utest
Build step 'Invoke top-level Maven targets' marked build as failure
Recording test results
[TASKS] Skipping publisher since build result is FAILURE

Mime
View raw message