juneau-dev mailing list archives

Site index · List index
Message view « Date » · « Thread »
Top « Date » · « Thread »
From Apache Jenkins Server <jenk...@builds.apache.org>
Subject Build failed in Jenkins: Juneau-Java-1.8 #1732
Date Thu, 18 Jun 2020 14:04:29 GMT
See <https://builds.apache.org/job/Juneau-Java-1.8/1732/display/redirect?page=changes>

Changes:

[JamesBognar] RestClient tests.


------------------------------------------
Started by an SCM change
Running as SYSTEM
[EnvInject] - Loading node environment variables.
Building remotely on H30 (ubuntu) in workspace <https://builds.apache.org/job/Juneau-Java-1.8/ws/>
No credentials specified
 > git rev-parse --is-inside-work-tree # timeout=10
Fetching changes from the remote Git repository
 > git config remote.origin.url https://github.com/apache/juneau.git # timeout=10
Fetching upstream changes from https://github.com/apache/juneau.git
 > git --version # timeout=10
 > git fetch --tags --progress -- https://github.com/apache/juneau.git +refs/heads/*:refs/remotes/origin/*
 > git rev-parse refs/remotes/origin/master^{commit} # timeout=10
 > git rev-parse refs/remotes/origin/origin/master^{commit} # timeout=10
Checking out Revision 66191a63981619aa2d60f8494b75840008e25c41 (refs/remotes/origin/master)
 > git config core.sparsecheckout # timeout=10
 > git checkout -f 66191a63981619aa2d60f8494b75840008e25c41
Commit message: "RestClient tests."
 > git rev-list --no-walk 41465213e58b7a02f2a36cc670654a599a827dc3 # timeout=10
[Juneau-Java-1.8] $ /home/jenkins/tools/maven/apache-maven-3.2.5/bin/mvn clean install deploy
javadoc:aggregate
[INFO] Scanning for projects...
[WARNING] 
[WARNING] Some problems were encountered while building the effective model for org.apache.juneau:juneau-examples-rest-springboot:jar:8.1.4-SNAPSHOT
[WARNING] 'build.plugins.plugin.version' for org.springframework.boot:spring-boot-maven-plugin
is missing. @ org.apache.juneau:juneau-examples-rest-springboot:[unknown-version], <https://builds.apache.org/job/Juneau-Java-1.8/ws/juneau-examples/juneau-examples-rest-springboot/pom.xml,>
line 87, column 12
[WARNING] 
[WARNING] It is highly recommended to fix these problems because they threaten the stability
of your build.
[WARNING] 
[WARNING] For this reason, future Maven versions might no longer support building such malformed
projects.
[WARNING] 
[INFO] ------------------------------------------------------------------------
[INFO] Reactor Build Order:
[INFO] 
[INFO] juneau
[INFO] juneau/core
[INFO] juneau/core/marshall
[INFO] juneau/core/marshall-rdf
[INFO] juneau/core/dto
[INFO] juneau/core/config
[INFO] juneau/core/core-utest
[INFO] juneau/rest
[INFO] juneau/rest/rest-server
[INFO] juneau/rest/rest-server-jaxrs
[INFO] juneau/rest/rest-server-rdf
[INFO] juneau/rest/rest-server-springboot
[INFO] juneau/rest/rest-client
[INFO] juneau/rest/rest-mock
[INFO] juneau/rest/rest-mock-utest
[INFO] juneau/rest/rest-server-utest
[INFO] juneau/rest/rest-client-utest
[INFO] juneau/microservice
[INFO] juneau/microservice/microservice-core
[INFO] juneau/microservice/microservice-jetty
[INFO] juneau/microservice/my-jetty-microservice
[INFO] juneau/examples
[INFO] juneau/examples/rest
[INFO] juneau/microservice/microservice-ftest
[INFO] juneau/microservice/my-springboot-microservice
[INFO] juneau/sc
[INFO] juneau/sc/sc-server
[INFO] juneau/sc/sc-client
[INFO] juneau/examples/examples-core
[INFO] juneau/examples/examples-rest-jetty
[INFO] juneau/examples/examples-rest-springboot
[INFO] juneau/examples/examples-rest-jetty-ftest
[INFO] juneau/doc
[INFO] juneau/releng
[INFO] juneau/releng/all
[INFO] juneau/releng/distrib
[INFO]                                                                         
[INFO] ------------------------------------------------------------------------
[INFO] Building juneau 8.1.4-SNAPSHOT
[INFO] ------------------------------------------------------------------------
[INFO] 
[INFO] --- maven-clean-plugin:3.1.0:clean (default-clean) @ juneau ---
[INFO] 
[INFO] --- maven-enforcer-plugin:1.4.1:enforce (enforce-maven-version) @ juneau ---
[INFO] 
[INFO] --- maven-enforcer-plugin:1.4.1:enforce (enforce-maven) @ juneau ---
[INFO] 
[INFO] --- maven-remote-resources-plugin:1.5:process (process-resource-bundles) @ juneau ---
[INFO] 
[INFO] --- maven-site-plugin:3.7.1:attach-descriptor (attach-descriptor) @ juneau ---
[INFO] No site descriptor found: nothing to attach.
[INFO] 
[INFO] --- apache-rat-plugin:0.12:check (default) @ juneau ---
[INFO] Enabled default license matchers.
[INFO] Will parse SCM ignores for exclusions...
[INFO] Parsing exclusions from <https://builds.apache.org/job/Juneau-Java-1.8/ws/.gitignore>
[INFO] Finished adding exclusions from SCM ignore files.
[INFO] 72 implicit excludes (use -debug for more details).
[INFO] Exclude: **/DEPENDENCIES
[INFO] Exclude: **/target/**
[INFO] Exclude: **/empty.txt
[INFO] Exclude: **/TODO.txt
[INFO] Exclude: **/.settings/**
[INFO] Exclude: **/.project
[INFO] Exclude: **/.classpath
[INFO] Exclude: **/*.launch
[INFO] Exclude: **/*.prefs
[INFO] Exclude: **/*.2
[INFO] Exclude: **/jetty.out.xml
[INFO] Exclude: **/derby.log
[INFO] Exclude: **/dependency-reduced-pom.xml
[INFO] Exclude: **/docs.txt
[INFO] Exclude: **/toc.txt
[INFO] Exclude: **/app.json
[INFO] Exclude: **/Procfile
[INFO] 22 resources included (use -debug for more details)
[INFO] Rat check: Summary over all files. Unapproved: 1, unknown: 1, generated: 0, approved:
18 licenses.
[INFO] Enabled default license matchers.
[INFO] Will parse SCM ignores for exclusions...
[INFO] Parsing exclusions from <https://builds.apache.org/job/Juneau-Java-1.8/ws/.gitignore>
[INFO] Finished adding exclusions from SCM ignore files.
[INFO] 72 implicit excludes (use -debug for more details).
[INFO] Exclude: **/DEPENDENCIES
[INFO] Exclude: **/target/**
[INFO] Exclude: **/empty.txt
[INFO] Exclude: **/TODO.txt
[INFO] Exclude: **/.settings/**
[INFO] Exclude: **/.project
[INFO] Exclude: **/.classpath
[INFO] Exclude: **/*.launch
[INFO] Exclude: **/*.prefs
[INFO] Exclude: **/*.2
[INFO] Exclude: **/jetty.out.xml
[INFO] Exclude: **/derby.log
[INFO] Exclude: **/dependency-reduced-pom.xml
[INFO] Exclude: **/docs.txt
[INFO] Exclude: **/toc.txt
[INFO] Exclude: **/app.json
[INFO] Exclude: **/Procfile
[INFO] 22 resources included (use -debug for more details)
[WARNING] Files with unapproved licenses:
  hs_err_pid1291.log
[INFO]                                                                         
[INFO] ------------------------------------------------------------------------
[INFO] Skipping juneau
[INFO] This project has been banned from the build due to previous failures.
[INFO] ------------------------------------------------------------------------
[INFO] ------------------------------------------------------------------------
[INFO] Reactor Summary:
[INFO] 
[INFO] juneau ............................................. FAILURE [  3.169 s]
[INFO] juneau/core ........................................ SKIPPED
[INFO] juneau/core/marshall ............................... SKIPPED
[INFO] juneau/core/marshall-rdf ........................... SKIPPED
[INFO] juneau/core/dto .................................... SKIPPED
[INFO] juneau/core/config ................................. SKIPPED
[INFO] juneau/core/core-utest ............................. SKIPPED
[INFO] juneau/rest ........................................ SKIPPED
[INFO] juneau/rest/rest-server ............................ SKIPPED
[INFO] juneau/rest/rest-server-jaxrs ...................... SKIPPED
[INFO] juneau/rest/rest-server-rdf ........................ SKIPPED
[INFO] juneau/rest/rest-server-springboot ................. SKIPPED
[INFO] juneau/rest/rest-client ............................ SKIPPED
[INFO] juneau/rest/rest-mock .............................. SKIPPED
[INFO] juneau/rest/rest-mock-utest ........................ SKIPPED
[INFO] juneau/rest/rest-server-utest ...................... SKIPPED
[INFO] juneau/rest/rest-client-utest ...................... SKIPPED
[INFO] juneau/microservice ................................ SKIPPED
[INFO] juneau/microservice/microservice-core .............. SKIPPED
[INFO] juneau/microservice/microservice-jetty ............. SKIPPED
[INFO] juneau/microservice/my-jetty-microservice .......... SKIPPED
[INFO] juneau/examples .................................... SKIPPED
[INFO] juneau/examples/rest ............................... SKIPPED
[INFO] juneau/microservice/microservice-ftest ............. SKIPPED
[INFO] juneau/microservice/my-springboot-microservice ..... SKIPPED
[INFO] juneau/sc .......................................... SKIPPED
[INFO] juneau/sc/sc-server ................................ SKIPPED
[INFO] juneau/sc/sc-client ................................ SKIPPED
[INFO] juneau/examples/examples-core ...................... SKIPPED
[INFO] juneau/examples/examples-rest-jetty ................ SKIPPED
[INFO] juneau/examples/examples-rest-springboot ........... SKIPPED
[INFO] juneau/examples/examples-rest-jetty-ftest .......... SKIPPED
[INFO] juneau/doc ......................................... SKIPPED
[INFO] juneau/releng ...................................... SKIPPED
[INFO] juneau/releng/all .................................. SKIPPED
[INFO] juneau/releng/distrib .............................. SKIPPED
[INFO] ------------------------------------------------------------------------
[INFO] BUILD FAILURE
[INFO] ------------------------------------------------------------------------
[INFO] Total time: 5.507 s
[INFO] Finished at: 2020-06-18T14:04:25+00:00
[INFO] Final Memory: 35M/968M
[INFO] ------------------------------------------------------------------------
[ERROR] Failed to execute goal org.apache.rat:apache-rat-plugin:0.12:check (default) on project
juneau: Too many files with unapproved license: 1 See RAT report in: <https://builds.apache.org/job/Juneau-Java-1.8/ws/target/rat.txt>
-> [Help 1]
[ERROR] 
[ERROR] To see the full stack trace of the errors, re-run Maven with the -e switch.
[ERROR] Re-run Maven using the -X switch to enable full debug logging.
[ERROR] 
[ERROR] For more information about the errors and possible solutions, please read the following
articles:
[ERROR] [Help 1] http://cwiki.apache.org/confluence/display/MAVEN/MojoFailureException
Build step 'Invoke top-level Maven targets' marked build as failure
Recording test results
ERROR: Step ?Publish JUnit test result report? failed: No test report files were found. Configuration
error?
[TASKS] Skipping publisher since build result is FAILURE

Mime
View raw message