juneau-dev mailing list archives

Site index · List index
Message view « Date » · « Thread »
Top « Date » · « Thread »
From Apache Jenkins Server <jenk...@builds.apache.org>
Subject Build failed in Jenkins: Juneau-Java-1.8 #1733
Date Thu, 18 Jun 2020 15:05:21 GMT
See <https://builds.apache.org/job/Juneau-Java-1.8/1733/display/redirect?page=changes>

Changes:

[JamesBognar] RestClient tests


------------------------------------------
[...truncated 477.74 KB...]
[INFO] --- maven-site-plugin:3.7.1:attach-descriptor (attach-descriptor) @ juneau-rest-server-utest
---
[INFO] Skipping because packaging 'bundle' is not pom.
[INFO] 
[INFO] --- maven-jar-plugin:3.1.0:test-jar (default) @ juneau-rest-server-utest ---
[INFO] Building jar: <https://builds.apache.org/job/Juneau-Java-1.8/ws/juneau-rest/juneau-rest-server-utest/target/juneau-rest-server-utest-8.1.4-SNAPSHOT-tests.jar>
[INFO] 
[INFO] --- apache-rat-plugin:0.12:check (default) @ juneau-rest-server-utest ---
[INFO] Enabled default license matchers.
[INFO] Will parse SCM ignores for exclusions...
[INFO] Parsing exclusions from <https://builds.apache.org/job/Juneau-Java-1.8/ws/juneau-rest/juneau-rest-server-utest/.gitignore>
[INFO] Finished adding exclusions from SCM ignore files.
[INFO] 64 implicit excludes (use -debug for more details).
[INFO] Exclude: **/DEPENDENCIES
[INFO] Exclude: **/target/**
[INFO] Exclude: **/empty.txt
[INFO] Exclude: **/TODO.txt
[INFO] Exclude: **/.settings/**
[INFO] Exclude: **/.project
[INFO] Exclude: **/.classpath
[INFO] Exclude: **/*.launch
[INFO] Exclude: **/*.prefs
[INFO] Exclude: **/*.2
[INFO] Exclude: **/jetty.out.xml
[INFO] Exclude: **/derby.log
[INFO] Exclude: **/dependency-reduced-pom.xml
[INFO] Exclude: **/docs.txt
[INFO] Exclude: **/toc.txt
[INFO] Exclude: **/app.json
[INFO] Exclude: **/Procfile
[INFO] 86 resources included (use -debug for more details)
[INFO] Rat check: Summary over all files. Unapproved: 0, unknown: 0, generated: 0, approved:
86 licenses.
[INFO] 
[INFO] --- maven-source-plugin:3.0.1:jar-no-fork (attach-sources) @ juneau-rest-server-utest
---
[INFO] Building jar: <https://builds.apache.org/job/Juneau-Java-1.8/ws/juneau-rest/juneau-rest-server-utest/target/juneau-rest-server-utest-8.1.4-SNAPSHOT-sources.jar>
[INFO] 
[INFO] --- maven-install-plugin:2.5.2:install (default-install) @ juneau-rest-server-utest
---
[INFO] Installing <https://builds.apache.org/job/Juneau-Java-1.8/ws/juneau-rest/juneau-rest-server-utest/target/juneau-rest-server-utest-8.1.4-SNAPSHOT.jar>
to /home/jenkins/.m2/repository/org/apache/juneau/juneau-rest-server-utest/8.1.4-SNAPSHOT/juneau-rest-server-utest-8.1.4-SNAPSHOT.jar
[INFO] Installing <https://builds.apache.org/job/Juneau-Java-1.8/ws/juneau-rest/juneau-rest-server-utest/pom.xml>
to /home/jenkins/.m2/repository/org/apache/juneau/juneau-rest-server-utest/8.1.4-SNAPSHOT/juneau-rest-server-utest-8.1.4-SNAPSHOT.pom
[INFO] Installing <https://builds.apache.org/job/Juneau-Java-1.8/ws/juneau-rest/juneau-rest-server-utest/target/juneau-rest-server-utest-8.1.4-SNAPSHOT-tests.jar>
to /home/jenkins/.m2/repository/org/apache/juneau/juneau-rest-server-utest/8.1.4-SNAPSHOT/juneau-rest-server-utest-8.1.4-SNAPSHOT-tests.jar
[INFO] Installing <https://builds.apache.org/job/Juneau-Java-1.8/ws/juneau-rest/juneau-rest-server-utest/target/juneau-rest-server-utest-8.1.4-SNAPSHOT-sources.jar>
to /home/jenkins/.m2/repository/org/apache/juneau/juneau-rest-server-utest/8.1.4-SNAPSHOT/juneau-rest-server-utest-8.1.4-SNAPSHOT-sources.jar
[INFO] Installing <https://builds.apache.org/job/Juneau-Java-1.8/ws/juneau-rest/juneau-rest-server-utest/target/juneau-rest-server-utest-8.1.4-SNAPSHOT-tests.jar>
to /home/jenkins/.m2/repository/org/apache/juneau/juneau-rest-server-utest/8.1.4-SNAPSHOT/juneau-rest-server-utest-8.1.4-SNAPSHOT-tests.jar
[INFO] Installing <https://builds.apache.org/job/Juneau-Java-1.8/ws/juneau-rest/juneau-rest-server-utest/target/juneau-rest-server-utest-8.1.4-SNAPSHOT-sources.jar>
to /home/jenkins/.m2/repository/org/apache/juneau/juneau-rest-server-utest/8.1.4-SNAPSHOT/juneau-rest-server-utest-8.1.4-SNAPSHOT-sources.jar
[INFO] 
[INFO] --- maven-bundle-plugin:3.2.0:install (default-install) @ juneau-rest-server-utest
---
[INFO] Installing org/apache/juneau/juneau-rest-server-utest/8.1.4-SNAPSHOT/juneau-rest-server-utest-8.1.4-SNAPSHOT.jar
[INFO] Writing OBR metadata
[INFO] 
[INFO] --- maven-deploy-plugin:2.8.2:deploy (default-deploy) @ juneau-rest-server-utest ---
Downloading: https://repository.apache.org/content/repositories/snapshots/org/apache/juneau/juneau-rest-server-utest/8.1.4-SNAPSHOT/maven-metadata.xml
2/2 KB            Downloaded: https://repository.apache.org/content/repositories/snapshots/org/apache/juneau/juneau-rest-server-utest/8.1.4-SNAPSHOT/maven-metadata.xml
(2 KB at 1.5 KB/sec)
Uploading: https://repository.apache.org/content/repositories/snapshots/org/apache/juneau/juneau-rest-server-utest/8.1.4-SNAPSHOT/juneau-rest-server-utest-8.1.4-20200618.150443-453.jar
2/9 KB   4/9 KB   6/9 KB   8/9 KB   9/9 KB            Uploaded: https://repository.apache.org/content/repositories/snapshots/org/apache/juneau/juneau-rest-server-utest/8.1.4-SNAPSHOT/juneau-rest-server-utest-8.1.4-20200618.150443-453.jar
(9 KB at 15.1 KB/sec)
Uploading: https://repository.apache.org/content/repositories/snapshots/org/apache/juneau/juneau-rest-server-utest/8.1.4-SNAPSHOT/juneau-rest-server-utest-8.1.4-20200618.150443-453.pom
2/6 KB   4/6 KB   6/6 KB            Uploaded: https://repository.apache.org/content/repositories/snapshots/org/apache/juneau/juneau-rest-server-utest/8.1.4-SNAPSHOT/juneau-rest-server-utest-8.1.4-20200618.150443-453.pom
(6 KB at 10.2 KB/sec)
Downloading: https://repository.apache.org/content/repositories/snapshots/org/apache/juneau/juneau-rest-server-utest/maven-metadata.xml
401/401 B               Downloaded: https://repository.apache.org/content/repositories/snapshots/org/apache/juneau/juneau-rest-server-utest/maven-metadata.xml
(401 B at 1.2 KB/sec)
Uploading: https://repository.apache.org/content/repositories/snapshots/org/apache/juneau/juneau-rest-server-utest/8.1.4-SNAPSHOT/maven-metadata.xml
2/2 KB               Uploaded: https://repository.apache.org/content/repositories/snapshots/org/apache/juneau/juneau-rest-server-utest/8.1.4-SNAPSHOT/maven-metadata.xml
(2 KB at 2.4 KB/sec)
Uploading: https://repository.apache.org/content/repositories/snapshots/org/apache/juneau/juneau-rest-server-utest/maven-metadata.xml
401/401 B               Uploaded: https://repository.apache.org/content/repositories/snapshots/org/apache/juneau/juneau-rest-server-utest/maven-metadata.xml
(401 B at 0.8 KB/sec)
Uploading: https://repository.apache.org/content/repositories/snapshots/org/apache/juneau/juneau-rest-server-utest/8.1.4-SNAPSHOT/juneau-rest-server-utest-8.1.4-20200618.150443-453-tests.jar
2/703 KB    4/703 KB   6/703 KB   8/703 KB   10/703 KB   12/703 KB   14/703 KB   16/703 KB
  18/703 KB   20/703 KB   22/703 KB   24/703 KB   26/703 KB   28/703 KB   30/703 KB   32/703
KB   34/703 KB   36/703 KB   38/703 KB   40/703 KB   42/703 KB   44/703 KB   46/703 KB   48/703
KB   50/703 KB   52/703 KB   54/703 KB   56/703 KB   58/703 KB   60/703 KB   62/703 KB   64/703
KB   66/703 KB   68/703 KB   70/703 KB   72/703 KB   74/703 KB   76/703 KB   78/703 KB   80/703
KB   82/703 KB   84/703 KB   86/703 KB   88/703 KB   90/703 KB   92/703 KB   94/703 KB   96/703
KB   98/703 KB   100/703 KB   102/703 KB   104/703 KB   106/703 KB   108/703 KB   110/703
KB   112/703 KB   114/703 KB   116/703 KB   118/703 KB   120/703 KB   122/703 KB   124/703
KB   126/703 KB   128/703 KB   130/703 KB   132/703 KB   134/703 KB   136/703 KB   138/703
KB   140/703 KB   142/703 KB   144/703 KB   146/703 KB   148/703 KB   150/703 KB   152/703
KB   154/703 KB   156/703 KB   158/703 KB   160/703 KB   162/703 KB   164/703 KB   166/703
KB   168/703 KB   170/703 KB   172/703 KB   174/703 KB   176/703 KB   178/703 KB   180/703
KB   182/703 KB   184/703 KB   186/703 KB   188/703 KB   190/703 KB   192/703 KB   194/703
KB   196/703 KB   198/703 KB   200/703 KB   202/703 KB   204/703 KB   206/703 KB   208/703
KB   210/703 KB   212/703 KB   214/703 KB   216/703 KB   218/703 KB   220/703 KB   222/703
KB   224/703 KB   226/703 KB   228/703 KB   230/703 KB   232/703 KB   234/703 KB   236/703
KB   238/703 KB   240/703 KB   242/703 KB   244/703 KB   246/703 KB   248/703 KB   250/703
KB   252/703 KB   254/703 KB   256/703 KB   258/703 KB   260/703 KB   262/703 KB   264/703
KB   266/703 KB   268/703 KB   270/703 KB   272/703 KB   274/703 KB   276/703 KB   278/703
KB   280/703 KB   282/703 KB   284/703 KB   286/703 KB   288/703 KB   290/703 KB   292/703
KB   294/703 KB   296/703 KB   298/703 KB   300/703 KB   302/703 KB   304/703 KB   306/703
KB   308/703 KB   310/703 KB   312/703 KB   314/703 KB   316/703 KB   318/703 KB   320/703
KB   322/703 KB   324/703 KB   326/703 KB   328/703 KB   330/703 KB   332/703 KB   334/703
KB   336/703 KB   338/703 KB   340/703 KB   342/703 KB   344/703 KB   346/703 KB   348/703
KB   350/703 KB   352/703 KB   354/703 KB   356/703 KB   358/703 KB   360/703 KB   362/703
KB   364/703 KB   366/703 KB   368/703 KB   370/703 KB   372/703 KB   374/703 KB   376/703
KB   378/703 KB   380/703 KB   382/703 KB   384/703 KB   386/703 KB   388/703 KB   390/703
KB   392/703 KB   394/703 KB   396/703 KB   398/703 KB   400/703 KB   402/703 KB   404/703
KB   406/703 KB   408/703 KB   410/703 KB   412/703 KB   414/703 KB   416/703 KB   418/703
KB   420/703 KB   422/703 KB   424/703 KB   426/703 KB   428/703 KB   430/703 KB   432/703
KB   434/703 KB   436/703 KB   438/703 KB   440/703 KB   442/703 KB   444/703 KB   446/703
KB   448/703 KB   450/703 KB   452/703 KB   454/703 KB   456/703 KB   458/703 KB   460/703
KB   462/703 KB   464/703 KB   466/703 KB   468/703 KB   470/703 KB   472/703 KB   474/703
KB   476/703 KB   478/703 KB   480/703 KB   482/703 KB   484/703 KB   486/703 KB   488/703
KB   490/703 KB   492/703 KB   494/703 KB   496/703 KB   498/703 KB   500/703 KB   502/703
KB   504/703 KB   506/703 KB   508/703 KB   510/703 KB   512/703 KB   514/703 KB   516/703
KB   518/703 KB   520/703 KB   522/703 KB   524/703 KB   526/703 KB   528/703 KB   530/703
KB   532/703 KB   534/703 KB   536/703 KB   538/703 KB   540/703 KB   542/703 KB   544/703
KB   546/703 KB   548/703 KB   550/703 KB   552/703 KB   554/703 KB   556/703 KB   558/703
KB   560/703 KB   562/703 KB   564/703 KB   566/703 KB   568/703 KB   570/703 KB   572/703
KB   574/703 KB   576/703 KB   578/703 KB   580/703 KB   582/703 KB   584/703 KB   586/703
KB   588/703 KB   590/703 KB   592/703 KB   594/703 KB   596/703 KB   598/703 KB   600/703
KB   602/703 KB   604/703 KB   606/703 KB   608/703 KB   610/703 KB   612/703 KB   614/703
KB   616/703 KB   618/703 KB   620/703 KB   622/703 KB   624/703 KB   626/703 KB   628/703
KB   630/703 KB   632/703 KB   634/703 KB   636/703 KB   638/703 KB   640/703 KB   642/703
KB   644/703 KB   646/703 KB   648/703 KB   650/703 KB   652/703 KB   654/703 KB   656/703
KB   658/703 KB   660/703 KB   662/703 KB   664/703 KB   666/703 KB   668/703 KB   670/703
KB   672/703 KB   674/703 KB   676/703 KB   678/703 KB   680/703 KB   682/703 KB   684/703
KB   686/703 KB   688/703 KB   690/703 KB   692/703 KB   694/703 KB   696/703 KB   698/703
KB   700/703 KB   702/703 KB   703/703 KB                Uploaded: https://repository.apache.org/content/repositories/snapshots/org/apache/juneau/juneau-rest-server-utest/8.1.4-SNAPSHOT/juneau-rest-server-utest-8.1.4-20200618.150443-453-tests.jar
(703 KB at 543.9 KB/sec)
Uploading: https://repository.apache.org/content/repositories/snapshots/org/apache/juneau/juneau-rest-server-utest/8.1.4-SNAPSHOT/maven-metadata.xml
2/2 KB                Uploaded: https://repository.apache.org/content/repositories/snapshots/org/apache/juneau/juneau-rest-server-utest/8.1.4-SNAPSHOT/maven-metadata.xml
(2 KB at 2.4 KB/sec)
Uploading: https://repository.apache.org/content/repositories/snapshots/org/apache/juneau/juneau-rest-server-utest/8.1.4-SNAPSHOT/juneau-rest-server-utest-8.1.4-20200618.150443-453-sources.jar
2/9 KB   4/9 KB   6/9 KB   8/9 KB   9/9 KB            Uploaded: https://repository.apache.org/content/repositories/snapshots/org/apache/juneau/juneau-rest-server-utest/8.1.4-SNAPSHOT/juneau-rest-server-utest-8.1.4-20200618.150443-453-sources.jar
(9 KB at 14.4 KB/sec)
Uploading: https://repository.apache.org/content/repositories/snapshots/org/apache/juneau/juneau-rest-server-utest/8.1.4-SNAPSHOT/maven-metadata.xml
2/2 KB            Uploaded: https://repository.apache.org/content/repositories/snapshots/org/apache/juneau/juneau-rest-server-utest/8.1.4-SNAPSHOT/maven-metadata.xml
(2 KB at 2.4 KB/sec)
Uploading: https://repository.apache.org/content/repositories/snapshots/org/apache/juneau/juneau-rest-server-utest/8.1.4-SNAPSHOT/juneau-rest-server-utest-8.1.4-20200618.150443-453-tests.jar
2/703 KB   4/703 KB   6/703 KB   8/703 KB   10/703 KB   12/703 KB   14/703 KB   16/703 KB
  18/703 KB   20/703 KB   22/703 KB   24/703 KB   26/703 KB   28/703 KB   30/703 KB   32/703
KB   34/703 KB   36/703 KB   38/703 KB   40/703 KB   42/703 KB   44/703 KB   46/703 KB   48/703
KB   50/703 KB   52/703 KB   54/703 KB   56/703 KB   58/703 KB   60/703 KB   62/703 KB   64/703
KB   66/703 KB   68/703 KB   70/703 KB   72/703 KB   74/703 KB   76/703 KB   78/703 KB   80/703
KB   82/703 KB   84/703 KB   86/703 KB   88/703 KB   90/703 KB   92/703 KB   94/703 KB   96/703
KB   98/703 KB   100/703 KB   102/703 KB   104/703 KB   106/703 KB   108/703 KB   110/703
KB   112/703 KB   114/703 KB   116/703 KB   118/703 KB   120/703 KB   122/703 KB   124/703
KB   126/703 KB   128/703 KB   130/703 KB   132/703 KB   134/703 KB   136/703 KB   138/703
KB   140/703 KB   142/703 KB   144/703 KB   146/703 KB   148/703 KB   150/703 KB   152/703
KB   154/703 KB   156/703 KB   158/703 KB   160/703 KB   162/703 KB   164/703 KB   166/703
KB   168/703 KB   170/703 KB   172/703 KB   174/703 KB   176/703 KB   178/703 KB   180/703
KB   182/703 KB   184/703 KB   186/703 KB   188/703 KB   190/703 KB   192/703 KB   194/703
KB   196/703 KB   198/703 KB   200/703 KB   202/703 KB   204/703 KB   206/703 KB   208/703
KB   210/703 KB   212/703 KB   214/703 KB   216/703 KB   218/703 KB   220/703 KB   222/703
KB   224/703 KB   226/703 KB   228/703 KB   230/703 KB   232/703 KB   234/703 KB   236/703
KB   238/703 KB   240/703 KB   242/703 KB   244/703 KB   246/703 KB   248/703 KB   250/703
KB   252/703 KB   254/703 KB   256/703 KB   258/703 KB   260/703 KB   262/703 KB   264/703
KB   266/703 KB   268/703 KB   270/703 KB   272/703 KB   274/703 KB   276/703 KB   278/703
KB   280/703 KB   282/703 KB   284/703 KB   286/703 KB   288/703 KB   290/703 KB   292/703
KB   294/703 KB   296/703 KB   298/703 KB   300/703 KB   302/703 KB   304/703 KB   306/703
KB   308/703 KB   310/703 KB   312/703 KB   314/703 KB   316/703 KB   318/703 KB   320/703
KB   322/703 KB   324/703 KB   326/703 KB   328/703 KB   330/703 KB   332/703 KB   334/703
KB   336/703 KB   338/703 KB   340/703 KB   342/703 KB   344/703 KB   346/703 KB   348/703
KB   350/703 KB   352/703 KB   354/703 KB   356/703 KB   358/703 KB   360/703 KB   362/703
KB   364/703 KB   366/703 KB   368/703 KB   370/703 KB   372/703 KB   374/703 KB   376/703
KB   378/703 KB   380/703 KB   382/703 KB   384/703 KB   386/703 KB   388/703 KB   390/703
KB   392/703 KB   394/703 KB   396/703 KB   398/703 KB   400/703 KB   402/703 KB   404/703
KB   406/703 KB   408/703 KB   410/703 KB   412/703 KB   414/703 KB   416/703 KB   418/703
KB   420/703 KB   422/703 KB   424/703 KB   426/703 KB   428/703 KB   430/703 KB   432/703
KB   434/703 KB   436/703 KB   438/703 KB   440/703 KB   442/703 KB   444/703 KB   446/703
KB   448/703 KB   450/703 KB   452/703 KB   454/703 KB   456/703 KB   458/703 KB   460/703
KB   462/703 KB   464/703 KB   466/703 KB   468/703 KB   470/703 KB   472/703 KB   474/703
KB   476/703 KB   478/703 KB   480/703 KB   482/703 KB   484/703 KB   486/703 KB   488/703
KB   490/703 KB   492/703 KB   494/703 KB   496/703 KB   498/703 KB   500/703 KB   502/703
KB   504/703 KB   506/703 KB   508/703 KB   510/703 KB   512/703 KB   514/703 KB   516/703
KB   518/703 KB   520/703 KB   522/703 KB   524/703 KB   526/703 KB   528/703 KB   530/703
KB   532/703 KB   534/703 KB   536/703 KB   538/703 KB   540/703 KB   542/703 KB   544/703
KB   546/703 KB   548/703 KB   550/703 KB   552/703 KB   554/703 KB   556/703 KB   558/703
KB   560/703 KB   562/703 KB   564/703 KB   566/703 KB   568/703 KB   570/703 KB   572/703
KB   574/703 KB   576/703 KB   578/703 KB   580/703 KB   582/703 KB   584/703 KB   586/703
KB   588/703 KB   590/703 KB   592/703 KB   594/703 KB   596/703 KB   598/703 KB   600/703
KB   602/703 KB   604/703 KB   606/703 KB   608/703 KB   610/703 KB   612/703 KB   614/703
KB   616/703 KB   618/703 KB   620/703 KB   622/703 KB   624/703 KB   626/703 KB   628/703
KB   630/703 KB   632/703 KB   634/703 KB   636/703 KB   638/703 KB   640/703 KB   642/703
KB   644/703 KB   646/703 KB   648/703 KB   650/703 KB   652/703 KB   654/703 KB   656/703
KB   658/703 KB   660/703 KB   662/703 KB   664/703 KB   666/703 KB   668/703 KB   670/703
KB   672/703 KB   674/703 KB   676/703 KB   678/703 KB   680/703 KB   682/703 KB   684/703
KB   686/703 KB   688/703 KB   690/703 KB   692/703 KB   694/703 KB   696/703 KB   698/703
KB   700/703 KB   702/703 KB   703/703 KB                Uploaded: https://repository.apache.org/content/repositories/snapshots/org/apache/juneau/juneau-rest-server-utest/8.1.4-SNAPSHOT/juneau-rest-server-utest-8.1.4-20200618.150443-453-tests.jar
(703 KB at 1057.4 KB/sec)
Uploading: https://repository.apache.org/content/repositories/snapshots/org/apache/juneau/juneau-rest-server-utest/8.1.4-SNAPSHOT/maven-metadata.xml
2/2 KB                Uploaded: https://repository.apache.org/content/repositories/snapshots/org/apache/juneau/juneau-rest-server-utest/8.1.4-SNAPSHOT/maven-metadata.xml
(2 KB at 2.4 KB/sec)
Uploading: https://repository.apache.org/content/repositories/snapshots/org/apache/juneau/juneau-rest-server-utest/8.1.4-SNAPSHOT/juneau-rest-server-utest-8.1.4-20200618.150443-453-sources.jar
2/9 KB   4/9 KB   6/9 KB   8/9 KB   9/9 KB            Uploaded: https://repository.apache.org/content/repositories/snapshots/org/apache/juneau/juneau-rest-server-utest/8.1.4-SNAPSHOT/juneau-rest-server-utest-8.1.4-20200618.150443-453-sources.jar
(9 KB at 16.2 KB/sec)
Uploading: https://repository.apache.org/content/repositories/snapshots/org/apache/juneau/juneau-rest-server-utest/8.1.4-SNAPSHOT/maven-metadata.xml
2/2 KB            Uploaded: https://repository.apache.org/content/repositories/snapshots/org/apache/juneau/juneau-rest-server-utest/8.1.4-SNAPSHOT/maven-metadata.xml
(2 KB at 2.4 KB/sec)
[INFO] 
[INFO] --- maven-bundle-plugin:3.2.0:deploy (default-deploy) @ juneau-rest-server-utest ---
[INFO] Remote OBR update disabled (enable with -DremoteOBR)
[INFO]                                                                         
[INFO] ------------------------------------------------------------------------
[INFO] Building juneau/rest/rest-client-utest 8.1.4-SNAPSHOT
[INFO] ------------------------------------------------------------------------
[INFO] 
[INFO] --- maven-clean-plugin:3.1.0:clean (default-clean) @ juneau-rest-client-utest ---
[INFO] Deleting <https://builds.apache.org/job/Juneau-Java-1.8/ws/juneau-rest/juneau-rest-client-utest/target>
[INFO] 
[INFO] --- maven-enforcer-plugin:1.4.1:enforce (enforce-maven-version) @ juneau-rest-client-utest
---
[INFO] 
[INFO] --- maven-enforcer-plugin:1.4.1:enforce (enforce-maven) @ juneau-rest-client-utest
---
[INFO] 
[INFO] --- jacoco-maven-plugin:0.8.2:prepare-agent (default-prepare-agent) @ juneau-rest-client-utest
---
[INFO] argLine set to -javaagent:/home/jenkins/.m2/repository/org/jacoco/org.jacoco.agent/0.8.2/org.jacoco.agent-0.8.2-runtime.jar=destfile=<https://builds.apache.org/job/Juneau-Java-1.8/ws/juneau-rest/juneau-rest-client-utest/target/jacoco.exec>
[INFO] 
[INFO] --- maven-remote-resources-plugin:1.5:process (process-resource-bundles) @ juneau-rest-client-utest
---
[INFO] 
[INFO] --- maven-resources-plugin:3.1.0:resources (default-resources) @ juneau-rest-client-utest
---
[INFO] Using 'UTF-8' encoding to copy filtered resources.
[INFO] skip non existing resourceDirectory <https://builds.apache.org/job/Juneau-Java-1.8/ws/juneau-rest/juneau-rest-client-utest/src/main/resources>
[INFO] Copying 3 resources
[INFO] 
[INFO] --- maven-compiler-plugin:3.7.0:compile (default-compile) @ juneau-rest-client-utest
---
[INFO] Nothing to compile - all classes are up to date
[INFO] 
[INFO] --- maven-resources-plugin:3.1.0:testResources (default-testResources) @ juneau-rest-client-utest
---
[INFO] Using 'UTF-8' encoding to copy filtered resources.
[INFO] skip non existing resourceDirectory <https://builds.apache.org/job/Juneau-Java-1.8/ws/juneau-rest/juneau-rest-client-utest/src/test/resources>
[INFO] Copying 3 resources
[INFO] 
[INFO] --- maven-compiler-plugin:3.7.0:testCompile (default-testCompile) @ juneau-rest-client-utest
---
[INFO] Changes detected - recompiling the module!
[INFO] Compiling 17 source files to <https://builds.apache.org/job/Juneau-Java-1.8/ws/juneau-rest/juneau-rest-client-utest/target/test-classes>
[INFO] 
[INFO] --- maven-surefire-plugin:2.22.0:test (default-test) @ juneau-rest-client-utest ---
[INFO] 
[INFO] -------------------------------------------------------
[INFO]  T E S T S
[INFO] -------------------------------------------------------
[INFO] Running org.apache.juneau.rest.client2.RemoteMethodAnnotationTest
[INFO] Tests run: 12, Failures: 0, Errors: 0, Skipped: 0, Time elapsed: 3.026 s - in org.apache.juneau.rest.client2.RemoteMethodAnnotationTest
[INFO] Running org.apache.juneau.rest.client2.PathAnnotationTest
[INFO] Tests run: 93, Failures: 0, Errors: 0, Skipped: 0, Time elapsed: 0.915 s - in org.apache.juneau.rest.client2.PathAnnotationTest
[INFO] Running org.apache.juneau.rest.client2.HeaderAnnotationTest
[INFO] Tests run: 106, Failures: 0, Errors: 0, Skipped: 0, Time elapsed: 0.604 s - in org.apache.juneau.rest.client2.HeaderAnnotationTest
[INFO] Running org.apache.juneau.rest.client2.ResponseAnnotationTest
[INFO] Tests run: 1, Failures: 0, Errors: 0, Skipped: 0, Time elapsed: 0.031 s - in org.apache.juneau.rest.client2.ResponseAnnotationTest
[INFO] Running org.apache.juneau.rest.client2.QueryAnnotationTest
[INFO] Tests run: 117, Failures: 0, Errors: 0, Skipped: 0, Time elapsed: 0.656 s - in org.apache.juneau.rest.client2.QueryAnnotationTest
[INFO] Running org.apache.juneau.rest.client2.ClientFuturesTest
[INFO] Tests run: 1, Failures: 0, Errors: 0, Skipped: 0, Time elapsed: 0.022 s - in org.apache.juneau.rest.client2.ClientFuturesTest
[INFO] Running org.apache.juneau.rest.client2.MarshallsTest
[INFO] Tests run: 10, Failures: 0, Errors: 0, Skipped: 0, Time elapsed: 1.034 s - in org.apache.juneau.rest.client2.MarshallsTest
[INFO] Running org.apache.juneau.rest.client2.RequestAnnotationTest
[INFO] Tests run: 10, Failures: 0, Errors: 0, Skipped: 0, Time elapsed: 0.152 s - in org.apache.juneau.rest.client2.RequestAnnotationTest
[INFO] Running org.apache.juneau.rest.client2.RequestBeanProxyTest
[INFO] Tests run: 52, Failures: 0, Errors: 0, Skipped: 0, Time elapsed: 0.515 s - in org.apache.juneau.rest.client2.RequestBeanProxyTest
[INFO] Running org.apache.juneau.rest.client2.FormDataTest
[INFO] Tests run: 3, Failures: 0, Errors: 0, Skipped: 0, Time elapsed: 0.024 s - in org.apache.juneau.rest.client2.FormDataTest
[INFO] Running org.apache.juneau.rest.client2.FormDataAnnotationTest
[INFO] Tests run: 117, Failures: 0, Errors: 0, Skipped: 0, Time elapsed: 0.481 s - in org.apache.juneau.rest.client2.FormDataAnnotationTest
[INFO] Running org.apache.juneau.rest.client2.BodyAnnotationTest
[INFO] Tests run: 29, Failures: 0, Errors: 0, Skipped: 0, Time elapsed: 0.21 s - in org.apache.juneau.rest.client2.BodyAnnotationTest
[INFO] Running org.apache.juneau.rest.client2.EndToEndInterfaceTest
[INFO] Tests run: 134, Failures: 0, Errors: 0, Skipped: 0, Time elapsed: 0.955 s - in org.apache.juneau.rest.client2.EndToEndInterfaceTest
[INFO] Running org.apache.juneau.rest.client2.RestClientTest
[ERROR] Tests run: 265, Failures: 0, Errors: 1, Skipped: 0, Time elapsed: 4.32 s <<<
FAILURE! - in org.apache.juneau.rest.client2.RestClientTest
[ERROR] g26_headers_range(org.apache.juneau.rest.client2.RestClientTest)  Time elapsed: 0.951
s  <<< ERROR!
org.apache.juneau.ContextRuntimeException: Could not create instance of class 'org.apache.juneau.rest.mock2.MockRestClient'
	at org.apache.juneau.rest.client2.RestClientTest.g26_headers_range(RestClientTest.java:2447)
Caused by: org.apache.juneau.BasicRuntimeException: Could not instantiate class org.apache.juneau.Context
	at org.apache.juneau.rest.client2.RestClientTest.g26_headers_range(RestClientTest.java:2447)
Caused by: org.apache.juneau.ExecutableException: org.apache.juneau.oapi.OpenApiSerializer:
Could not instantiate resource class ''{0}''
	at org.apache.juneau.rest.client2.RestClientTest.g26_headers_range(RestClientTest.java:2447)
Caused by: org.apache.juneau.BeanRuntimeException: org.apache.juneau.oapi.OpenApiSerializer:
Could not instantiate resource class ''{0}''
	at org.apache.juneau.rest.client2.RestClientTest.g26_headers_range(RestClientTest.java:2447)
Caused by: org.apache.juneau.BasicRuntimeException: Could not instantiate class org.apache.juneau.oapi.OpenApiSerializer
	at org.apache.juneau.rest.client2.RestClientTest.g26_headers_range(RestClientTest.java:2447)
Caused by: org.apache.juneau.ExecutableException: org.apache.juneau.serializer.SerializeException:
Could not call getValue() on property 'avgTime' of class 'org.apache.juneau.utils.MethodExecStats',
exception = org.apache.juneau.utils.MethodExecStats: Exception occurred while getting property
'avgTime'
	at org.apache.juneau.rest.client2.RestClientTest.g26_headers_range(RestClientTest.java:2447)
Caused by: java.lang.RuntimeException: org.apache.juneau.serializer.SerializeException: Could
not call getValue() on property 'avgTime' of class 'org.apache.juneau.utils.MethodExecStats',
exception = org.apache.juneau.utils.MethodExecStats: Exception occurred while getting property
'avgTime'
	at org.apache.juneau.rest.client2.RestClientTest.g26_headers_range(RestClientTest.java:2447)
Caused by: org.apache.juneau.serializer.SerializeException: Could not call getValue() on property
'avgTime' of class 'org.apache.juneau.utils.MethodExecStats', exception = org.apache.juneau.utils.MethodExecStats:
Exception occurred while getting property 'avgTime'
	at org.apache.juneau.rest.client2.RestClientTest.g26_headers_range(RestClientTest.java:2447)

[INFO] Running org.apache.juneau.rest.client2.RrpcInterfaceTest
SLF4J: Failed to load class "org.slf4j.impl.StaticLoggerBinder".
SLF4J: Defaulting to no-operation (NOP) logger implementation
SLF4J: See http://www.slf4j.org/codes.html#StaticLoggerBinder for further details.
[INFO] Tests run: 872, Failures: 0, Errors: 0, Skipped: 0, Time elapsed: 4.93 s - in org.apache.juneau.rest.client2.RrpcInterfaceTest
[INFO] Running org.apache.juneau.rest.client2.CallbackStringsTest
[INFO] Tests run: 2, Failures: 0, Errors: 0, Skipped: 0, Time elapsed: 0.001 s - in org.apache.juneau.rest.client2.CallbackStringsTest
[INFO] Running org.apache.juneau.rest.client2.RemotesTest
[INFO] Tests run: 29, Failures: 0, Errors: 0, Skipped: 0, Time elapsed: 0.356 s - in org.apache.juneau.rest.client2.RemotesTest
[INFO] 
[INFO] Results:
[INFO] 
[ERROR] Errors: 
[ERROR]   RestClientTest.g26_headers_range:2447 ยป ContextRuntime Could not create instan...
[INFO] 
[ERROR] Tests run: 1853, Failures: 0, Errors: 1, Skipped: 0
[INFO] 
[INFO]                                                                         
[INFO] ------------------------------------------------------------------------
[INFO] Skipping juneau
[INFO] This project has been banned from the build due to previous failures.
[INFO] ------------------------------------------------------------------------
[INFO] ------------------------------------------------------------------------
[INFO] Reactor Summary:
[INFO] 
[INFO] juneau ............................................. SUCCESS [  8.330 s]
[INFO] juneau/core ........................................ SUCCESS [  2.634 s]
[INFO] juneau/core/marshall ............................... SUCCESS [01:16 min]
[INFO] juneau/core/marshall-rdf ........................... SUCCESS [ 13.314 s]
[INFO] juneau/core/dto .................................... SUCCESS [ 14.570 s]
[INFO] juneau/core/config ................................. SUCCESS [  9.953 s]
[INFO] juneau/core/core-utest ............................. SUCCESS [01:08 min]
[INFO] juneau/rest ........................................ SUCCESS [  2.536 s]
[INFO] juneau/rest/rest-server ............................ SUCCESS [ 20.033 s]
[INFO] juneau/rest/rest-server-jaxrs ...................... SUCCESS [  7.405 s]
[INFO] juneau/rest/rest-server-rdf ........................ SUCCESS [ 13.525 s]
[INFO] juneau/rest/rest-server-springboot ................. SUCCESS [ 10.530 s]
[INFO] juneau/rest/rest-client ............................ SUCCESS [ 14.089 s]
[INFO] juneau/rest/rest-mock .............................. SUCCESS [  9.990 s]
[INFO] juneau/rest/rest-mock-utest ........................ SUCCESS [ 11.115 s]
[INFO] juneau/rest/rest-server-utest ...................... SUCCESS [ 38.871 s]
[INFO] juneau/rest/rest-client-utest ...................... FAILURE [ 22.707 s]
[INFO] juneau/microservice ................................ SKIPPED
[INFO] juneau/microservice/microservice-core .............. SKIPPED
[INFO] juneau/microservice/microservice-jetty ............. SKIPPED
[INFO] juneau/microservice/my-jetty-microservice .......... SKIPPED
[INFO] juneau/examples .................................... SKIPPED
[INFO] juneau/examples/rest ............................... SKIPPED
[INFO] juneau/microservice/microservice-ftest ............. SKIPPED
[INFO] juneau/microservice/my-springboot-microservice ..... SKIPPED
[INFO] juneau/sc .......................................... SKIPPED
[INFO] juneau/sc/sc-server ................................ SKIPPED
[INFO] juneau/sc/sc-client ................................ SKIPPED
[INFO] juneau/examples/examples-core ...................... SKIPPED
[INFO] juneau/examples/examples-rest-jetty ................ SKIPPED
[INFO] juneau/examples/examples-rest-springboot ........... SKIPPED
[INFO] juneau/examples/examples-rest-jetty-ftest .......... SKIPPED
[INFO] juneau/doc ......................................... SKIPPED
[INFO] juneau/releng ...................................... SKIPPED
[INFO] juneau/releng/all .................................. SKIPPED
[INFO] juneau/releng/distrib .............................. SKIPPED
[INFO] ------------------------------------------------------------------------
[INFO] BUILD FAILURE
[INFO] ------------------------------------------------------------------------
[INFO] Total time: 05:47 min
[INFO] Finished at: 2020-06-18T15:05:13+00:00
[INFO] Final Memory: 131M/4256M
[INFO] ------------------------------------------------------------------------
[ERROR] Failed to execute goal org.apache.maven.plugins:maven-surefire-plugin:2.22.0:test
(default-test) on project juneau-rest-client-utest: There are test failures.
[ERROR] 
[ERROR] Please refer to <https://builds.apache.org/job/Juneau-Java-1.8/ws/juneau-rest/juneau-rest-client-utest/target/surefire-reports>
for the individual test results.
[ERROR] Please refer to dump files (if any exist) [date]-jvmRun[N].dump, [date].dumpstream
and [date]-jvmRun[N].dumpstream.
[ERROR] -> [Help 1]
[ERROR] 
[ERROR] To see the full stack trace of the errors, re-run Maven with the -e switch.
[ERROR] Re-run Maven using the -X switch to enable full debug logging.
[ERROR] 
[ERROR] For more information about the errors and possible solutions, please read the following
articles:
[ERROR] [Help 1] http://cwiki.apache.org/confluence/display/MAVEN/MojoFailureException
[ERROR] 
[ERROR] After correcting the problems, you can resume the build with the command
[ERROR]   mvn <goals> -rf :juneau-rest-client-utest
Build step 'Invoke top-level Maven targets' marked build as failure
Recording test results
[TASKS] Skipping publisher since build result is FAILURE

Mime
View raw message