juneau-dev mailing list archives

Site index · List index
Message view « Date » · « Thread »
Top « Date » · « Thread »
From Apache Jenkins Server <jenk...@builds.apache.org>
Subject Build failed in Jenkins: Juneau-Java-1.8 #1655
Date Thu, 21 May 2020 19:25:39 GMT
See <https://builds.apache.org/job/Juneau-Java-1.8/1655/display/redirect?page=changes>

Changes:

[JamesBognar] Rename BEAN_pojoSwaps to BEAN_swaps


------------------------------------------
[...truncated 460.07 KB...]
[INFO] Running org.apache.juneau.rest.annotation2.ResponseAnnotationTest
[INFO] Tests run: 68, Failures: 0, Errors: 0, Skipped: 0, Time elapsed: 0.347 s - in org.apache.juneau.rest.annotation2.ResponseAnnotationTest
[INFO] Running org.apache.juneau.rest.annotation2.HasQueryAnnotationTest
[INFO] Tests run: 2, Failures: 0, Errors: 0, Skipped: 0, Time elapsed: 0.019 s - in org.apache.juneau.rest.annotation2.HasQueryAnnotationTest
[INFO] Running org.apache.juneau.rest.annotation2.RestResourceParsersTest
[INFO] Tests run: 5, Failures: 0, Errors: 0, Skipped: 0, Time elapsed: 0.029 s - in org.apache.juneau.rest.annotation2.RestResourceParsersTest
[INFO] Running org.apache.juneau.rest.annotation2.RestResourcePojoSwapsTest
[INFO] Tests run: 2, Failures: 0, Errors: 0, Skipped: 0, Time elapsed: 0.034 s - in org.apache.juneau.rest.annotation2.RestResourcePojoSwapsTest
[INFO] Running org.apache.juneau.rest.annotation2.HasFormDataAnnotationTest
[INFO] Tests run: 1, Failures: 0, Errors: 0, Skipped: 0, Time elapsed: 0.016 s - in org.apache.juneau.rest.annotation2.HasFormDataAnnotationTest
[INFO] Running org.apache.juneau.rest.annotation2.RestHookTest
[INFO] Tests run: 14, Failures: 0, Errors: 0, Skipped: 0, Time elapsed: 0.167 s - in org.apache.juneau.rest.annotation2.RestHookTest
[INFO] Running org.apache.juneau.rest.annotation2.RestMethodInheritTest
[INFO] Tests run: 13, Failures: 0, Errors: 0, Skipped: 0, Time elapsed: 0.103 s - in org.apache.juneau.rest.annotation2.RestMethodInheritTest
[INFO] Running org.apache.juneau.rest.annotation2.QueryAnnotationTest
[INFO] Tests run: 35, Failures: 0, Errors: 0, Skipped: 0, Time elapsed: 0.23 s - in org.apache.juneau.rest.annotation2.QueryAnnotationTest
[INFO] Running org.apache.juneau.rest.annotation2.RoleGuardTest
[INFO] Tests run: 75, Failures: 0, Errors: 0, Skipped: 0, Time elapsed: 0.462 s - in org.apache.juneau.rest.annotation2.RoleGuardTest
[INFO] Running org.apache.juneau.rest.annotation2.FormDataAnnotationTest
[INFO] Tests run: 31, Failures: 0, Errors: 0, Skipped: 0, Time elapsed: 0.174 s - in org.apache.juneau.rest.annotation2.FormDataAnnotationTest
[INFO] Running org.apache.juneau.rest.annotation2.BodyAnnotationTest
[INFO] Tests run: 108, Failures: 0, Errors: 0, Skipped: 0, Time elapsed: 0.614 s - in org.apache.juneau.rest.annotation2.BodyAnnotationTest
[INFO] Running org.apache.juneau.rest.annotation2.AnnotationInheritanceTest
[INFO] Tests run: 3, Failures: 0, Errors: 0, Skipped: 0, Time elapsed: 0.011 s - in org.apache.juneau.rest.annotation2.AnnotationInheritanceTest
[INFO] Running org.apache.juneau.rest.annotation2.PathRemainderAnnotationTest
[INFO] Tests run: 7, Failures: 0, Errors: 0, Skipped: 0, Time elapsed: 0.022 s - in org.apache.juneau.rest.annotation2.PathRemainderAnnotationTest
[INFO] Running org.apache.juneau.rest.NlsTest
[INFO] Tests run: 4, Failures: 0, Errors: 0, Skipped: 0, Time elapsed: 0.032 s - in org.apache.juneau.rest.NlsTest
[INFO] 
[INFO] Results:
[INFO] 
[WARNING] Tests run: 1779, Failures: 0, Errors: 0, Skipped: 1
[INFO] 
[INFO] 
[INFO] --- jacoco-maven-plugin:0.8.2:report (default-report) @ juneau-rest-server-utest ---
[INFO] Loading execution data file <https://builds.apache.org/job/Juneau-Java-1.8/ws/juneau-rest/juneau-rest-server-utest/target/jacoco.exec>
[INFO] Analyzed bundle 'juneau/rest/rest-server-utest' with 0 classes
[INFO] 
[INFO] --- maven-bundle-plugin:3.2.0:bundle (default-bundle) @ juneau-rest-server-utest ---
[INFO] 
[INFO] --- maven-site-plugin:3.7.1:attach-descriptor (attach-descriptor) @ juneau-rest-server-utest
---
[INFO] Skipping because packaging 'bundle' is not pom.
[INFO] 
[INFO] --- maven-jar-plugin:3.1.0:test-jar (default) @ juneau-rest-server-utest ---
[INFO] Building jar: <https://builds.apache.org/job/Juneau-Java-1.8/ws/juneau-rest/juneau-rest-server-utest/target/juneau-rest-server-utest-8.1.4-SNAPSHOT-tests.jar>
[INFO] 
[INFO] --- apache-rat-plugin:0.12:check (default) @ juneau-rest-server-utest ---
[INFO] Enabled default license matchers.
[INFO] Will parse SCM ignores for exclusions...
[INFO] Parsing exclusions from <https://builds.apache.org/job/Juneau-Java-1.8/ws/juneau-rest/juneau-rest-server-utest/.gitignore>
[INFO] Finished adding exclusions from SCM ignore files.
[INFO] 64 implicit excludes (use -debug for more details).
[INFO] Exclude: **/DEPENDENCIES
[INFO] Exclude: **/target/**
[INFO] Exclude: **/empty.txt
[INFO] Exclude: **/TODO.txt
[INFO] Exclude: **/.settings/**
[INFO] Exclude: **/.project
[INFO] Exclude: **/.classpath
[INFO] Exclude: **/*.launch
[INFO] Exclude: **/*.prefs
[INFO] Exclude: **/*.2
[INFO] Exclude: **/jetty.out.xml
[INFO] Exclude: **/derby.log
[INFO] Exclude: **/dependency-reduced-pom.xml
[INFO] Exclude: **/docs.txt
[INFO] Exclude: **/toc.txt
[INFO] Exclude: **/app.json
[INFO] Exclude: **/Procfile
[INFO] 86 resources included (use -debug for more details)
[INFO] Rat check: Summary over all files. Unapproved: 0, unknown: 0, generated: 0, approved:
86 licenses.
[INFO] 
[INFO] --- maven-source-plugin:3.0.1:jar-no-fork (attach-sources) @ juneau-rest-server-utest
---
[INFO] Building jar: <https://builds.apache.org/job/Juneau-Java-1.8/ws/juneau-rest/juneau-rest-server-utest/target/juneau-rest-server-utest-8.1.4-SNAPSHOT-sources.jar>
[INFO] 
[INFO] --- maven-install-plugin:2.5.2:install (default-install) @ juneau-rest-server-utest
---
[INFO] Installing <https://builds.apache.org/job/Juneau-Java-1.8/ws/juneau-rest/juneau-rest-server-utest/target/juneau-rest-server-utest-8.1.4-SNAPSHOT.jar>
to /home/jenkins/.m2/repository/org/apache/juneau/juneau-rest-server-utest/8.1.4-SNAPSHOT/juneau-rest-server-utest-8.1.4-SNAPSHOT.jar
[INFO] Installing <https://builds.apache.org/job/Juneau-Java-1.8/ws/juneau-rest/juneau-rest-server-utest/pom.xml>
to /home/jenkins/.m2/repository/org/apache/juneau/juneau-rest-server-utest/8.1.4-SNAPSHOT/juneau-rest-server-utest-8.1.4-SNAPSHOT.pom
[INFO] Installing <https://builds.apache.org/job/Juneau-Java-1.8/ws/juneau-rest/juneau-rest-server-utest/target/juneau-rest-server-utest-8.1.4-SNAPSHOT-tests.jar>
to /home/jenkins/.m2/repository/org/apache/juneau/juneau-rest-server-utest/8.1.4-SNAPSHOT/juneau-rest-server-utest-8.1.4-SNAPSHOT-tests.jar
[INFO] Installing <https://builds.apache.org/job/Juneau-Java-1.8/ws/juneau-rest/juneau-rest-server-utest/target/juneau-rest-server-utest-8.1.4-SNAPSHOT-sources.jar>
to /home/jenkins/.m2/repository/org/apache/juneau/juneau-rest-server-utest/8.1.4-SNAPSHOT/juneau-rest-server-utest-8.1.4-SNAPSHOT-sources.jar
[INFO] 
[INFO] --- maven-bundle-plugin:3.2.0:install (default-install) @ juneau-rest-server-utest
---
[INFO] Installing org/apache/juneau/juneau-rest-server-utest/8.1.4-SNAPSHOT/juneau-rest-server-utest-8.1.4-SNAPSHOT.jar
[INFO] Writing OBR metadata
[INFO] 
[INFO] --- maven-enforcer-plugin:1.4.1:enforce (enforce-maven-version) @ juneau-rest-server-utest
---
[INFO] 
[INFO] --- maven-enforcer-plugin:1.4.1:enforce (enforce-maven) @ juneau-rest-server-utest
---
[INFO] 
[INFO] --- jacoco-maven-plugin:0.8.2:prepare-agent (default-prepare-agent) @ juneau-rest-server-utest
---
[INFO] argLine set to -javaagent:/home/jenkins/.m2/repository/org/jacoco/org.jacoco.agent/0.8.2/org.jacoco.agent-0.8.2-runtime.jar=destfile=<https://builds.apache.org/job/Juneau-Java-1.8/ws/juneau-rest/juneau-rest-server-utest/target/jacoco.exec>
[INFO] 
[INFO] --- maven-remote-resources-plugin:1.5:process (process-resource-bundles) @ juneau-rest-server-utest
---
[INFO] 
[INFO] --- maven-resources-plugin:3.1.0:resources (default-resources) @ juneau-rest-server-utest
---
[INFO] Using 'UTF-8' encoding to copy filtered resources.
[INFO] skip non existing resourceDirectory <https://builds.apache.org/job/Juneau-Java-1.8/ws/juneau-rest/juneau-rest-server-utest/src/main/resources>
[INFO] Copying 3 resources
[INFO] Copying 3 resources
[INFO] 
[INFO] --- maven-compiler-plugin:3.7.0:compile (default-compile) @ juneau-rest-server-utest
---
[INFO] Nothing to compile - all classes are up to date
[INFO] 
[INFO] --- maven-resources-plugin:3.1.0:testResources (default-testResources) @ juneau-rest-server-utest
---
[INFO] Using 'UTF-8' encoding to copy filtered resources.
[INFO] Copying 11 resources
[INFO] Copying 3 resources
[INFO] Copying 3 resources
[INFO] 
[INFO] --- maven-compiler-plugin:3.7.0:testCompile (default-testCompile) @ juneau-rest-server-utest
---
[INFO] Nothing to compile - all classes are up to date
[INFO] 
[INFO] --- maven-surefire-plugin:2.22.0:test (default-test) @ juneau-rest-server-utest ---
[INFO] Skipping execution of surefire because it has already been run for this configuration
[INFO] 
[INFO] --- jacoco-maven-plugin:0.8.2:report (default-report) @ juneau-rest-server-utest ---
[INFO] Loading execution data file <https://builds.apache.org/job/Juneau-Java-1.8/ws/juneau-rest/juneau-rest-server-utest/target/jacoco.exec>
[INFO] Analyzed bundle 'juneau/rest/rest-server-utest' with 0 classes
[INFO] 
[INFO] --- maven-bundle-plugin:3.2.0:bundle (default-bundle) @ juneau-rest-server-utest ---
[INFO] 
[INFO] --- maven-site-plugin:3.7.1:attach-descriptor (attach-descriptor) @ juneau-rest-server-utest
---
[INFO] Skipping because packaging 'bundle' is not pom.
[INFO] 
[INFO] --- maven-jar-plugin:3.1.0:test-jar (default) @ juneau-rest-server-utest ---
[INFO] Building jar: <https://builds.apache.org/job/Juneau-Java-1.8/ws/juneau-rest/juneau-rest-server-utest/target/juneau-rest-server-utest-8.1.4-SNAPSHOT-tests.jar>
[INFO] 
[INFO] --- apache-rat-plugin:0.12:check (default) @ juneau-rest-server-utest ---
[INFO] Enabled default license matchers.
[INFO] Will parse SCM ignores for exclusions...
[INFO] Parsing exclusions from <https://builds.apache.org/job/Juneau-Java-1.8/ws/juneau-rest/juneau-rest-server-utest/.gitignore>
[INFO] Finished adding exclusions from SCM ignore files.
[INFO] 64 implicit excludes (use -debug for more details).
[INFO] Exclude: **/DEPENDENCIES
[INFO] Exclude: **/target/**
[INFO] Exclude: **/empty.txt
[INFO] Exclude: **/TODO.txt
[INFO] Exclude: **/.settings/**
[INFO] Exclude: **/.project
[INFO] Exclude: **/.classpath
[INFO] Exclude: **/*.launch
[INFO] Exclude: **/*.prefs
[INFO] Exclude: **/*.2
[INFO] Exclude: **/jetty.out.xml
[INFO] Exclude: **/derby.log
[INFO] Exclude: **/dependency-reduced-pom.xml
[INFO] Exclude: **/docs.txt
[INFO] Exclude: **/toc.txt
[INFO] Exclude: **/app.json
[INFO] Exclude: **/Procfile
[INFO] 86 resources included (use -debug for more details)
[INFO] Rat check: Summary over all files. Unapproved: 0, unknown: 0, generated: 0, approved:
86 licenses.
[INFO] 
[INFO] --- maven-source-plugin:3.0.1:jar-no-fork (attach-sources) @ juneau-rest-server-utest
---
[INFO] 
[INFO] --- maven-install-plugin:2.5.2:install (default-install) @ juneau-rest-server-utest
---
[INFO] Installing <https://builds.apache.org/job/Juneau-Java-1.8/ws/juneau-rest/juneau-rest-server-utest/target/juneau-rest-server-utest-8.1.4-SNAPSHOT.jar>
to /home/jenkins/.m2/repository/org/apache/juneau/juneau-rest-server-utest/8.1.4-SNAPSHOT/juneau-rest-server-utest-8.1.4-SNAPSHOT.jar
[INFO] Installing <https://builds.apache.org/job/Juneau-Java-1.8/ws/juneau-rest/juneau-rest-server-utest/pom.xml>
to /home/jenkins/.m2/repository/org/apache/juneau/juneau-rest-server-utest/8.1.4-SNAPSHOT/juneau-rest-server-utest-8.1.4-SNAPSHOT.pom
[INFO] Installing <https://builds.apache.org/job/Juneau-Java-1.8/ws/juneau-rest/juneau-rest-server-utest/target/juneau-rest-server-utest-8.1.4-SNAPSHOT-tests.jar>
to /home/jenkins/.m2/repository/org/apache/juneau/juneau-rest-server-utest/8.1.4-SNAPSHOT/juneau-rest-server-utest-8.1.4-SNAPSHOT-tests.jar
[INFO] Installing <https://builds.apache.org/job/Juneau-Java-1.8/ws/juneau-rest/juneau-rest-server-utest/target/juneau-rest-server-utest-8.1.4-SNAPSHOT-sources.jar>
to /home/jenkins/.m2/repository/org/apache/juneau/juneau-rest-server-utest/8.1.4-SNAPSHOT/juneau-rest-server-utest-8.1.4-SNAPSHOT-sources.jar
[INFO] Installing <https://builds.apache.org/job/Juneau-Java-1.8/ws/juneau-rest/juneau-rest-server-utest/target/juneau-rest-server-utest-8.1.4-SNAPSHOT-tests.jar>
to /home/jenkins/.m2/repository/org/apache/juneau/juneau-rest-server-utest/8.1.4-SNAPSHOT/juneau-rest-server-utest-8.1.4-SNAPSHOT-tests.jar
[INFO] Installing <https://builds.apache.org/job/Juneau-Java-1.8/ws/juneau-rest/juneau-rest-server-utest/target/juneau-rest-server-utest-8.1.4-SNAPSHOT-sources.jar>
to /home/jenkins/.m2/repository/org/apache/juneau/juneau-rest-server-utest/8.1.4-SNAPSHOT/juneau-rest-server-utest-8.1.4-SNAPSHOT-sources.jar
[INFO] 
[INFO] --- maven-bundle-plugin:3.2.0:install (default-install) @ juneau-rest-server-utest
---
[INFO] Installing org/apache/juneau/juneau-rest-server-utest/8.1.4-SNAPSHOT/juneau-rest-server-utest-8.1.4-SNAPSHOT.jar
[INFO] Writing OBR metadata
[INFO] 
[INFO] --- maven-deploy-plugin:2.8.2:deploy (default-deploy) @ juneau-rest-server-utest ---
Downloading: https://repository.apache.org/content/repositories/snapshots/org/apache/juneau/juneau-rest-server-utest/8.1.4-SNAPSHOT/maven-metadata.xml
2/2 KB            Downloaded: https://repository.apache.org/content/repositories/snapshots/org/apache/juneau/juneau-rest-server-utest/8.1.4-SNAPSHOT/maven-metadata.xml
(2 KB at 2.0 KB/sec)
Uploading: https://repository.apache.org/content/repositories/snapshots/org/apache/juneau/juneau-rest-server-utest/8.1.4-SNAPSHOT/juneau-rest-server-utest-8.1.4-20200521.192520-312.jar
2/9 KB   4/9 KB   6/9 KB   8/9 KB   9/9 KB            Uploaded: https://repository.apache.org/content/repositories/snapshots/org/apache/juneau/juneau-rest-server-utest/8.1.4-SNAPSHOT/juneau-rest-server-utest-8.1.4-20200521.192520-312.jar
(9 KB at 9.7 KB/sec)
Uploading: https://repository.apache.org/content/repositories/snapshots/org/apache/juneau/juneau-rest-server-utest/8.1.4-SNAPSHOT/juneau-rest-server-utest-8.1.4-20200521.192520-312.pom
2/6 KB   4/6 KB   6/6 KB            Uploaded: https://repository.apache.org/content/repositories/snapshots/org/apache/juneau/juneau-rest-server-utest/8.1.4-SNAPSHOT/juneau-rest-server-utest-8.1.4-20200521.192520-312.pom
(6 KB at 5.8 KB/sec)
Downloading: https://repository.apache.org/content/repositories/snapshots/org/apache/juneau/juneau-rest-server-utest/maven-metadata.xml
401/401 B               Downloaded: https://repository.apache.org/content/repositories/snapshots/org/apache/juneau/juneau-rest-server-utest/maven-metadata.xml
(401 B at 0.7 KB/sec)
Uploading: https://repository.apache.org/content/repositories/snapshots/org/apache/juneau/juneau-rest-server-utest/8.1.4-SNAPSHOT/maven-metadata.xml
2/2 KB               Uploaded: https://repository.apache.org/content/repositories/snapshots/org/apache/juneau/juneau-rest-server-utest/8.1.4-SNAPSHOT/maven-metadata.xml
(2 KB at 1.4 KB/sec)
Uploading: https://repository.apache.org/content/repositories/snapshots/org/apache/juneau/juneau-rest-server-utest/maven-metadata.xml
401/401 B               Uploaded: https://repository.apache.org/content/repositories/snapshots/org/apache/juneau/juneau-rest-server-utest/maven-metadata.xml
(401 B at 0.5 KB/sec)
Uploading: https://repository.apache.org/content/repositories/snapshots/org/apache/juneau/juneau-rest-server-utest/8.1.4-SNAPSHOT/juneau-rest-server-utest-8.1.4-20200521.192520-312-tests.jar
2/692 KB    4/692 KB   6/692 KB   8/692 KB   10/692 KB   12/692 KB   14/692 KB   16/692 KB
  18/692 KB   20/692 KB   22/692 KB   24/692 KB   26/692 KB   28/692 KB   30/692 KB   32/692
KB   34/692 KB   36/692 KB   38/692 KB   40/692 KB   42/692 KB   44/692 KB   46/692 KB   48/692
KB   50/692 KB   52/692 KB   54/692 KB   56/692 KB   58/692 KB   60/692 KB   62/692 KB   64/692
KB   66/692 KB   68/692 KB   70/692 KB   72/692 KB   74/692 KB   76/692 KB   78/692 KB   80/692
KB   82/692 KB   84/692 KB   86/692 KB   88/692 KB   90/692 KB   92/692 KB   94/692 KB   96/692
KB   98/692 KB   100/692 KB   102/692 KB   104/692 KB   106/692 KB   108/692 KB   110/692
KB   112/692 KB   114/692 KB   116/692 KB   118/692 KB   120/692 KB   122/692 KB   124/692
KB   126/692 KB   128/692 KB   130/692 KB   132/692 KB   134/692 KB   136/692 KB   138/692
KB   140/692 KB   142/692 KB   144/692 KB   146/692 KB   148/692 KB   150/692 KB   152/692
KB   154/692 KB   156/692 KB   158/692 KB   160/692 KB   162/692 KB   164/692 KB   166/692
KB   168/692 KB   170/692 KB   172/692 KB   174/692 KB   176/692 KB   178/692 KB   180/692
KB   182/692 KB   184/692 KB   186/692 KB   188/692 KB   190/692 KB   192/692 KB   194/692
KB   196/692 KB   198/692 KB   200/692 KB   202/692 KB   204/692 KB   206/692 KB   208/692
KB   210/692 KB   212/692 KB   214/692 KB   216/692 KB   218/692 KB   220/692 KB   222/692
KB   224/692 KB   226/692 KB   228/692 KB   230/692 KB   232/692 KB   234/692 KB   236/692
KB   238/692 KB   240/692 KB   242/692 KB   244/692 KB   246/692 KB   248/692 KB   250/692
KB   252/692 KB   254/692 KB   256/692 KB   258/692 KB   260/692 KB   262/692 KB   264/692
KB   266/692 KB   268/692 KB   270/692 KB   272/692 KB   274/692 KB   276/692 KB   278/692
KB   280/692 KB   282/692 KB   284/692 KB   286/692 KB   288/692 KB   290/692 KB   292/692
KB   294/692 KB   296/692 KB   298/692 KB   300/692 KB   302/692 KB   304/692 KB   306/692
KB   308/692 KB   310/692 KB   312/692 KB   314/692 KB   316/692 KB   318/692 KB   320/692
KB   322/692 KB   324/692 KB   326/692 KB   328/692 KB   330/692 KB   332/692 KB   334/692
KB   336/692 KB   338/692 KB   340/692 KB   342/692 KB   344/692 KB   346/692 KB   348/692
KB   350/692 KB   352/692 KB   354/692 KB   356/692 KB   358/692 KB   360/692 KB   362/692
KB   364/692 KB   366/692 KB   368/692 KB   370/692 KB   372/692 KB   374/692 KB   376/692
KB   378/692 KB   380/692 KB   382/692 KB   384/692 KB   386/692 KB   388/692 KB   390/692
KB   392/692 KB   394/692 KB   396/692 KB   398/692 KB   400/692 KB   402/692 KB   404/692
KB   406/692 KB   408/692 KB   410/692 KB   412/692 KB   414/692 KB   416/692 KB   418/692
KB   420/692 KB   422/692 KB   424/692 KB   426/692 KB   428/692 KB   430/692 KB   432/692
KB   434/692 KB   436/692 KB   438/692 KB   440/692 KB   442/692 KB   444/692 KB   446/692
KB   448/692 KB   450/692 KB   452/692 KB   454/692 KB   456/692 KB   458/692 KB   460/692
KB   462/692 KB   464/692 KB   466/692 KB   468/692 KB   470/692 KB   472/692 KB   474/692
KB   476/692 KB   478/692 KB   480/692 KB   482/692 KB   484/692 KB   486/692 KB   488/692
KB   490/692 KB   492/692 KB   494/692 KB   496/692 KB   498/692 KB   500/692 KB   502/692
KB   504/692 KB   506/692 KB   508/692 KB   510/692 KB   512/692 KB   514/692 KB   516/692
KB   518/692 KB   520/692 KB   522/692 KB   524/692 KB   526/692 KB   528/692 KB   530/692
KB   532/692 KB   534/692 KB   536/692 KB   538/692 KB   540/692 KB   542/692 KB   544/692
KB   546/692 KB   548/692 KB   550/692 KB   552/692 KB   554/692 KB   556/692 KB   558/692
KB   560/692 KB   562/692 KB   564/692 KB   566/692 KB   568/692 KB   570/692 KB   572/692
KB   574/692 KB   576/692 KB   578/692 KB   580/692 KB   582/692 KB   584/692 KB   586/692
KB   588/692 KB   590/692 KB   592/692 KB   594/692 KB   596/692 KB   598/692 KB   600/692
KB   602/692 KB   604/692 KB   606/692 KB   608/692 KB   610/692 KB   612/692 KB   614/692
KB   616/692 KB   618/692 KB   620/692 KB   622/692 KB   624/692 KB   626/692 KB   628/692
KB   630/692 KB   632/692 KB   634/692 KB   636/692 KB   638/692 KB   640/692 KB   642/692
KB   644/692 KB   646/692 KB   648/692 KB   650/692 KB   652/692 KB   654/692 KB   656/692
KB   658/692 KB   660/692 KB   662/692 KB   664/692 KB   666/692 KB   668/692 KB   670/692
KB   672/692 KB   674/692 KB   676/692 KB   678/692 KB   680/692 KB   682/692 KB   684/692
KB   686/692 KB   688/692 KB   690/692 KB   692/692 KB   [WARNING] Failed to upload checksum
org/apache/juneau/juneau-rest-server-utest/8.1.4-SNAPSHOT/juneau-rest-server-utest-8.1.4-20200521.192520-312-tests.jar.sha1:
Failed to transfer file: https://repository.apache.org/content/repositories/snapshots/org/apache/juneau/juneau-rest-server-utest/8.1.4-SNAPSHOT/juneau-rest-server-utest-8.1.4-20200521.192520-312-tests.jar.sha1.
Return code is: 502, ReasonPhrase: Proxy Error.
[WARNING] Failed to upload checksum org/apache/juneau/juneau-rest-server-utest/8.1.4-SNAPSHOT/juneau-rest-server-utest-8.1.4-20200521.192520-312-tests.jar.md5:
Failed to transfer file: https://repository.apache.org/content/repositories/snapshots/org/apache/juneau/juneau-rest-server-utest/8.1.4-SNAPSHOT/juneau-rest-server-utest-8.1.4-20200521.192520-312-tests.jar.md5.
Return code is: 503, ReasonPhrase: Service Unavailable.
             Uploaded: https://repository.apache.org/content/repositories/snapshots/org/apache/juneau/juneau-rest-server-utest/8.1.4-SNAPSHOT/juneau-rest-server-utest-8.1.4-20200521.192520-312-tests.jar
(692 KB at 375.7 KB/sec)
Uploading: https://repository.apache.org/content/repositories/snapshots/org/apache/juneau/juneau-rest-server-utest/8.1.4-SNAPSHOT/maven-metadata.xml
2/2 KB                [INFO]                                                             
           
[INFO] ------------------------------------------------------------------------
[INFO] Skipping juneau
[INFO] This project has been banned from the build due to previous failures.
[INFO] ------------------------------------------------------------------------
[INFO] ------------------------------------------------------------------------
[INFO] Reactor Summary:
[INFO] 
[INFO] juneau ............................................. SUCCESS [ 10.209 s]
[INFO] juneau/core ........................................ SUCCESS [  4.404 s]
[INFO] juneau/core/marshall ............................... SUCCESS [01:18 min]
[INFO] juneau/core/marshall-rdf ........................... SUCCESS [ 14.479 s]
[INFO] juneau/core/dto .................................... SUCCESS [ 19.891 s]
[INFO] juneau/core/config ................................. SUCCESS [ 12.095 s]
[INFO] juneau/core/core-utest ............................. SUCCESS [01:13 min]
[INFO] juneau/rest ........................................ SUCCESS [  4.288 s]
[INFO] juneau/rest/rest-server ............................ SUCCESS [ 26.706 s]
[INFO] juneau/rest/rest-server-jaxrs ...................... SUCCESS [ 10.266 s]
[INFO] juneau/rest/rest-server-rdf ........................ SUCCESS [ 15.744 s]
[INFO] juneau/rest/rest-server-springboot ................. SUCCESS [ 20.041 s]
[INFO] juneau/rest/rest-client ............................ SUCCESS [ 16.311 s]
[INFO] juneau/rest/rest-mock .............................. SUCCESS [ 12.755 s]
[INFO] juneau/rest/rest-mock-utest ........................ SUCCESS [ 14.614 s]
[INFO] juneau/rest/rest-server-utest ...................... FAILURE [ 35.529 s]
[INFO] juneau/rest/rest-client-utest ...................... SKIPPED
[INFO] juneau/microservice ................................ SKIPPED
[INFO] juneau/microservice/microservice-core .............. SKIPPED
[INFO] juneau/microservice/microservice-jetty ............. SKIPPED
[INFO] juneau/microservice/my-jetty-microservice .......... SKIPPED
[INFO] juneau/examples .................................... SKIPPED
[INFO] juneau/examples/rest ............................... SKIPPED
[INFO] juneau/microservice/microservice-ftest ............. SKIPPED
[INFO] juneau/microservice/my-springboot-microservice ..... SKIPPED
[INFO] juneau/sc .......................................... SKIPPED
[INFO] juneau/sc/sc-server ................................ SKIPPED
[INFO] juneau/sc/sc-client ................................ SKIPPED
[INFO] juneau/examples/examples-core ...................... SKIPPED
[INFO] juneau/examples/examples-rest-jetty ................ SKIPPED
[INFO] juneau/examples/examples-rest-springboot ........... SKIPPED
[INFO] juneau/examples/examples-rest-jetty-ftest .......... SKIPPED
[INFO] juneau/doc ......................................... SKIPPED
[INFO] juneau/releng ...................................... SKIPPED
[INFO] juneau/releng/all .................................. SKIPPED
[INFO] juneau/releng/distrib .............................. SKIPPED
[INFO] ------------------------------------------------------------------------
[INFO] BUILD FAILURE
[INFO] ------------------------------------------------------------------------
[INFO] Total time: 06:11 min
[INFO] Finished at: 2020-05-21T19:25:26+00:00
[INFO] Final Memory: 137M/5129M
[INFO] ------------------------------------------------------------------------
[ERROR] Failed to execute goal org.apache.maven.plugins:maven-deploy-plugin:2.8.2:deploy (default-deploy)
on project juneau-rest-server-utest: Failed to deploy metadata: Could not transfer metadata
org.apache.juneau:juneau-rest-server-utest:8.1.4-SNAPSHOT/maven-metadata.xml from/to apache.snapshots.https
(https://repository.apache.org/content/repositories/snapshots): Failed to transfer file: https://repository.apache.org/content/repositories/snapshots/org/apache/juneau/juneau-rest-server-utest/8.1.4-SNAPSHOT/maven-metadata.xml.
Return code is: 503, ReasonPhrase: Service Unavailable. -> [Help 1]
[ERROR] 
[ERROR] To see the full stack trace of the errors, re-run Maven with the -e switch.
[ERROR] Re-run Maven using the -X switch to enable full debug logging.
[ERROR] 
[ERROR] For more information about the errors and possible solutions, please read the following
articles:
[ERROR] [Help 1] http://cwiki.apache.org/confluence/display/MAVEN/MojoExecutionException
[ERROR] 
[ERROR] After correcting the problems, you can resume the build with the command
[ERROR]   mvn <goals> -rf :juneau-rest-server-utest
Build step 'Invoke top-level Maven targets' marked build as failure
Recording test results
[TASKS] Skipping publisher since build result is FAILURE

Mime
View raw message