juneau-dev mailing list archives

Site index · List index
Message view « Date » · « Thread »
Top « Date » · « Thread »
From Apache Jenkins Server <jenk...@builds.apache.org>
Subject Build failed in Jenkins: Juneau-Java-1.8 #1671
Date Mon, 25 May 2020 22:06:18 GMT
See <https://builds.apache.org/job/Juneau-Java-1.8/1671/display/redirect?page=changes>

Changes:

[JamesBognar] Improvements to fluent assertions on headers.


------------------------------------------
[...truncated 205.60 KB...]
[INFO] Running org.apache.juneau.PojoExamplesTest
[INFO] Tests run: 14, Failures: 0, Errors: 0, Skipped: 0, Time elapsed: 0.02 s - in org.apache.juneau.PojoExamplesTest
[INFO] Running org.apache.juneau.VisibilityTest
[INFO] Tests run: 1, Failures: 0, Errors: 0, Skipped: 0, Time elapsed: 0.053 s - in org.apache.juneau.VisibilityTest
[INFO] Running org.apache.juneau.ReadWriteOnlyPropertiesTest
[INFO] Tests run: 16, Failures: 0, Errors: 0, Skipped: 0, Time elapsed: 0.027 s - in org.apache.juneau.ReadWriteOnlyPropertiesTest
[INFO] Running org.apache.juneau.PojoSwapTest
[INFO] Tests run: 1, Failures: 0, Errors: 0, Skipped: 0, Time elapsed: 0.004 s - in org.apache.juneau.PojoSwapTest
[INFO] Running org.apache.juneau.reflection.AnnotationInfoTest
[INFO] Tests run: 2, Failures: 0, Errors: 0, Skipped: 0, Time elapsed: 0.002 s - in org.apache.juneau.reflection.AnnotationInfoTest
[INFO] Running org.apache.juneau.reflection.FieldInfoTest
[INFO] Tests run: 28, Failures: 0, Errors: 0, Skipped: 0, Time elapsed: 0.006 s - in org.apache.juneau.reflection.FieldInfoTest
[INFO] Running org.apache.juneau.reflection.ExecutableInfoTest
[INFO] Tests run: 53, Failures: 0, Errors: 0, Skipped: 0, Time elapsed: 0.012 s - in org.apache.juneau.reflection.ExecutableInfoTest
[INFO] Running org.apache.juneau.reflection.ConstructorInfoTest
[INFO] Tests run: 7, Failures: 0, Errors: 0, Skipped: 0, Time elapsed: 0.001 s - in org.apache.juneau.reflection.ConstructorInfoTest
[INFO] Running org.apache.juneau.reflection.ParamInfoTest
[INFO] Tests run: 33, Failures: 0, Errors: 0, Skipped: 0, Time elapsed: 0.018 s - in org.apache.juneau.reflection.ParamInfoTest
[INFO] Running org.apache.juneau.reflection.ClassInfoTest
[INFO] Tests run: 252, Failures: 0, Errors: 0, Skipped: 0, Time elapsed: 0.074 s - in org.apache.juneau.reflection.ClassInfoTest
[INFO] Running org.apache.juneau.reflection.MethodInfoTest
[INFO] Tests run: 21, Failures: 0, Errors: 0, Skipped: 0, Time elapsed: 0.01 s - in org.apache.juneau.reflection.MethodInfoTest
[INFO] Running org.apache.juneau.utils.MutatersTest
[INFO] Tests run: 13, Failures: 0, Errors: 0, Skipped: 0, Time elapsed: 0.005 s - in org.apache.juneau.utils.MutatersTest
[INFO] Running org.apache.juneau.utils.SimpleMapTest
[INFO] Tests run: 1, Failures: 0, Errors: 0, Skipped: 0, Time elapsed: 0.004 s - in org.apache.juneau.utils.SimpleMapTest
[INFO] Running org.apache.juneau.utils.BeanDiffTest
[INFO] Tests run: 11, Failures: 0, Errors: 0, Skipped: 0, Time elapsed: 0.005 s - in org.apache.juneau.utils.BeanDiffTest
[INFO] Running org.apache.juneau.utils.ParserReaderTest
[INFO] Tests run: 1, Failures: 0, Errors: 0, Skipped: 0, Time elapsed: 0 s - in org.apache.juneau.utils.ParserReaderTest
[INFO] Running org.apache.juneau.utils.ArgsTest
[INFO] Tests run: 1, Failures: 0, Errors: 0, Skipped: 0, Time elapsed: 0 s - in org.apache.juneau.utils.ArgsTest
[INFO] Running org.apache.juneau.utils.HttpUtilsTest
[INFO] Tests run: 8, Failures: 0, Errors: 0, Skipped: 0, Time elapsed: 0 s - in org.apache.juneau.utils.HttpUtilsTest
[INFO] Running org.apache.juneau.utils.ClassUtilsTest
[INFO] Tests run: 1, Failures: 0, Errors: 0, Skipped: 0, Time elapsed: 0 s - in org.apache.juneau.utils.ClassUtilsTest
[INFO] Running org.apache.juneau.utils.PojoQueryTest
[INFO] Tests run: 5, Failures: 0, Errors: 0, Skipped: 0, Time elapsed: 0.036 s - in org.apache.juneau.utils.PojoQueryTest
[INFO] Running org.apache.juneau.utils.StringExpressionMatcherTest
[INFO] Tests run: 131, Failures: 0, Errors: 0, Skipped: 0, Time elapsed: 0.025 s - in org.apache.juneau.utils.StringExpressionMatcherTest
[INFO] Running org.apache.juneau.utils.ByteArrayInOutStreamTest
[INFO] Tests run: 1, Failures: 0, Errors: 0, Skipped: 0, Time elapsed: 0 s - in org.apache.juneau.utils.ByteArrayInOutStreamTest
[INFO] Running org.apache.juneau.utils.PojoIntrospectorTest
[INFO] Tests run: 1, Failures: 0, Errors: 0, Skipped: 0, Time elapsed: 0 s - in org.apache.juneau.utils.PojoIntrospectorTest
[INFO] Running org.apache.juneau.utils.KeywordStoreTest
[INFO] Tests run: 1, Failures: 0, Errors: 0, Skipped: 0, Time elapsed: 0 s - in org.apache.juneau.utils.KeywordStoreTest
[INFO] Running org.apache.juneau.utils.WeightedAverageTest
[INFO] Tests run: 4, Failures: 0, Errors: 0, Skipped: 0, Time elapsed: 0 s - in org.apache.juneau.utils.WeightedAverageTest
[INFO] Running org.apache.juneau.utils.ArrayUtilsTest
[INFO] Tests run: 9, Failures: 0, Errors: 0, Skipped: 0, Time elapsed: 0 s - in org.apache.juneau.utils.ArrayUtilsTest
[INFO] Running org.apache.juneau.utils.CharSetTest
[INFO] Tests run: 1, Failures: 0, Errors: 0, Skipped: 0, Time elapsed: 0 s - in org.apache.juneau.utils.CharSetTest
[INFO] Running org.apache.juneau.utils.IOPipeTest
[INFO] Tests run: 5, Failures: 0, Errors: 0, Skipped: 0, Time elapsed: 0.001 s - in org.apache.juneau.utils.IOPipeTest
[INFO] Running org.apache.juneau.utils.MethodInvokerTest
[INFO] Tests run: 4, Failures: 0, Errors: 0, Skipped: 0, Time elapsed: 0.01 s - in org.apache.juneau.utils.MethodInvokerTest
[INFO] Running org.apache.juneau.utils.ReflectionMapTest
[INFO] Tests run: 14, Failures: 0, Errors: 0, Skipped: 0, Time elapsed: 0.006 s - in org.apache.juneau.utils.ReflectionMapTest
[INFO] Running org.apache.juneau.utils.MultiSetTest
[INFO] Tests run: 1, Failures: 0, Errors: 0, Skipped: 0, Time elapsed: 0.002 s - in org.apache.juneau.utils.MultiSetTest
[INFO] Running org.apache.juneau.utils.PojoMergeTest
[INFO] Tests run: 1, Failures: 0, Errors: 0, Skipped: 0, Time elapsed: 0.002 s - in org.apache.juneau.utils.PojoMergeTest
[INFO] Running org.apache.juneau.utils.StringUtilsTest
[INFO] Tests run: 36, Failures: 0, Errors: 0, Skipped: 0, Time elapsed: 0.011 s - in org.apache.juneau.utils.StringUtilsTest
[INFO] Running org.apache.juneau.utils.IOUtilsTest
[INFO] Tests run: 2, Failures: 0, Errors: 0, Skipped: 0, Time elapsed: 0.002 s - in org.apache.juneau.utils.IOUtilsTest
[INFO] Running org.apache.juneau.utils.UriContextUriComboTest
[INFO] Tests run: 70, Failures: 0, Errors: 0, Skipped: 0, Time elapsed: 0.005 s - in org.apache.juneau.utils.UriContextUriComboTest
[INFO] Running org.apache.juneau.utils.StringVarResolverTest
[INFO] Tests run: 7, Failures: 0, Errors: 0, Skipped: 0, Time elapsed: 0.005 s - in org.apache.juneau.utils.StringVarResolverTest
[INFO] Running org.apache.juneau.utils.PojoRestTest
[INFO] Tests run: 10, Failures: 0, Errors: 0, Skipped: 0, Time elapsed: 0.036 s - in org.apache.juneau.utils.PojoRestTest
[INFO] Running org.apache.juneau.utils.UriContextResolutionComboTest
[INFO] Tests run: 720, Failures: 0, Errors: 0, Skipped: 0, Time elapsed: 0.062 s - in org.apache.juneau.utils.UriContextResolutionComboTest
[INFO] Running org.apache.juneau.utils.CollectionUtilsTest
[INFO] Tests run: 4, Failures: 0, Errors: 0, Skipped: 0, Time elapsed: 0 s - in org.apache.juneau.utils.CollectionUtilsTest
[INFO] Running org.apache.juneau.utils.StackTraceDatabaseTest
[INFO] Tests run: 9, Failures: 0, Errors: 0, Skipped: 0, Time elapsed: 0 s - in org.apache.juneau.utils.StackTraceDatabaseTest
[INFO] Running org.apache.juneau.utils.StringBuilderWriterTest
[INFO] Tests run: 1, Failures: 0, Errors: 0, Skipped: 0, Time elapsed: 0 s - in org.apache.juneau.utils.StringBuilderWriterTest
[INFO] Running org.apache.juneau.utils.MultiIterableTest
[INFO] Tests run: 1, Failures: 0, Errors: 0, Skipped: 0, Time elapsed: 0.001 s - in org.apache.juneau.utils.MultiIterableTest
[INFO] Running org.apache.juneau.utils.FilteredMapTest
[INFO] Tests run: 1, Failures: 0, Errors: 0, Skipped: 0, Time elapsed: 0 s - in org.apache.juneau.utils.FilteredMapTest
[INFO] Running org.apache.juneau.JacocoDummyTest
[INFO] Tests run: 1, Failures: 0, Errors: 0, Skipped: 0, Time elapsed: 0 s - in org.apache.juneau.JacocoDummyTest
[INFO] Running org.apache.juneau.PropertyNamerTest
[INFO] Tests run: 2, Failures: 0, Errors: 0, Skipped: 0, Time elapsed: 0 s - in org.apache.juneau.PropertyNamerTest
[INFO] Running org.apache.juneau.ClassMetaTest
[INFO] Tests run: 7, Failures: 0, Errors: 0, Skipped: 0, Time elapsed: 0.015 s - in org.apache.juneau.ClassMetaTest
[INFO] Running org.apache.juneau.urlencoding.CommonParser_UrlEncodingTest
[INFO] Tests run: 5, Failures: 0, Errors: 0, Skipped: 0, Time elapsed: 0.016 s - in org.apache.juneau.urlencoding.CommonParser_UrlEncodingTest
[INFO] Running org.apache.juneau.urlencoding.Common_UrlEncodingTest
[INFO] Tests run: 8, Failures: 0, Errors: 0, Skipped: 0, Time elapsed: 0.019 s - in org.apache.juneau.urlencoding.Common_UrlEncodingTest
[INFO] Running org.apache.juneau.urlencoding.UrlEncodingConfigAnnotationTest
[INFO] Tests run: 6, Failures: 0, Errors: 0, Skipped: 0, Time elapsed: 0.004 s - in org.apache.juneau.urlencoding.UrlEncodingConfigAnnotationTest
[INFO] Running org.apache.juneau.urlencoding.UrlEncodingSerializerTest
[INFO] Tests run: 8, Failures: 0, Errors: 0, Skipped: 0, Time elapsed: 0.029 s - in org.apache.juneau.urlencoding.UrlEncodingSerializerTest
[INFO] Running org.apache.juneau.urlencoding.UrlEncodingParserTest
[INFO] Tests run: 11, Failures: 0, Errors: 0, Skipped: 0, Time elapsed: 0.025 s - in org.apache.juneau.urlencoding.UrlEncodingParserTest
[INFO] Running org.apache.juneau.BeanTraversePropertiesComboTest
[INFO] Tests run: 260, Failures: 0, Errors: 0, Skipped: 0, Time elapsed: 0.196 s - in org.apache.juneau.BeanTraversePropertiesComboTest
[INFO] Running org.apache.juneau.BeanMapTest
org.apache.juneau.collections.OMap
[INFO] Tests run: 41, Failures: 0, Errors: 0, Skipped: 0, Time elapsed: 0.095 s - in org.apache.juneau.BeanMapTest
[INFO] Running org.apache.juneau.jena.RdfConfigAnnotationTest
[INFO] Tests run: 6, Failures: 0, Errors: 0, Skipped: 0, Time elapsed: 0.01 s - in org.apache.juneau.jena.RdfConfigAnnotationTest
[INFO] Running org.apache.juneau.jena.CommonParserTest
[INFO] Tests run: 4, Failures: 0, Errors: 0, Skipped: 0, Time elapsed: 0.018 s - in org.apache.juneau.jena.CommonParserTest
[INFO] Running org.apache.juneau.jena.CommonTest
[INFO] Tests run: 8, Failures: 0, Errors: 0, Skipped: 0, Time elapsed: 0.038 s - in org.apache.juneau.jena.CommonTest
[INFO] Running org.apache.juneau.jena.RdfTest
[INFO] Tests run: 4, Failures: 0, Errors: 0, Skipped: 0, Time elapsed: 0.067 s - in org.apache.juneau.jena.RdfTest
[INFO] Running org.apache.juneau.jena.RdfParserTest
[INFO] Tests run: 1, Failures: 0, Errors: 0, Skipped: 0, Time elapsed: 0.01 s - in org.apache.juneau.jena.RdfParserTest
[INFO] Running org.apache.juneau.jena.CommonXmlTest
[INFO] Tests run: 2, Failures: 0, Errors: 0, Skipped: 0, Time elapsed: 0.005 s - in org.apache.juneau.jena.CommonXmlTest
[INFO] 
[INFO] Results:
[INFO] 
[WARNING] Tests run: 23782, Failures: 0, Errors: 0, Skipped: 2
[INFO] 
[INFO] 
[INFO] --- jacoco-maven-plugin:0.8.2:report (default-report) @ juneau-core-utest ---
[INFO] Loading execution data file <https://builds.apache.org/job/Juneau-Java-1.8/ws/juneau-core/juneau-core-utest/target/jacoco.exec>
[INFO] Analyzed bundle 'juneau/core/core-utest' with 0 classes
[INFO] 
[INFO] --- maven-bundle-plugin:3.2.0:bundle (default-bundle) @ juneau-core-utest ---
[INFO] 
[INFO] --- maven-site-plugin:3.7.1:attach-descriptor (attach-descriptor) @ juneau-core-utest
---
[INFO] Skipping because packaging 'bundle' is not pom.
[INFO] 
[INFO] --- maven-jar-plugin:3.1.0:test-jar (default) @ juneau-core-utest ---
[INFO] Building jar: <https://builds.apache.org/job/Juneau-Java-1.8/ws/juneau-core/juneau-core-utest/target/juneau-core-utest-8.1.4-SNAPSHOT-tests.jar>
[INFO] 
[INFO] --- apache-rat-plugin:0.12:check (default) @ juneau-core-utest ---
[INFO] Enabled default license matchers.
[INFO] Will parse SCM ignores for exclusions...
[INFO] Parsing exclusions from <https://builds.apache.org/job/Juneau-Java-1.8/ws/juneau-core/juneau-core-utest/.gitignore>
[INFO] Finished adding exclusions from SCM ignore files.
[INFO] 64 implicit excludes (use -debug for more details).
[INFO] Exclude: **/DEPENDENCIES
[INFO] Exclude: **/target/**
[INFO] Exclude: **/empty.txt
[INFO] Exclude: **/TODO.txt
[INFO] Exclude: **/.settings/**
[INFO] Exclude: **/.project
[INFO] Exclude: **/.classpath
[INFO] Exclude: **/*.launch
[INFO] Exclude: **/*.prefs
[INFO] Exclude: **/*.2
[INFO] Exclude: **/jetty.out.xml
[INFO] Exclude: **/derby.log
[INFO] Exclude: **/dependency-reduced-pom.xml
[INFO] Exclude: **/docs.txt
[INFO] Exclude: **/toc.txt
[INFO] Exclude: **/app.json
[INFO] Exclude: **/Procfile
[INFO] 310 resources included (use -debug for more details)
[INFO] Rat check: Summary over all files. Unapproved: 1, unknown: 1, generated: 0, approved:
309 licenses.
[INFO] Enabled default license matchers.
[INFO] Will parse SCM ignores for exclusions...
[INFO] Parsing exclusions from <https://builds.apache.org/job/Juneau-Java-1.8/ws/juneau-core/juneau-core-utest/.gitignore>
[INFO] Finished adding exclusions from SCM ignore files.
[INFO] 64 implicit excludes (use -debug for more details).
[INFO] Exclude: **/DEPENDENCIES
[INFO] Exclude: **/target/**
[INFO] Exclude: **/empty.txt
[INFO] Exclude: **/TODO.txt
[INFO] Exclude: **/.settings/**
[INFO] Exclude: **/.project
[INFO] Exclude: **/.classpath
[INFO] Exclude: **/*.launch
[INFO] Exclude: **/*.prefs
[INFO] Exclude: **/*.2
[INFO] Exclude: **/jetty.out.xml
[INFO] Exclude: **/derby.log
[INFO] Exclude: **/dependency-reduced-pom.xml
[INFO] Exclude: **/docs.txt
[INFO] Exclude: **/toc.txt
[INFO] Exclude: **/app.json
[INFO] Exclude: **/Procfile
[INFO] 310 resources included (use -debug for more details)
[WARNING] Files with unapproved licenses:
  <https://builds.apache.org/job/Juneau-Java-1.8/ws/juneau-core/juneau-core-utest/config/Y.cfg>
[INFO]                                                                         
[INFO] ------------------------------------------------------------------------
[INFO] Skipping juneau
[INFO] This project has been banned from the build due to previous failures.
[INFO] ------------------------------------------------------------------------
[INFO] ------------------------------------------------------------------------
[INFO] Reactor Summary:
[INFO] 
[INFO] juneau ............................................. SUCCESS [  7.046 s]
[INFO] juneau/core ........................................ SUCCESS [  2.539 s]
[INFO] juneau/core/marshall ............................... SUCCESS [ 43.230 s]
[INFO] juneau/core/marshall-rdf ........................... SUCCESS [  8.796 s]
[INFO] juneau/core/dto .................................... SUCCESS [ 10.660 s]
[INFO] juneau/core/config ................................. SUCCESS [  8.148 s]
[INFO] juneau/core/core-utest ............................. FAILURE [ 36.634 s]
[INFO] juneau/rest ........................................ SKIPPED
[INFO] juneau/rest/rest-server ............................ SKIPPED
[INFO] juneau/rest/rest-server-jaxrs ...................... SKIPPED
[INFO] juneau/rest/rest-server-rdf ........................ SKIPPED
[INFO] juneau/rest/rest-server-springboot ................. SKIPPED
[INFO] juneau/rest/rest-client ............................ SKIPPED
[INFO] juneau/rest/rest-mock .............................. SKIPPED
[INFO] juneau/rest/rest-mock-utest ........................ SKIPPED
[INFO] juneau/rest/rest-server-utest ...................... SKIPPED
[INFO] juneau/rest/rest-client-utest ...................... SKIPPED
[INFO] juneau/microservice ................................ SKIPPED
[INFO] juneau/microservice/microservice-core .............. SKIPPED
[INFO] juneau/microservice/microservice-jetty ............. SKIPPED
[INFO] juneau/microservice/my-jetty-microservice .......... SKIPPED
[INFO] juneau/examples .................................... SKIPPED
[INFO] juneau/examples/rest ............................... SKIPPED
[INFO] juneau/microservice/microservice-ftest ............. SKIPPED
[INFO] juneau/microservice/my-springboot-microservice ..... SKIPPED
[INFO] juneau/sc .......................................... SKIPPED
[INFO] juneau/sc/sc-server ................................ SKIPPED
[INFO] juneau/sc/sc-client ................................ SKIPPED
[INFO] juneau/examples/examples-core ...................... SKIPPED
[INFO] juneau/examples/examples-rest-jetty ................ SKIPPED
[INFO] juneau/examples/examples-rest-springboot ........... SKIPPED
[INFO] juneau/examples/examples-rest-jetty-ftest .......... SKIPPED
[INFO] juneau/doc ......................................... SKIPPED
[INFO] juneau/releng ...................................... SKIPPED
[INFO] juneau/releng/all .................................. SKIPPED
[INFO] juneau/releng/distrib .............................. SKIPPED
[INFO] ------------------------------------------------------------------------
[INFO] BUILD FAILURE
[INFO] ------------------------------------------------------------------------
[INFO] Total time: 01:58 min
[INFO] Finished at: 2020-05-25T22:06:12+00:00
[INFO] Final Memory: 107M/3918M
[INFO] ------------------------------------------------------------------------
[ERROR] Failed to execute goal org.apache.rat:apache-rat-plugin:0.12:check (default) on project
juneau-core-utest: Too many files with unapproved license: 1 See RAT report in: <https://builds.apache.org/job/Juneau-Java-1.8/ws/juneau-core/juneau-core-utest/target/rat.txt>
-> [Help 1]
[ERROR] 
[ERROR] To see the full stack trace of the errors, re-run Maven with the -e switch.
[ERROR] Re-run Maven using the -X switch to enable full debug logging.
[ERROR] 
[ERROR] For more information about the errors and possible solutions, please read the following
articles:
[ERROR] [Help 1] http://cwiki.apache.org/confluence/display/MAVEN/MojoFailureException
[ERROR] 
[ERROR] After correcting the problems, you can resume the build with the command
[ERROR]   mvn <goals> -rf :juneau-core-utest
Build step 'Invoke top-level Maven targets' marked build as failure
Recording test results
[TASKS] Skipping publisher since build result is FAILURE

Mime
View raw message