juneau-dev mailing list archives

Site index · List index
Message view « Date » · « Thread »
Top « Date » · « Thread »
From Apache Jenkins Server <jenk...@builds.apache.org>
Subject Build failed in Jenkins: Juneau-Java-1.8 #1673
Date Mon, 25 May 2020 23:12:26 GMT
See <https://builds.apache.org/job/Juneau-Java-1.8/1673/display/redirect?page=changes>

Changes:

[JamesBognar] Tests.


------------------------------------------
[...truncated 204.96 KB...]
[INFO] Tests run: 126, Failures: 0, Errors: 0, Skipped: 0, Time elapsed: 0.191 s - in org.apache.juneau.a.rttests.RoundTripMapsTest
[INFO] Running org.apache.juneau.a.rttests.RoundTripOptionalObjectsTest
[INFO] Tests run: 609, Failures: 0, Errors: 0, Skipped: 0, Time elapsed: 0.432 s - in org.apache.juneau.a.rttests.RoundTripOptionalObjectsTest
[INFO] Running org.apache.juneau.a.rttests.RoundTripBeanMapsTest
[INFO] Tests run: 525, Failures: 0, Errors: 0, Skipped: 0, Time elapsed: 2.514 s - in org.apache.juneau.a.rttests.RoundTripBeanMapsTest
[INFO] Running org.apache.juneau.a.rttests.RoundTripTrimStringsTest
[INFO] Tests run: 21, Failures: 0, Errors: 0, Skipped: 0, Time elapsed: 0.127 s - in org.apache.juneau.a.rttests.RoundTripTrimStringsTest
[INFO] Running org.apache.juneau.a.rttests.RoundTripLargeObjectsTest
[WARNING] Tests run: 1, Failures: 0, Errors: 0, Skipped: 1, Time elapsed: 0 s - in org.apache.juneau.a.rttests.RoundTripLargeObjectsTest
[INFO] Running org.apache.juneau.a.rttests.RoundTripPrimitivesBeansTest
[INFO] Tests run: 42, Failures: 0, Errors: 0, Skipped: 0, Time elapsed: 0.749 s - in org.apache.juneau.a.rttests.RoundTripPrimitivesBeansTest
[INFO] Running org.apache.juneau.a.rttests.RoundTripPrimitiveObjectBeansTest
[INFO] Tests run: 42, Failures: 0, Errors: 0, Skipped: 0, Time elapsed: 0.655 s - in org.apache.juneau.a.rttests.RoundTripPrimitiveObjectBeansTest
[INFO] Running org.apache.juneau.a.rttests.RoundTripToOMapsTest
[INFO] Tests run: 21, Failures: 0, Errors: 0, Skipped: 0, Time elapsed: 0.059 s - in org.apache.juneau.a.rttests.RoundTripToOMapsTest
[INFO] Running org.apache.juneau.a.rttests.RoundTripObjectsAsStringsTest
[INFO] Tests run: 63, Failures: 0, Errors: 0, Skipped: 0, Time elapsed: 0.091 s - in org.apache.juneau.a.rttests.RoundTripObjectsAsStringsTest
[INFO] Running org.apache.juneau.a.rttests.RoundTripBeanPropertiesTest
[INFO] Tests run: 84, Failures: 0, Errors: 0, Skipped: 0, Time elapsed: 0.162 s - in org.apache.juneau.a.rttests.RoundTripBeanPropertiesTest
[INFO] Running org.apache.juneau.a.rttests.RoundTripEnumTest
[INFO] Tests run: 168, Failures: 0, Errors: 0, Skipped: 0, Time elapsed: 0.17 s - in org.apache.juneau.a.rttests.RoundTripEnumTest
[INFO] Running org.apache.juneau.a.rttests.RoundTripSimpleObjectsTest
[INFO] Tests run: 1176, Failures: 0, Errors: 0, Skipped: 0, Time elapsed: 0.753 s - in org.apache.juneau.a.rttests.RoundTripSimpleObjectsTest
[INFO] Running org.apache.juneau.a.rttests.RoundTripBeanInheritanceTest
[INFO] Tests run: 42, Failures: 0, Errors: 0, Skipped: 0, Time elapsed: 0.012 s - in org.apache.juneau.a.rttests.RoundTripBeanInheritanceTest
[INFO] Running org.apache.juneau.ProxyBeanTest
[INFO] Tests run: 1, Failures: 0, Errors: 0, Skipped: 0, Time elapsed: 0.002 s - in org.apache.juneau.ProxyBeanTest
[INFO] Running org.apache.juneau.pojotools.PojoSorterTest
[INFO] Tests run: 24, Failures: 0, Errors: 0, Skipped: 0, Time elapsed: 0.012 s - in org.apache.juneau.pojotools.PojoSorterTest
[INFO] Running org.apache.juneau.pojotools.PojoViewerTest
[INFO] Tests run: 38, Failures: 0, Errors: 0, Skipped: 0, Time elapsed: 0.013 s - in org.apache.juneau.pojotools.PojoViewerTest
[INFO] Running org.apache.juneau.pojotools.PojoSearcherTest
[INFO] Tests run: 82, Failures: 0, Errors: 0, Skipped: 0, Time elapsed: 0.111 s - in org.apache.juneau.pojotools.PojoSearcherTest
[INFO] Running org.apache.juneau.OMapTest
[INFO] Tests run: 8, Failures: 0, Errors: 0, Skipped: 0, Time elapsed: 0.005 s - in org.apache.juneau.OMapTest
[INFO] Running org.apache.juneau.ValueTest
[INFO] Tests run: 3, Failures: 0, Errors: 0, Skipped: 0, Time elapsed: 0.001 s - in org.apache.juneau.ValueTest
[INFO] Running org.apache.juneau.encoders.EncoderGroupTest
[INFO] Tests run: 2, Failures: 0, Errors: 0, Skipped: 0, Time elapsed: 0.014 s - in org.apache.juneau.encoders.EncoderGroupTest
[INFO] Running org.apache.juneau.DynaBeanComboTest
[INFO] Tests run: 390, Failures: 0, Errors: 0, Skipped: 0, Time elapsed: 0.357 s - in org.apache.juneau.DynaBeanComboTest
[INFO] Running org.apache.juneau.serializer.SerializerConfigAnnotationTest
[INFO] Tests run: 6, Failures: 0, Errors: 0, Skipped: 0, Time elapsed: 0.006 s - in org.apache.juneau.serializer.SerializerConfigAnnotationTest
[INFO] Running org.apache.juneau.serializer.UriResolutionTest
[INFO] Tests run: 780, Failures: 0, Errors: 0, Skipped: 0, Time elapsed: 1.228 s - in org.apache.juneau.serializer.UriResolutionTest
[INFO] Running org.apache.juneau.serializer.SerializerGroupTest
[INFO] Tests run: 3, Failures: 0, Errors: 0, Skipped: 0, Time elapsed: 0 s - in org.apache.juneau.serializer.SerializerGroupTest
[INFO] Running org.apache.juneau.serializer.ReaderObjectComboTest
[INFO] Tests run: 189, Failures: 0, Errors: 0, Skipped: 0, Time elapsed: 0.113 s - in org.apache.juneau.serializer.ReaderObjectComboTest
[INFO] Running org.apache.juneau.ClassMetaTest
[INFO] Tests run: 7, Failures: 0, Errors: 0, Skipped: 0, Time elapsed: 0.016 s - in org.apache.juneau.ClassMetaTest
[INFO] Running org.apache.juneau.ReadWriteOnlyPropertiesTest
[INFO] Tests run: 16, Failures: 0, Errors: 0, Skipped: 0, Time elapsed: 0.045 s - in org.apache.juneau.ReadWriteOnlyPropertiesTest
[INFO] Running org.apache.juneau.BeanMapErrorsTest
[INFO] Tests run: 4, Failures: 0, Errors: 0, Skipped: 0, Time elapsed: 0.012 s - in org.apache.juneau.BeanMapErrorsTest
[INFO] Running org.apache.juneau.dto.atom.AtomTest
[INFO] Tests run: 4, Failures: 0, Errors: 0, Skipped: 0, Time elapsed: 0.097 s - in org.apache.juneau.dto.atom.AtomTest
[INFO] Running org.apache.juneau.dto.swagger.HeaderInfoTest
[INFO] Tests run: 21, Failures: 0, Errors: 0, Skipped: 0, Time elapsed: 0.035 s - in org.apache.juneau.dto.swagger.HeaderInfoTest
[INFO] Running org.apache.juneau.dto.swagger.SchemaInfoTest
[INFO] Tests run: 37, Failures: 0, Errors: 0, Skipped: 0, Time elapsed: 0.041 s - in org.apache.juneau.dto.swagger.SchemaInfoTest
[INFO] Running org.apache.juneau.dto.swagger.ParameterInfoTest
[INFO] Tests run: 26, Failures: 0, Errors: 0, Skipped: 0, Time elapsed: 0.026 s - in org.apache.juneau.dto.swagger.ParameterInfoTest
[INFO] Running org.apache.juneau.dto.swagger.XmlTest
[INFO] Tests run: 6, Failures: 0, Errors: 0, Skipped: 0, Time elapsed: 0 s - in org.apache.juneau.dto.swagger.XmlTest
[INFO] Running org.apache.juneau.dto.swagger.ContactTest
[INFO] Tests run: 4, Failures: 0, Errors: 0, Skipped: 0, Time elapsed: 0.003 s - in org.apache.juneau.dto.swagger.ContactTest
[INFO] Running org.apache.juneau.dto.swagger.SecuritySchemeTest
[INFO] Tests run: 11, Failures: 0, Errors: 0, Skipped: 0, Time elapsed: 0.005 s - in org.apache.juneau.dto.swagger.SecuritySchemeTest
[INFO] Running org.apache.juneau.dto.swagger.InfoTest
[INFO] Tests run: 7, Failures: 0, Errors: 0, Skipped: 0, Time elapsed: 0.007 s - in org.apache.juneau.dto.swagger.InfoTest
[INFO] Running org.apache.juneau.dto.swagger.OperationTest
[INFO] Tests run: 29, Failures: 0, Errors: 0, Skipped: 0, Time elapsed: 0.037 s - in org.apache.juneau.dto.swagger.OperationTest
[INFO] Running org.apache.juneau.dto.swagger.SwaggerBuilderTest
[INFO] Tests run: 31, Failures: 0, Errors: 0, Skipped: 0, Time elapsed: 0.023 s - in org.apache.juneau.dto.swagger.SwaggerBuilderTest
[INFO] Running org.apache.juneau.dto.swagger.TagTest
[INFO] Tests run: 4, Failures: 0, Errors: 0, Skipped: 0, Time elapsed: 0 s - in org.apache.juneau.dto.swagger.TagTest
[INFO] Running org.apache.juneau.dto.swagger.ItemsTest
[INFO] Tests run: 20, Failures: 0, Errors: 0, Skipped: 0, Time elapsed: 0.005 s - in org.apache.juneau.dto.swagger.ItemsTest
[INFO] Running org.apache.juneau.dto.swagger.LicenseTest
[INFO] Tests run: 3, Failures: 0, Errors: 0, Skipped: 0, Time elapsed: 0 s - in org.apache.juneau.dto.swagger.LicenseTest
[INFO] Running org.apache.juneau.dto.swagger.ExternalDocumentationTest
[INFO] Tests run: 3, Failures: 0, Errors: 0, Skipped: 0, Time elapsed: 0 s - in org.apache.juneau.dto.swagger.ExternalDocumentationTest
[INFO] Running org.apache.juneau.dto.swagger.SwaggerTest
[INFO] Tests run: 42, Failures: 0, Errors: 0, Skipped: 0, Time elapsed: 0.025 s - in org.apache.juneau.dto.swagger.SwaggerTest
[INFO] Running org.apache.juneau.dto.swagger.ResponseInfoTest
[INFO] Tests run: 11, Failures: 0, Errors: 0, Skipped: 0, Time elapsed: 0.008 s - in org.apache.juneau.dto.swagger.ResponseInfoTest
[INFO] Running org.apache.juneau.dto.html5.Html5TemplateComboTest
[INFO] Tests run: 65, Failures: 0, Errors: 0, Skipped: 0, Time elapsed: 0.837 s - in org.apache.juneau.dto.html5.Html5TemplateComboTest
[INFO] Running org.apache.juneau.dto.html5.Html5BasicTest
[INFO] Tests run: 1, Failures: 0, Errors: 0, Skipped: 0, Time elapsed: 0 s - in org.apache.juneau.dto.html5.Html5BasicTest
[INFO] Running org.apache.juneau.dto.html5.Html5ComboTest
[INFO] Tests run: 5265, Failures: 0, Errors: 0, Skipped: 0, Time elapsed: 5.445 s - in org.apache.juneau.dto.html5.Html5ComboTest
[INFO] Running org.apache.juneau.dto.jsonschema.JsonSchemaTest
[INFO] Tests run: 3, Failures: 0, Errors: 0, Skipped: 0, Time elapsed: 0.001 s - in org.apache.juneau.dto.jsonschema.JsonSchemaTest
[INFO] Running org.apache.juneau.dto.cognos.CognosXmlTest
[INFO] Tests run: 1, Failures: 0, Errors: 0, Skipped: 0, Time elapsed: 0 s - in org.apache.juneau.dto.cognos.CognosXmlTest
[INFO] Running org.apache.juneau.OListTest
[INFO] Tests run: 6, Failures: 0, Errors: 0, Skipped: 0, Time elapsed: 0.001 s - in org.apache.juneau.OListTest
[INFO] Running org.apache.juneau.reflection.ConstructorInfoTest
[INFO] Tests run: 7, Failures: 0, Errors: 0, Skipped: 0, Time elapsed: 0.001 s - in org.apache.juneau.reflection.ConstructorInfoTest
[INFO] Running org.apache.juneau.reflection.ParamInfoTest
[INFO] Tests run: 33, Failures: 0, Errors: 0, Skipped: 0, Time elapsed: 0.001 s - in org.apache.juneau.reflection.ParamInfoTest
[INFO] Running org.apache.juneau.reflection.ExecutableInfoTest
[INFO] Tests run: 53, Failures: 0, Errors: 0, Skipped: 0, Time elapsed: 0.002 s - in org.apache.juneau.reflection.ExecutableInfoTest
[INFO] Running org.apache.juneau.reflection.ClassInfoTest
[INFO] Tests run: 252, Failures: 0, Errors: 0, Skipped: 0, Time elapsed: 0.027 s - in org.apache.juneau.reflection.ClassInfoTest
[INFO] Running org.apache.juneau.reflection.AnnotationInfoTest
[INFO] Tests run: 2, Failures: 0, Errors: 0, Skipped: 0, Time elapsed: 0 s - in org.apache.juneau.reflection.AnnotationInfoTest
[INFO] Running org.apache.juneau.reflection.MethodInfoTest
[INFO] Tests run: 21, Failures: 0, Errors: 0, Skipped: 0, Time elapsed: 0.015 s - in org.apache.juneau.reflection.MethodInfoTest
[INFO] Running org.apache.juneau.reflection.FieldInfoTest
[INFO] Tests run: 28, Failures: 0, Errors: 0, Skipped: 0, Time elapsed: 0.008 s - in org.apache.juneau.reflection.FieldInfoTest
[INFO] Running org.apache.juneau.jso.JsoConfigAnnotationTest
[INFO] Tests run: 4, Failures: 0, Errors: 0, Skipped: 0, Time elapsed: 0.022 s - in org.apache.juneau.jso.JsoConfigAnnotationTest
[INFO] Running org.apache.juneau.DataConversionTest
[INFO] Tests run: 2, Failures: 0, Errors: 0, Skipped: 0, Time elapsed: 0.009 s - in org.apache.juneau.DataConversionTest
[INFO] 
[INFO] Results:
[INFO] 
[WARNING] Tests run: 23782, Failures: 0, Errors: 0, Skipped: 2
[INFO] 
[INFO] 
[INFO] --- jacoco-maven-plugin:0.8.2:report (default-report) @ juneau-core-utest ---
[INFO] Loading execution data file <https://builds.apache.org/job/Juneau-Java-1.8/ws/juneau-core/juneau-core-utest/target/jacoco.exec>
[INFO] Analyzed bundle 'juneau/core/core-utest' with 0 classes
[INFO] 
[INFO] --- maven-bundle-plugin:3.2.0:bundle (default-bundle) @ juneau-core-utest ---
[INFO] 
[INFO] --- maven-site-plugin:3.7.1:attach-descriptor (attach-descriptor) @ juneau-core-utest
---
[INFO] Skipping because packaging 'bundle' is not pom.
[INFO] 
[INFO] --- maven-jar-plugin:3.1.0:test-jar (default) @ juneau-core-utest ---
[INFO] Building jar: <https://builds.apache.org/job/Juneau-Java-1.8/ws/juneau-core/juneau-core-utest/target/juneau-core-utest-8.1.4-SNAPSHOT-tests.jar>
[INFO] 
[INFO] --- apache-rat-plugin:0.12:check (default) @ juneau-core-utest ---
[INFO] Enabled default license matchers.
[INFO] Will parse SCM ignores for exclusions...
[INFO] Parsing exclusions from <https://builds.apache.org/job/Juneau-Java-1.8/ws/juneau-core/juneau-core-utest/.gitignore>
[INFO] Finished adding exclusions from SCM ignore files.
[INFO] 64 implicit excludes (use -debug for more details).
[INFO] Exclude: **/DEPENDENCIES
[INFO] Exclude: **/target/**
[INFO] Exclude: **/empty.txt
[INFO] Exclude: **/TODO.txt
[INFO] Exclude: **/.settings/**
[INFO] Exclude: **/.project
[INFO] Exclude: **/.classpath
[INFO] Exclude: **/*.launch
[INFO] Exclude: **/*.prefs
[INFO] Exclude: **/*.2
[INFO] Exclude: **/jetty.out.xml
[INFO] Exclude: **/derby.log
[INFO] Exclude: **/dependency-reduced-pom.xml
[INFO] Exclude: **/docs.txt
[INFO] Exclude: **/toc.txt
[INFO] Exclude: **/app.json
[INFO] Exclude: **/Procfile
[INFO] 310 resources included (use -debug for more details)
[INFO] Rat check: Summary over all files. Unapproved: 1, unknown: 1, generated: 0, approved:
309 licenses.
[INFO] Enabled default license matchers.
[INFO] Will parse SCM ignores for exclusions...
[INFO] Parsing exclusions from <https://builds.apache.org/job/Juneau-Java-1.8/ws/juneau-core/juneau-core-utest/.gitignore>
[INFO] Finished adding exclusions from SCM ignore files.
[INFO] 64 implicit excludes (use -debug for more details).
[INFO] Exclude: **/DEPENDENCIES
[INFO] Exclude: **/target/**
[INFO] Exclude: **/empty.txt
[INFO] Exclude: **/TODO.txt
[INFO] Exclude: **/.settings/**
[INFO] Exclude: **/.project
[INFO] Exclude: **/.classpath
[INFO] Exclude: **/*.launch
[INFO] Exclude: **/*.prefs
[INFO] Exclude: **/*.2
[INFO] Exclude: **/jetty.out.xml
[INFO] Exclude: **/derby.log
[INFO] Exclude: **/dependency-reduced-pom.xml
[INFO] Exclude: **/docs.txt
[INFO] Exclude: **/toc.txt
[INFO] Exclude: **/app.json
[INFO] Exclude: **/Procfile
[INFO] 310 resources included (use -debug for more details)
[WARNING] Files with unapproved licenses:
  <https://builds.apache.org/job/Juneau-Java-1.8/ws/juneau-core/juneau-core-utest/config/Y.cfg>
[INFO]                                                                         
[INFO] ------------------------------------------------------------------------
[INFO] Skipping juneau
[INFO] This project has been banned from the build due to previous failures.
[INFO] ------------------------------------------------------------------------
[INFO] ------------------------------------------------------------------------
[INFO] Reactor Summary:
[INFO] 
[INFO] juneau ............................................. SUCCESS [  7.874 s]
[INFO] juneau/core ........................................ SUCCESS [  2.657 s]
[INFO] juneau/core/marshall ............................... SUCCESS [01:18 min]
[INFO] juneau/core/marshall-rdf ........................... SUCCESS [ 10.436 s]
[INFO] juneau/core/dto .................................... SUCCESS [ 15.094 s]
[INFO] juneau/core/config ................................. SUCCESS [  9.827 s]
[INFO] juneau/core/core-utest ............................. FAILURE [ 55.247 s]
[INFO] juneau/rest ........................................ SKIPPED
[INFO] juneau/rest/rest-server ............................ SKIPPED
[INFO] juneau/rest/rest-server-jaxrs ...................... SKIPPED
[INFO] juneau/rest/rest-server-rdf ........................ SKIPPED
[INFO] juneau/rest/rest-server-springboot ................. SKIPPED
[INFO] juneau/rest/rest-client ............................ SKIPPED
[INFO] juneau/rest/rest-mock .............................. SKIPPED
[INFO] juneau/rest/rest-mock-utest ........................ SKIPPED
[INFO] juneau/rest/rest-server-utest ...................... SKIPPED
[INFO] juneau/rest/rest-client-utest ...................... SKIPPED
[INFO] juneau/microservice ................................ SKIPPED
[INFO] juneau/microservice/microservice-core .............. SKIPPED
[INFO] juneau/microservice/microservice-jetty ............. SKIPPED
[INFO] juneau/microservice/my-jetty-microservice .......... SKIPPED
[INFO] juneau/examples .................................... SKIPPED
[INFO] juneau/examples/rest ............................... SKIPPED
[INFO] juneau/microservice/microservice-ftest ............. SKIPPED
[INFO] juneau/microservice/my-springboot-microservice ..... SKIPPED
[INFO] juneau/sc .......................................... SKIPPED
[INFO] juneau/sc/sc-server ................................ SKIPPED
[INFO] juneau/sc/sc-client ................................ SKIPPED
[INFO] juneau/examples/examples-core ...................... SKIPPED
[INFO] juneau/examples/examples-rest-jetty ................ SKIPPED
[INFO] juneau/examples/examples-rest-springboot ........... SKIPPED
[INFO] juneau/examples/examples-rest-jetty-ftest .......... SKIPPED
[INFO] juneau/doc ......................................... SKIPPED
[INFO] juneau/releng ...................................... SKIPPED
[INFO] juneau/releng/all .................................. SKIPPED
[INFO] juneau/releng/distrib .............................. SKIPPED
[INFO] ------------------------------------------------------------------------
[INFO] BUILD FAILURE
[INFO] ------------------------------------------------------------------------
[INFO] Total time: 03:01 min
[INFO] Finished at: 2020-05-25T23:12:13+00:00
[INFO] Final Memory: 89M/3401M
[INFO] ------------------------------------------------------------------------
[ERROR] Failed to execute goal org.apache.rat:apache-rat-plugin:0.12:check (default) on project
juneau-core-utest: Too many files with unapproved license: 1 See RAT report in: <https://builds.apache.org/job/Juneau-Java-1.8/ws/juneau-core/juneau-core-utest/target/rat.txt>
-> [Help 1]
[ERROR] 
[ERROR] To see the full stack trace of the errors, re-run Maven with the -e switch.
[ERROR] Re-run Maven using the -X switch to enable full debug logging.
[ERROR] 
[ERROR] For more information about the errors and possible solutions, please read the following
articles:
[ERROR] [Help 1] http://cwiki.apache.org/confluence/display/MAVEN/MojoFailureException
[ERROR] 
[ERROR] After correcting the problems, you can resume the build with the command
[ERROR]   mvn <goals> -rf :juneau-core-utest
Build step 'Invoke top-level Maven targets' marked build as failure
Recording test results
[TASKS] Skipping publisher since build result is FAILURE

Mime
View raw message